{
  "projects": [
    {
      "name": "example-websrv",
      "url": "https://gitlab.com/era-platform/samples/example-websrv.git",
      "gitref": "master",
      "container": "erlang:24",
      "build_cmd": "make",
      "copy": [
        {"action": "shell", "cmd": [
          "for s in {name}/_build/default/lib/* {name}/_build/default/checkouts/*; do",
          "  for d in ebin priv; do",
          "    f=$s/$d",
          "    app=$(basename $(dirname $f));",
          "    dst={dist}/dist/websrv/$app;",
          "    mkdir -p $dst;",
          "    if [ -L $f ]; then",
          "      if [ -e $f ]; then",
          "       echo cp -rp $f/ $dst/$d;",
          "       cp -rp $f/ $dst/$d;",
          "      fi;",
          "    else",
          "      if [ -e $f ]; then",
          "        echo cp -rp $f $dst/;",
          "        cp -rp $f $dst/;",
          "      fi; fi; done; done"]}
      ]
    },
    {
      "name": "InceptionNotes",
      "url": "https://github.com/Queatz/InceptionNotes.git",
      "gitref": "master",
      "container": "node:14",
      "build_cmd": [
        "NG_CLI_ANALYTICS=off npm install -g @angular/cli",
        "NG_CLI_ANALYTICS=off npm install",
        "NG_CLI_ANALYTICS=off ng build --output-path dist/ --prod --aot"],
      "copy": [
        {"action": "shell", "cmd": [
          "mkdir -p {dist}/www &&",
          "cp -rp {name}/dist/* {dist}/www/"]}
      ]
    }
  ],
  "output": {
    "type": "docker-image",
    "name": "era/simple-todos:0.1.0"
  }
}
