{
  "microservices": [
    {
      "name": "ws",
      "start_point": ["ws", "start", []],
      /*"update_point": ["ws", "update", []],*/
      "params": {
      },
      "os_cmd_params": "ulimit -n 10240",
      "erl_cmd_params": "+e 12345"
    }
  ]
}