{
  "project_info": {
    "project_number": "949089797986",
    "project_id": "phonemia-e1475",
    "storage_bucket": "phonemia-e1475.appspot.com"
  },
  "client": [
    {
      "client_info": {
        "mobilesdk_app_id": "1:949089797986:android:f23892ab87749c16000e3b",
        "android_client_info": {
          "package_name": "com.softkru.phonemia"
        }
      },
      "oauth_client": [
        {
          "client_id": "949089797986-lh3o9b45m175f5mmn3ln9jq70boet335.apps.googleusercontent.com",
          "client_type": 3
        }
      ],
      "api_key": [
        {
          "current_key": "AIzaSyD67kUwsJ4q__B_oxgmuw7onmRXmqG657s"
        }
      ],
      "services": {
        "appinvite_service": {
          "other_platform_oauth_client": [
            {
              "client_id": "949089797986-lh3o9b45m175f5mmn3ln9jq70boet335.apps.googleusercontent.com",
              "client_type": 3
            }
          ]
        }
      }
    }
  ],
  "configuration_version": "1"
}