-- Merging decision tree log ---
manifest
ADDED from /Users/aftab/Desktop/phonemia/android/app/src/main/AndroidManifest.xml:1:1-43:12
INJECTED from /Users/aftab/Desktop/phonemia/android/app/src/main/AndroidManifest.xml:1:1-43:12
INJECTED from /Users/aftab/Desktop/phonemia/android/app/src/main/AndroidManifest.xml:1:1-43:12
INJECTED from /Users/aftab/Desktop/phonemia/android/app/src/main/AndroidManifest.xml:1:1-43:12
MERGED from /Users/aftab/Desktop/phonemia/android/app/src/main/AndroidManifest.xml:1:1-43:12
MERGED from [:firebase_auth] /Users/aftab/Desktop/phonemia/build/firebase_auth/intermediates/library_manifest/debug/AndroidManifest.xml:2:1-15:12
MERGED from [:firebase_storage] /Users/aftab/Desktop/phonemia/build/firebase_storage/intermediates/library_manifest/debug/AndroidManifest.xml:2:1-15:12
MERGED from [:cloud_firestore] /Users/aftab/Desktop/phonemia/build/cloud_firestore/intermediates/library_manifest/debug/AndroidManifest.xml:2:1-15:12
MERGED from [:firebase_core] /Users/aftab/Desktop/phonemia/build/firebase_core/intermediates/library_manifest/debug/AndroidManifest.xml:2:1-15:12
MERGED from [:audioplayers] /Users/aftab/Desktop/phonemia/build/audioplayers/intermediates/library_manifest/debug/AndroidManifest.xml:2:1-9:12
MERGED from [:file_picker] /Users/aftab/Desktop/phonemia/build/file_picker/intermediates/library_manifest/debug/AndroidManifest.xml:2:1-17:12
MERGED from [:flutter_plugin_android_lifecycle] /Users/aftab/Desktop/phonemia/build/flutter_plugin_android_lifecycle/intermediates/library_manifest/debug/AndroidManifest.xml:2:1-7:12
MERGED from [:modal_progress_hud_nsn] /Users/aftab/Desktop/phonemia/build/modal_progress_hud_nsn/intermediates/library_manifest/debug/AndroidManifest.xml:2:1-7:12
MERGED from [:hexcolor] /Users/aftab/Desktop/phonemia/build/hexcolor/intermediates/library_manifest/debug/AndroidManifest.xml:2:1-7:12
MERGED from [:path_provider_android] /Users/aftab/Desktop/phonemia/build/path_provider_android/intermediates/library_manifest/debug/AndroidManifest.xml:2:1-7:12
MERGED from [com.google.firebase:firebase-auth:21.0.1] /Users/aftab/.gradle/caches/transforms-2/files-2.1/499d23dc3ef10de152fc54312b4b7237/jetified-firebase-auth-21.0.1/AndroidManifest.xml:17:1-83:12
MERGED from [com.google.firebase:firebase-firestore:24.0.0] /Users/aftab/.gradle/caches/transforms-2/files-2.1/f21a76f24437b73ad1f45e532dc64453/jetified-firebase-firestore-24.0.0/AndroidManifest.xml:2:1-26:12
MERGED from [com.google.firebase:firebase-storage:20.0.0] /Users/aftab/.gradle/caches/transforms-2/files-2.1/400f0e5c52d1bf847c9a139cafefd0a5/jetified-firebase-storage-20.0.0/AndroidManifest.xml:15:1-39:12
MERGED from [com.google.firebase:firebase-auth-interop:20.0.0] /Users/aftab/.gradle/caches/transforms-2/files-2.1/fcd5a4347f909a5b949bf5c2a8436ae6/jetified-firebase-auth-interop-20.0.0/AndroidManifest.xml:2:1-10:12
MERGED from [com.google.firebase:firebase-appcheck-interop:16.0.0-beta02] /Users/aftab/.gradle/caches/transforms-2/files-2.1/a6b9eca413184bc439ddc028ac7bb066/jetified-firebase-appcheck-interop-16.0.0-beta02/AndroidManifest.xml:15:1-26:12
MERGED from [com.google.firebase:firebase-common:20.0.0] /Users/aftab/.gradle/caches/transforms-2/files-2.1/d5eb73e07577dc9aed23faaa7798a90b/jetified-firebase-common-20.0.0/AndroidManifest.xml:15:1-40:12
MERGED from [androidx.core:core-ktx:1.6.0] /Users/aftab/.gradle/caches/transforms-2/files-2.1/3289edb773d78dc7ff6a96abb8b89d3e/jetified-core-ktx-1.6.0/AndroidManifest.xml:2:1-9:12
MERGED from [com.google.android.gms:play-services-auth-api-phone:17.4.0] /Users/aftab/.gradle/caches/transforms-2/files-2.1/10341c3dada6a64173ab8ba0e2875359/jetified-play-services-auth-api-phone-17.4.0/AndroidManifest.xml:2:1-7:12
MERGED from [com.google.android.gms:play-services-safetynet:17.0.0] /Users/aftab/.gradle/caches/transforms-2/files-2.1/4a06b8ba24f95992f24e150b2fd44f24/jetified-play-services-safetynet-17.0.0/AndroidManifest.xml:17:1-24:12
MERGED from [com.google.firebase:firebase-database-collection:18.0.0] /Users/aftab/.gradle/caches/transforms-2/files-2.1/7d53a3304511bc262a0baa4d0f9ace20/jetified-firebase-database-collection-18.0.0/AndroidManifest.xml:2:1-9:12
MERGED from [com.google.android.gms:play-services-base:17.1.0] /Users/aftab/.gradle/caches/transforms-2/files-2.1/e91c76fa5178367a03077f75662eefda/jetified-play-services-base-17.1.0/AndroidManifest.xml:17:1-29:12
MERGED from [com.google.android.gms:play-services-tasks:17.0.0] /Users/aftab/.gradle/caches/transforms-2/files-2.1/6e0270c271b4d0626fc1d5af7c053a48/jetified-play-services-tasks-17.0.0/AndroidManifest.xml:2:1-9:12
MERGED from [com.google.android.gms:play-services-basement:17.1.0] /Users/aftab/.gradle/caches/transforms-2/files-2.1/6c6a30651b973815be9d778b61d96729/jetified-play-services-basement-17.1.0/AndroidManifest.xml:17:1-28:12
MERGED from [androidx.fragment:fragment:1.1.0] /Users/aftab/.gradle/caches/transforms-2/files-2.1/98a49955fe2e800b4212fd20c89c1e79/fragment-1.1.0/AndroidManifest.xml:17:1-24:12
MERGED from [androidx.browser:browser:1.0.0] /Users/aftab/.gradle/caches/transforms-2/files-2.1/69988b0ba4ad67cd7bd0be9a74569371/browser-1.0.0/AndroidManifest.xml:17:1-22:12
MERGED from [androidx.legacy:legacy-support-core-ui:1.0.0] /Users/aftab/.gradle/caches/transforms-2/files-2.1/ab88f086a787e8a46498650f591324ae/legacy-support-core-ui-1.0.0/AndroidManifest.xml:17:1-22:12
MERGED from [androidx.viewpager:viewpager:1.0.0] /Users/aftab/.gradle/caches/transforms-2/files-2.1/3ac92ec95491e4ec74e40ab915badcfe/viewpager-1.0.0/AndroidManifest.xml:17:1-22:12
MERGED from [androidx.legacy:legacy-support-core-utils:1.0.0] /Users/aftab/.gradle/caches/transforms-2/files-2.1/a87153039073d5f1c678d321fc8d2f26/legacy-support-core-utils-1.0.0/AndroidManifest.xml:17:1-22:12
MERGED from [androidx.loader:loader:1.0.0] /Users/aftab/.gradle/caches/transforms-2/files-2.1/0f8c5c5a3838117b93ac8e4b4262126d/loader-1.0.0/AndroidManifest.xml:17:1-22:12
MERGED from [androidx.activity:activity:1.0.0] /Users/aftab/.gradle/caches/transforms-2/files-2.1/7e5511f100b0deb39c03b1719c7c7ff5/jetified-activity-1.0.0/AndroidManifest.xml:17:1-24:12
MERGED from [androidx.coordinatorlayout:coordinatorlayout:1.0.0] /Users/aftab/.gradle/caches/transforms-2/files-2.1/afa3a3c17e064ef98edaa04af2021336/coordinatorlayout-1.0.0/AndroidManifest.xml:17:1-22:12
MERGED from [androidx.drawerlayout:drawerlayout:1.0.0] /Users/aftab/.gradle/caches/transforms-2/files-2.1/b3be0c5afdb7bf8597023a14f67e6177/drawerlayout-1.0.0/AndroidManifest.xml:17:1-22:12
MERGED from [androidx.slidingpanelayout:slidingpanelayout:1.0.0] /Users/aftab/.gradle/caches/transforms-2/files-2.1/bec37db405bf1baafbc779f08ae2480b/slidingpanelayout-1.0.0/AndroidManifest.xml:17:1-22:12
MERGED from [androidx.customview:customview:1.0.0] /Users/aftab/.gradle/caches/transforms-2/files-2.1/996342e5f3990ba104a02a72a65cc863/customview-1.0.0/AndroidManifest.xml:17:1-22:12
MERGED from [androidx.swiperefreshlayout:swiperefreshlayout:1.0.0] /Users/aftab/.gradle/caches/transforms-2/files-2.1/3f8d1d7657147a8f132b1d78e092e3fc/swiperefreshlayout-1.0.0/AndroidManifest.xml:17:1-22:12
MERGED from [androidx.asynclayoutinflater:asynclayoutinflater:1.0.0] /Users/aftab/.gradle/caches/transforms-2/files-2.1/2e4cd76b714623e775a2b4d5372ec029/asynclayoutinflater-1.0.0/AndroidManifest.xml:17:1-22:12
MERGED from [androidx.core:core:1.6.0] /Users/aftab/.gradle/caches/transforms-2/files-2.1/8a7f6825b2c857263502d908e7ce1fa5/core-1.6.0/AndroidManifest.xml:17:1-26:12
MERGED from [androidx.lifecycle:lifecycle-runtime:2.2.0] /Users/aftab/.gradle/caches/transforms-2/files-2.1/b822b579312da6bf9ca406d9da5e5190/lifecycle-runtime-2.2.0/AndroidManifest.xml:17:1-24:12
MERGED from [androidx.savedstate:savedstate:1.0.0] /Users/aftab/.gradle/caches/transforms-2/files-2.1/2db620fae6f8c6fe61f9425d99936c1b/jetified-savedstate-1.0.0/AndroidManifest.xml:17:1-24:12
MERGED from [androidx.lifecycle:lifecycle-livedata:2.0.0] /Users/aftab/.gradle/caches/transforms-2/files-2.1/2a522df79fe054d3c4be2fcf4372d418/lifecycle-livedata-2.0.0/AndroidManifest.xml:17:1-22:12
MERGED from [androidx.lifecycle:lifecycle-livedata-core:2.0.0] /Users/aftab/.gradle/caches/transforms-2/files-2.1/12aac63b6e75d4572a201e5f50229ce0/lifecycle-livedata-core-2.0.0/AndroidManifest.xml:17:1-22:12
MERGED from [androidx.localbroadcastmanager:localbroadcastmanager:1.0.0] /Users/aftab/.gradle/caches/transforms-2/files-2.1/037ee24b5b3f538a95ddcfdfa92577c1/localbroadcastmanager-1.0.0/AndroidManifest.xml:17:1-22:12
MERGED from [com.google.firebase:firebase-components:17.0.0] /Users/aftab/.gradle/caches/transforms-2/files-2.1/d91cfa0932403332b5f5a09c6ab43870/jetified-firebase-components-17.0.0/AndroidManifest.xml:15:1-23:12
MERGED from [androidx.arch.core:core-runtime:2.0.0] /Users/aftab/.gradle/caches/transforms-2/files-2.1/db4344b748ef3399b2e640f6a9f82267/core-runtime-2.0.0/AndroidManifest.xml:17:1-22:12
MERGED from [androidx.versionedparcelable:versionedparcelable:1.1.1] /Users/aftab/.gradle/caches/transforms-2/files-2.1/e6fc4bef2cc53eb5eff5c3f556452965/versionedparcelable-1.1.1/AndroidManifest.xml:17:1-27:12
MERGED from [androidx.interpolator:interpolator:1.0.0] /Users/aftab/.gradle/caches/transforms-2/files-2.1/fd13a86db37d35aeac1515c8c8123ad9/interpolator-1.0.0/AndroidManifest.xml:17:1-22:12
MERGED from [androidx.lifecycle:lifecycle-viewmodel:2.1.0] /Users/aftab/.gradle/caches/transforms-2/files-2.1/c2fbe90178aaf86cbb6a8a4bcecca280/lifecycle-viewmodel-2.1.0/AndroidManifest.xml:17:1-22:12
MERGED from [androidx.cursoradapter:cursoradapter:1.0.0] /Users/aftab/.gradle/caches/transforms-2/files-2.1/bfb31a760d71ec0e96ce43c9c3ca83d3/cursoradapter-1.0.0/AndroidManifest.xml:17:1-22:12
MERGED from [androidx.documentfile:documentfile:1.0.0] /Users/aftab/.gradle/caches/transforms-2/files-2.1/4f61f21a55fda513d5ca90fce5a3cf68/documentfile-1.0.0/AndroidManifest.xml:17:1-22:12
MERGED from [androidx.print:print:1.0.0] /Users/aftab/.gradle/caches/transforms-2/files-2.1/1df5b336215a60349673ca13fd66a64b/print-1.0.0/AndroidManifest.xml:17:1-22:12
MERGED from [io.grpc:grpc-android:1.41.0] /Users/aftab/.gradle/caches/transforms-2/files-2.1/9677a0cc0e8847fae54c245994ab2761/jetified-grpc-android-1.41.0/AndroidManifest.xml:2:1-13:12
MERGED from [com.google.firebase:protolite-well-known-types:18.0.0] /Users/aftab/.gradle/caches/transforms-2/files-2.1/2acfd1913c576371e40b17dde6b70445/jetified-protolite-well-known-types-18.0.0/AndroidManifest.xml:2:1-11:12
MERGED from [androidx.annotation:annotation-experimental:1.1.0] /Users/aftab/.gradle/caches/transforms-2/files-2.1/d399316d96a9364b1593cafb882c2969/jetified-annotation-experimental-1.1.0/AndroidManifest.xml:17:1-24:12
INJECTED from /Users/aftab/Desktop/phonemia/android/app/src/debug/AndroidManifest.xml:1:1-7:12
INJECTED from /Users/aftab/Desktop/phonemia/android/app/src/debug/AndroidManifest.xml:1:1-7:12
INJECTED from /Users/aftab/Desktop/phonemia/android/app/src/debug/AndroidManifest.xml:1:1-7:12
	package
		ADDED from /Users/aftab/Desktop/phonemia/android/app/src/main/AndroidManifest.xml:2:5-35
		INJECTED from /Users/aftab/Desktop/phonemia/android/app/src/main/AndroidManifest.xml
		INJECTED from /Users/aftab/Desktop/phonemia/android/app/src/debug/AndroidManifest.xml
	android:versionName
		INJECTED from /Users/aftab/Desktop/phonemia/android/app/src/main/AndroidManifest.xml
		ADDED from /Users/aftab/Desktop/phonemia/android/app/src/main/AndroidManifest.xml:1:1-43:12
		INJECTED from /Users/aftab/Desktop/phonemia/android/app/src/debug/AndroidManifest.xml
	android:versionCode
		INJECTED from /Users/aftab/Desktop/phonemia/android/app/src/main/AndroidManifest.xml
		ADDED from /Users/aftab/Desktop/phonemia/android/app/src/main/AndroidManifest.xml:1:1-43:12
		INJECTED from /Users/aftab/Desktop/phonemia/android/app/src/debug/AndroidManifest.xml
	xmlns:android
		ADDED from /Users/aftab/Desktop/phonemia/android/app/src/main/AndroidManifest.xml:1:11-69
application
ADDED from /Users/aftab/Desktop/phonemia/android/app/src/main/AndroidManifest.xml:4:4-42:19
MERGED from [:firebase_auth] /Users/aftab/Desktop/phonemia/build/firebase_auth/intermediates/library_manifest/debug/AndroidManifest.xml:7:5-13:19
MERGED from [:firebase_auth] /Users/aftab/Desktop/phonemia/build/firebase_auth/intermediates/library_manifest/debug/AndroidManifest.xml:7:5-13:19
MERGED from [:firebase_storage] /Users/aftab/Desktop/phonemia/build/firebase_storage/intermediates/library_manifest/debug/AndroidManifest.xml:7:5-13:19
MERGED from [:firebase_storage] /Users/aftab/Desktop/phonemia/build/firebase_storage/intermediates/library_manifest/debug/AndroidManifest.xml:7:5-13:19
MERGED from [:cloud_firestore] /Users/aftab/Desktop/phonemia/build/cloud_firestore/intermediates/library_manifest/debug/AndroidManifest.xml:7:5-13:19
MERGED from [:cloud_firestore] /Users/aftab/Desktop/phonemia/build/cloud_firestore/intermediates/library_manifest/debug/AndroidManifest.xml:7:5-13:19
MERGED from [:firebase_core] /Users/aftab/Desktop/phonemia/build/firebase_core/intermediates/library_manifest/debug/AndroidManifest.xml:7:5-13:19
MERGED from [:firebase_core] /Users/aftab/Desktop/phonemia/build/firebase_core/intermediates/library_manifest/debug/AndroidManifest.xml:7:5-13:19
MERGED from [com.google.firebase:firebase-auth:21.0.1] /Users/aftab/.gradle/caches/transforms-2/files-2.1/499d23dc3ef10de152fc54312b4b7237/jetified-firebase-auth-21.0.1/AndroidManifest.xml:26:5-81:19
MERGED from [com.google.firebase:firebase-auth:21.0.1] /Users/aftab/.gradle/caches/transforms-2/files-2.1/499d23dc3ef10de152fc54312b4b7237/jetified-firebase-auth-21.0.1/AndroidManifest.xml:26:5-81:19
MERGED from [com.google.firebase:firebase-firestore:24.0.0] /Users/aftab/.gradle/caches/transforms-2/files-2.1/f21a76f24437b73ad1f45e532dc64453/jetified-firebase-firestore-24.0.0/AndroidManifest.xml:16:5-24:19
MERGED from [com.google.firebase:firebase-firestore:24.0.0] /Users/aftab/.gradle/caches/transforms-2/files-2.1/f21a76f24437b73ad1f45e532dc64453/jetified-firebase-firestore-24.0.0/AndroidManifest.xml:16:5-24:19
MERGED from [com.google.firebase:firebase-storage:20.0.0] /Users/aftab/.gradle/caches/transforms-2/files-2.1/400f0e5c52d1bf847c9a139cafefd0a5/jetified-firebase-storage-20.0.0/AndroidManifest.xml:29:5-37:19
MERGED from [com.google.firebase:firebase-storage:20.0.0] /Users/aftab/.gradle/caches/transforms-2/files-2.1/400f0e5c52d1bf847c9a139cafefd0a5/jetified-firebase-storage-20.0.0/AndroidManifest.xml:29:5-37:19
MERGED from [com.google.firebase:firebase-auth-interop:20.0.0] /Users/aftab/.gradle/caches/transforms-2/files-2.1/fcd5a4347f909a5b949bf5c2a8436ae6/jetified-firebase-auth-interop-20.0.0/AndroidManifest.xml:7:5-8:19
MERGED from [com.google.firebase:firebase-auth-interop:20.0.0] /Users/aftab/.gradle/caches/transforms-2/files-2.1/fcd5a4347f909a5b949bf5c2a8436ae6/jetified-firebase-auth-interop-20.0.0/AndroidManifest.xml:7:5-8:19
MERGED from [com.google.firebase:firebase-appcheck-interop:16.0.0-beta02] /Users/aftab/.gradle/caches/transforms-2/files-2.1/a6b9eca413184bc439ddc028ac7bb066/jetified-firebase-appcheck-interop-16.0.0-beta02/AndroidManifest.xml:24:5-20
MERGED from [com.google.firebase:firebase-appcheck-interop:16.0.0-beta02] /Users/aftab/.gradle/caches/transforms-2/files-2.1/a6b9eca413184bc439ddc028ac7bb066/jetified-firebase-appcheck-interop-16.0.0-beta02/AndroidManifest.xml:24:5-20
MERGED from [com.google.firebase:firebase-common:20.0.0] /Users/aftab/.gradle/caches/transforms-2/files-2.1/d5eb73e07577dc9aed23faaa7798a90b/jetified-firebase-common-20.0.0/AndroidManifest.xml:25:5-38:19
MERGED from [com.google.firebase:firebase-common:20.0.0] /Users/aftab/.gradle/caches/transforms-2/files-2.1/d5eb73e07577dc9aed23faaa7798a90b/jetified-firebase-common-20.0.0/AndroidManifest.xml:25:5-38:19
MERGED from [com.google.android.gms:play-services-safetynet:17.0.0] /Users/aftab/.gradle/caches/transforms-2/files-2.1/4a06b8ba24f95992f24e150b2fd44f24/jetified-play-services-safetynet-17.0.0/AndroidManifest.xml:22:5-20
MERGED from [com.google.android.gms:play-services-safetynet:17.0.0] /Users/aftab/.gradle/caches/transforms-2/files-2.1/4a06b8ba24f95992f24e150b2fd44f24/jetified-play-services-safetynet-17.0.0/AndroidManifest.xml:22:5-20
MERGED from [com.google.android.gms:play-services-base:17.1.0] /Users/aftab/.gradle/caches/transforms-2/files-2.1/e91c76fa5178367a03077f75662eefda/jetified-play-services-base-17.1.0/AndroidManifest.xml:22:5-27:19
MERGED from [com.google.android.gms:play-services-base:17.1.0] /Users/aftab/.gradle/caches/transforms-2/files-2.1/e91c76fa5178367a03077f75662eefda/jetified-play-services-base-17.1.0/AndroidManifest.xml:22:5-27:19
MERGED from [com.google.android.gms:play-services-tasks:17.0.0] /Users/aftab/.gradle/caches/transforms-2/files-2.1/6e0270c271b4d0626fc1d5af7c053a48/jetified-play-services-tasks-17.0.0/AndroidManifest.xml:7:5-20
MERGED from [com.google.android.gms:play-services-tasks:17.0.0] /Users/aftab/.gradle/caches/transforms-2/files-2.1/6e0270c271b4d0626fc1d5af7c053a48/jetified-play-services-tasks-17.0.0/AndroidManifest.xml:7:5-20
MERGED from [com.google.android.gms:play-services-basement:17.1.0] /Users/aftab/.gradle/caches/transforms-2/files-2.1/6c6a30651b973815be9d778b61d96729/jetified-play-services-basement-17.1.0/AndroidManifest.xml:22:5-26:19
MERGED from [com.google.android.gms:play-services-basement:17.1.0] /Users/aftab/.gradle/caches/transforms-2/files-2.1/6c6a30651b973815be9d778b61d96729/jetified-play-services-basement-17.1.0/AndroidManifest.xml:22:5-26:19
MERGED from [androidx.core:core:1.6.0] /Users/aftab/.gradle/caches/transforms-2/files-2.1/8a7f6825b2c857263502d908e7ce1fa5/core-1.6.0/AndroidManifest.xml:24:5-89
MERGED from [androidx.core:core:1.6.0] /Users/aftab/.gradle/caches/transforms-2/files-2.1/8a7f6825b2c857263502d908e7ce1fa5/core-1.6.0/AndroidManifest.xml:24:5-89
MERGED from [androidx.versionedparcelable:versionedparcelable:1.1.1] /Users/aftab/.gradle/caches/transforms-2/files-2.1/e6fc4bef2cc53eb5eff5c3f556452965/versionedparcelable-1.1.1/AndroidManifest.xml:24:5-25:19
MERGED from [androidx.versionedparcelable:versionedparcelable:1.1.1] /Users/aftab/.gradle/caches/transforms-2/files-2.1/e6fc4bef2cc53eb5eff5c3f556452965/versionedparcelable-1.1.1/AndroidManifest.xml:24:5-25:19
	android:appComponentFactory
		ADDED from [androidx.core:core:1.6.0] /Users/aftab/.gradle/caches/transforms-2/files-2.1/8a7f6825b2c857263502d908e7ce1fa5/core-1.6.0/AndroidManifest.xml:24:18-86
	android:label
		ADDED from /Users/aftab/Desktop/phonemia/android/app/src/main/AndroidManifest.xml:5:9-33
	android:icon
		ADDED from /Users/aftab/Desktop/phonemia/android/app/src/main/AndroidManifest.xml:6:9-43
activity#com.softkru.phonemia.MainActivity
ADDED from /Users/aftab/Desktop/phonemia/android/app/src/main/AndroidManifest.xml:7:9-35:20
	android:launchMode
		ADDED from /Users/aftab/Desktop/phonemia/android/app/src/main/AndroidManifest.xml:9:13-43
	android:hardwareAccelerated
		ADDED from /Users/aftab/Desktop/phonemia/android/app/src/main/AndroidManifest.xml:12:13-47
	android:windowSoftInputMode
		ADDED from /Users/aftab/Desktop/phonemia/android/app/src/main/AndroidManifest.xml:13:13-55
	android:configChanges
		ADDED from /Users/aftab/Desktop/phonemia/android/app/src/main/AndroidManifest.xml:11:13-163
	android:theme
		ADDED from /Users/aftab/Desktop/phonemia/android/app/src/main/AndroidManifest.xml:10:13-47
	android:name
		ADDED from /Users/aftab/Desktop/phonemia/android/app/src/main/AndroidManifest.xml:8:13-41
meta-data#io.flutter.embedding.android.NormalTheme
ADDED from /Users/aftab/Desktop/phonemia/android/app/src/main/AndroidManifest.xml:18:13-21:17
	android:resource
		ADDED from /Users/aftab/Desktop/phonemia/android/app/src/main/AndroidManifest.xml:20:15-52
	android:name
		ADDED from /Users/aftab/Desktop/phonemia/android/app/src/main/AndroidManifest.xml:19:15-70
meta-data#io.flutter.embedding.android.SplashScreenDrawable
ADDED from /Users/aftab/Desktop/phonemia/android/app/src/main/AndroidManifest.xml:27:13-30:17
	android:resource
		ADDED from /Users/aftab/Desktop/phonemia/android/app/src/main/AndroidManifest.xml:29:15-61
	android:name
		ADDED from /Users/aftab/Desktop/phonemia/android/app/src/main/AndroidManifest.xml:28:15-79
intent-filter#action:name:android.intent.action.MAIN+category:name:android.intent.category.LAUNCHER
ADDED from /Users/aftab/Desktop/phonemia/android/app/src/main/AndroidManifest.xml:31:13-34:29
action#android.intent.action.MAIN
ADDED from /Users/aftab/Desktop/phonemia/android/app/src/main/AndroidManifest.xml:32:17-68
	android:name
		ADDED from /Users/aftab/Desktop/phonemia/android/app/src/main/AndroidManifest.xml:32:25-66
category#android.intent.category.LAUNCHER
ADDED from /Users/aftab/Desktop/phonemia/android/app/src/main/AndroidManifest.xml:33:17-76
	android:name
		ADDED from /Users/aftab/Desktop/phonemia/android/app/src/main/AndroidManifest.xml:33:27-74
meta-data#flutterEmbedding
ADDED from /Users/aftab/Desktop/phonemia/android/app/src/main/AndroidManifest.xml:39:9-41:33
	android:value
		ADDED from /Users/aftab/Desktop/phonemia/android/app/src/main/AndroidManifest.xml:41:13-30
	android:name
		ADDED from /Users/aftab/Desktop/phonemia/android/app/src/main/AndroidManifest.xml:40:13-44
uses-sdk
INJECTED from /Users/aftab/Desktop/phonemia/android/app/src/main/AndroidManifest.xml reason: use-sdk injection requested
INJECTED from /Users/aftab/Desktop/phonemia/android/app/src/main/AndroidManifest.xml
INJECTED from /Users/aftab/Desktop/phonemia/android/app/src/main/AndroidManifest.xml
MERGED from [:firebase_auth] /Users/aftab/Desktop/phonemia/build/firebase_auth/intermediates/library_manifest/debug/AndroidManifest.xml:5:5-44
MERGED from [:firebase_auth] /Users/aftab/Desktop/phonemia/build/firebase_auth/intermediates/library_manifest/debug/AndroidManifest.xml:5:5-44
MERGED from [:firebase_storage] /Users/aftab/Desktop/phonemia/build/firebase_storage/intermediates/library_manifest/debug/AndroidManifest.xml:5:5-44
MERGED from [:firebase_storage] /Users/aftab/Desktop/phonemia/build/firebase_storage/intermediates/library_manifest/debug/AndroidManifest.xml:5:5-44
MERGED from [:cloud_firestore] /Users/aftab/Desktop/phonemia/build/cloud_firestore/intermediates/library_manifest/debug/AndroidManifest.xml:5:5-44
MERGED from [:cloud_firestore] /Users/aftab/Desktop/phonemia/build/cloud_firestore/intermediates/library_manifest/debug/AndroidManifest.xml:5:5-44
MERGED from [:firebase_core] /Users/aftab/Desktop/phonemia/build/firebase_core/intermediates/library_manifest/debug/AndroidManifest.xml:5:5-44
MERGED from [:firebase_core] /Users/aftab/Desktop/phonemia/build/firebase_core/intermediates/library_manifest/debug/AndroidManifest.xml:5:5-44
MERGED from [:audioplayers] /Users/aftab/Desktop/phonemia/build/audioplayers/intermediates/library_manifest/debug/AndroidManifest.xml:7:5-44
MERGED from [:audioplayers] /Users/aftab/Desktop/phonemia/build/audioplayers/intermediates/library_manifest/debug/AndroidManifest.xml:7:5-44
MERGED from [:file_picker] /Users/aftab/Desktop/phonemia/build/file_picker/intermediates/library_manifest/debug/AndroidManifest.xml:5:5-44
MERGED from [:file_picker] /Users/aftab/Desktop/phonemia/build/file_picker/intermediates/library_manifest/debug/AndroidManifest.xml:5:5-44
MERGED from [:flutter_plugin_android_lifecycle] /Users/aftab/Desktop/phonemia/build/flutter_plugin_android_lifecycle/intermediates/library_manifest/debug/AndroidManifest.xml:5:5-44
MERGED from [:flutter_plugin_android_lifecycle] /Users/aftab/Desktop/phonemia/build/flutter_plugin_android_lifecycle/intermediates/library_manifest/debug/AndroidManifest.xml:5:5-44
MERGED from [:modal_progress_hud_nsn] /Users/aftab/Desktop/phonemia/build/modal_progress_hud_nsn/intermediates/library_manifest/debug/AndroidManifest.xml:5:5-44
MERGED from [:modal_progress_hud_nsn] /Users/aftab/Desktop/phonemia/build/modal_progress_hud_nsn/intermediates/library_manifest/debug/AndroidManifest.xml:5:5-44
MERGED from [:hexcolor] /Users/aftab/Desktop/phonemia/build/hexcolor/intermediates/library_manifest/debug/AndroidManifest.xml:5:5-44
MERGED from [:hexcolor] /Users/aftab/Desktop/phonemia/build/hexcolor/intermediates/library_manifest/debug/AndroidManifest.xml:5:5-44
MERGED from [:path_provider_android] /Users/aftab/Desktop/phonemia/build/path_provider_android/intermediates/library_manifest/debug/AndroidManifest.xml:5:5-44
MERGED from [:path_provider_android] /Users/aftab/Desktop/phonemia/build/path_provider_android/intermediates/library_manifest/debug/AndroidManifest.xml:5:5-44
MERGED from [com.google.firebase:firebase-auth:21.0.1] /Users/aftab/.gradle/caches/transforms-2/files-2.1/499d23dc3ef10de152fc54312b4b7237/jetified-firebase-auth-21.0.1/AndroidManifest.xml:21:5-44
MERGED from [com.google.firebase:firebase-auth:21.0.1] /Users/aftab/.gradle/caches/transforms-2/files-2.1/499d23dc3ef10de152fc54312b4b7237/jetified-firebase-auth-21.0.1/AndroidManifest.xml:21:5-44
MERGED from [com.google.firebase:firebase-firestore:24.0.0] /Users/aftab/.gradle/caches/transforms-2/files-2.1/f21a76f24437b73ad1f45e532dc64453/jetified-firebase-firestore-24.0.0/AndroidManifest.xml:7:5-9:41
MERGED from [com.google.firebase:firebase-firestore:24.0.0] /Users/aftab/.gradle/caches/transforms-2/files-2.1/f21a76f24437b73ad1f45e532dc64453/jetified-firebase-firestore-24.0.0/AndroidManifest.xml:7:5-9:41
MERGED from [com.google.firebase:firebase-storage:20.0.0] /Users/aftab/.gradle/caches/transforms-2/files-2.1/400f0e5c52d1bf847c9a139cafefd0a5/jetified-firebase-storage-20.0.0/AndroidManifest.xml:20:5-22:41
MERGED from [com.google.firebase:firebase-storage:20.0.0] /Users/aftab/.gradle/caches/transforms-2/files-2.1/400f0e5c52d1bf847c9a139cafefd0a5/jetified-firebase-storage-20.0.0/AndroidManifest.xml:20:5-22:41
MERGED from [com.google.firebase:firebase-auth-interop:20.0.0] /Users/aftab/.gradle/caches/transforms-2/files-2.1/fcd5a4347f909a5b949bf5c2a8436ae6/jetified-firebase-auth-interop-20.0.0/AndroidManifest.xml:5:5-44
MERGED from [com.google.firebase:firebase-auth-interop:20.0.0] /Users/aftab/.gradle/caches/transforms-2/files-2.1/fcd5a4347f909a5b949bf5c2a8436ae6/jetified-firebase-auth-interop-20.0.0/AndroidManifest.xml:5:5-44
MERGED from [com.google.firebase:firebase-appcheck-interop:16.0.0-beta02] /Users/aftab/.gradle/caches/transforms-2/files-2.1/a6b9eca413184bc439ddc028ac7bb066/jetified-firebase-appcheck-interop-16.0.0-beta02/AndroidManifest.xml:19:5-21:41
MERGED from [com.google.firebase:firebase-appcheck-interop:16.0.0-beta02] /Users/aftab/.gradle/caches/transforms-2/files-2.1/a6b9eca413184bc439ddc028ac7bb066/jetified-firebase-appcheck-interop-16.0.0-beta02/AndroidManifest.xml:19:5-21:41
MERGED from [com.google.firebase:firebase-common:20.0.0] /Users/aftab/.gradle/caches/transforms-2/files-2.1/d5eb73e07577dc9aed23faaa7798a90b/jetified-firebase-common-20.0.0/AndroidManifest.xml:20:5-22:41
MERGED from [com.google.firebase:firebase-common:20.0.0] /Users/aftab/.gradle/caches/transforms-2/files-2.1/d5eb73e07577dc9aed23faaa7798a90b/jetified-firebase-common-20.0.0/AndroidManifest.xml:20:5-22:41
MERGED from [androidx.core:core-ktx:1.6.0] /Users/aftab/.gradle/caches/transforms-2/files-2.1/3289edb773d78dc7ff6a96abb8b89d3e/jetified-core-ktx-1.6.0/AndroidManifest.xml:5:5-7:41
MERGED from [androidx.core:core-ktx:1.6.0] /Users/aftab/.gradle/caches/transforms-2/files-2.1/3289edb773d78dc7ff6a96abb8b89d3e/jetified-core-ktx-1.6.0/AndroidManifest.xml:5:5-7:41
MERGED from [com.google.android.gms:play-services-auth-api-phone:17.4.0] /Users/aftab/.gradle/caches/transforms-2/files-2.1/10341c3dada6a64173ab8ba0e2875359/jetified-play-services-auth-api-phone-17.4.0/AndroidManifest.xml:5:5-44
MERGED from [com.google.android.gms:play-services-auth-api-phone:17.4.0] /Users/aftab/.gradle/caches/transforms-2/files-2.1/10341c3dada6a64173ab8ba0e2875359/jetified-play-services-auth-api-phone-17.4.0/AndroidManifest.xml:5:5-44
MERGED from [com.google.android.gms:play-services-safetynet:17.0.0] /Users/aftab/.gradle/caches/transforms-2/files-2.1/4a06b8ba24f95992f24e150b2fd44f24/jetified-play-services-safetynet-17.0.0/AndroidManifest.xml:20:5-44
MERGED from [com.google.android.gms:play-services-safetynet:17.0.0] /Users/aftab/.gradle/caches/transforms-2/files-2.1/4a06b8ba24f95992f24e150b2fd44f24/jetified-play-services-safetynet-17.0.0/AndroidManifest.xml:20:5-44
MERGED from [com.google.firebase:firebase-database-collection:18.0.0] /Users/aftab/.gradle/caches/transforms-2/files-2.1/7d53a3304511bc262a0baa4d0f9ace20/jetified-firebase-database-collection-18.0.0/AndroidManifest.xml:5:5-7:41
MERGED from [com.google.firebase:firebase-database-collection:18.0.0] /Users/aftab/.gradle/caches/transforms-2/files-2.1/7d53a3304511bc262a0baa4d0f9ace20/jetified-firebase-database-collection-18.0.0/AndroidManifest.xml:5:5-7:41
MERGED from [com.google.android.gms:play-services-base:17.1.0] /Users/aftab/.gradle/caches/transforms-2/files-2.1/e91c76fa5178367a03077f75662eefda/jetified-play-services-base-17.1.0/AndroidManifest.xml:20:5-44
MERGED from [com.google.android.gms:play-services-base:17.1.0] /Users/aftab/.gradle/caches/transforms-2/files-2.1/e91c76fa5178367a03077f75662eefda/jetified-play-services-base-17.1.0/AndroidManifest.xml:20:5-44
MERGED from [com.google.android.gms:play-services-tasks:17.0.0] /Users/aftab/.gradle/caches/transforms-2/files-2.1/6e0270c271b4d0626fc1d5af7c053a48/jetified-play-services-tasks-17.0.0/AndroidManifest.xml:5:5-44
MERGED from [com.google.android.gms:play-services-tasks:17.0.0] /Users/aftab/.gradle/caches/transforms-2/files-2.1/6e0270c271b4d0626fc1d5af7c053a48/jetified-play-services-tasks-17.0.0/AndroidManifest.xml:5:5-44
MERGED from [com.google.android.gms:play-services-basement:17.1.0] /Users/aftab/.gradle/caches/transforms-2/files-2.1/6c6a30651b973815be9d778b61d96729/jetified-play-services-basement-17.1.0/AndroidManifest.xml:20:5-44
MERGED from [com.google.android.gms:play-services-basement:17.1.0] /Users/aftab/.gradle/caches/transforms-2/files-2.1/6c6a30651b973815be9d778b61d96729/jetified-play-services-basement-17.1.0/AndroidManifest.xml:20:5-44
MERGED from [androidx.fragment:fragment:1.1.0] /Users/aftab/.gradle/caches/transforms-2/files-2.1/98a49955fe2e800b4212fd20c89c1e79/fragment-1.1.0/AndroidManifest.xml:20:5-22:41
MERGED from [androidx.fragment:fragment:1.1.0] /Users/aftab/.gradle/caches/transforms-2/files-2.1/98a49955fe2e800b4212fd20c89c1e79/fragment-1.1.0/AndroidManifest.xml:20:5-22:41
MERGED from [androidx.browser:browser:1.0.0] /Users/aftab/.gradle/caches/transforms-2/files-2.1/69988b0ba4ad67cd7bd0be9a74569371/browser-1.0.0/AndroidManifest.xml:20:5-44
MERGED from [androidx.browser:browser:1.0.0] /Users/aftab/.gradle/caches/transforms-2/files-2.1/69988b0ba4ad67cd7bd0be9a74569371/browser-1.0.0/AndroidManifest.xml:20:5-44
MERGED from [androidx.legacy:legacy-support-core-ui:1.0.0] /Users/aftab/.gradle/caches/transforms-2/files-2.1/ab88f086a787e8a46498650f591324ae/legacy-support-core-ui-1.0.0/AndroidManifest.xml:20:5-44
MERGED from [androidx.legacy:legacy-support-core-ui:1.0.0] /Users/aftab/.gradle/caches/transforms-2/files-2.1/ab88f086a787e8a46498650f591324ae/legacy-support-core-ui-1.0.0/AndroidManifest.xml:20:5-44
MERGED from [androidx.viewpager:viewpager:1.0.0] /Users/aftab/.gradle/caches/transforms-2/files-2.1/3ac92ec95491e4ec74e40ab915badcfe/viewpager-1.0.0/AndroidManifest.xml:20:5-44
MERGED from [androidx.viewpager:viewpager:1.0.0] /Users/aftab/.gradle/caches/transforms-2/files-2.1/3ac92ec95491e4ec74e40ab915badcfe/viewpager-1.0.0/AndroidManifest.xml:20:5-44
MERGED from [androidx.legacy:legacy-support-core-utils:1.0.0] /Users/aftab/.gradle/caches/transforms-2/files-2.1/a87153039073d5f1c678d321fc8d2f26/legacy-support-core-utils-1.0.0/AndroidManifest.xml:20:5-44
MERGED from [androidx.legacy:legacy-support-core-utils:1.0.0] /Users/aftab/.gradle/caches/transforms-2/files-2.1/a87153039073d5f1c678d321fc8d2f26/legacy-support-core-utils-1.0.0/AndroidManifest.xml:20:5-44
MERGED from [androidx.loader:loader:1.0.0] /Users/aftab/.gradle/caches/transforms-2/files-2.1/0f8c5c5a3838117b93ac8e4b4262126d/loader-1.0.0/AndroidManifest.xml:20:5-44
MERGED from [androidx.loader:loader:1.0.0] /Users/aftab/.gradle/caches/transforms-2/files-2.1/0f8c5c5a3838117b93ac8e4b4262126d/loader-1.0.0/AndroidManifest.xml:20:5-44
MERGED from [androidx.activity:activity:1.0.0] /Users/aftab/.gradle/caches/transforms-2/files-2.1/7e5511f100b0deb39c03b1719c7c7ff5/jetified-activity-1.0.0/AndroidManifest.xml:20:5-22:41
MERGED from [androidx.activity:activity:1.0.0] /Users/aftab/.gradle/caches/transforms-2/files-2.1/7e5511f100b0deb39c03b1719c7c7ff5/jetified-activity-1.0.0/AndroidManifest.xml:20:5-22:41
MERGED from [androidx.coordinatorlayout:coordinatorlayout:1.0.0] /Users/aftab/.gradle/caches/transforms-2/files-2.1/afa3a3c17e064ef98edaa04af2021336/coordinatorlayout-1.0.0/AndroidManifest.xml:20:5-44
MERGED from [androidx.coordinatorlayout:coordinatorlayout:1.0.0] /Users/aftab/.gradle/caches/transforms-2/files-2.1/afa3a3c17e064ef98edaa04af2021336/coordinatorlayout-1.0.0/AndroidManifest.xml:20:5-44
MERGED from [androidx.drawerlayout:drawerlayout:1.0.0] /Users/aftab/.gradle/caches/transforms-2/files-2.1/b3be0c5afdb7bf8597023a14f67e6177/drawerlayout-1.0.0/AndroidManifest.xml:20:5-44
MERGED from [androidx.drawerlayout:drawerlayout:1.0.0] /Users/aftab/.gradle/caches/transforms-2/files-2.1/b3be0c5afdb7bf8597023a14f67e6177/drawerlayout-1.0.0/AndroidManifest.xml:20:5-44
MERGED from [androidx.slidingpanelayout:slidingpanelayout:1.0.0] /Users/aftab/.gradle/caches/transforms-2/files-2.1/bec37db405bf1baafbc779f08ae2480b/slidingpanelayout-1.0.0/AndroidManifest.xml:20:5-44
MERGED from [androidx.slidingpanelayout:slidingpanelayout:1.0.0] /Users/aftab/.gradle/caches/transforms-2/files-2.1/bec37db405bf1baafbc779f08ae2480b/slidingpanelayout-1.0.0/AndroidManifest.xml:20:5-44
MERGED from [androidx.customview:customview:1.0.0] /Users/aftab/.gradle/caches/transforms-2/files-2.1/996342e5f3990ba104a02a72a65cc863/customview-1.0.0/AndroidManifest.xml:20:5-44
MERGED from [androidx.customview:customview:1.0.0] /Users/aftab/.gradle/caches/transforms-2/files-2.1/996342e5f3990ba104a02a72a65cc863/customview-1.0.0/AndroidManifest.xml:20:5-44
MERGED from [androidx.swiperefreshlayout:swiperefreshlayout:1.0.0] /Users/aftab/.gradle/caches/transforms-2/files-2.1/3f8d1d7657147a8f132b1d78e092e3fc/swiperefreshlayout-1.0.0/AndroidManifest.xml:20:5-44
MERGED from [androidx.swiperefreshlayout:swiperefreshlayout:1.0.0] /Users/aftab/.gradle/caches/transforms-2/files-2.1/3f8d1d7657147a8f132b1d78e092e3fc/swiperefreshlayout-1.0.0/AndroidManifest.xml:20:5-44
MERGED from [androidx.asynclayoutinflater:asynclayoutinflater:1.0.0] /Users/aftab/.gradle/caches/transforms-2/files-2.1/2e4cd76b714623e775a2b4d5372ec029/asynclayoutinflater-1.0.0/AndroidManifest.xml:20:5-44
MERGED from [androidx.asynclayoutinflater:asynclayoutinflater:1.0.0] /Users/aftab/.gradle/caches/transforms-2/files-2.1/2e4cd76b714623e775a2b4d5372ec029/asynclayoutinflater-1.0.0/AndroidManifest.xml:20:5-44
MERGED from [androidx.core:core:1.6.0] /Users/aftab/.gradle/caches/transforms-2/files-2.1/8a7f6825b2c857263502d908e7ce1fa5/core-1.6.0/AndroidManifest.xml:20:5-22:41
MERGED from [androidx.core:core:1.6.0] /Users/aftab/.gradle/caches/transforms-2/files-2.1/8a7f6825b2c857263502d908e7ce1fa5/core-1.6.0/AndroidManifest.xml:20:5-22:41
MERGED from [androidx.lifecycle:lifecycle-runtime:2.2.0] /Users/aftab/.gradle/caches/transforms-2/files-2.1/b822b579312da6bf9ca406d9da5e5190/lifecycle-runtime-2.2.0/AndroidManifest.xml:20:5-22:41
MERGED from [androidx.lifecycle:lifecycle-runtime:2.2.0] /Users/aftab/.gradle/caches/transforms-2/files-2.1/b822b579312da6bf9ca406d9da5e5190/lifecycle-runtime-2.2.0/AndroidManifest.xml:20:5-22:41
MERGED from [androidx.savedstate:savedstate:1.0.0] /Users/aftab/.gradle/caches/transforms-2/files-2.1/2db620fae6f8c6fe61f9425d99936c1b/jetified-savedstate-1.0.0/AndroidManifest.xml:20:5-22:41
MERGED from [androidx.savedstate:savedstate:1.0.0] /Users/aftab/.gradle/caches/transforms-2/files-2.1/2db620fae6f8c6fe61f9425d99936c1b/jetified-savedstate-1.0.0/AndroidManifest.xml:20:5-22:41
MERGED from [androidx.lifecycle:lifecycle-livedata:2.0.0] /Users/aftab/.gradle/caches/transforms-2/files-2.1/2a522df79fe054d3c4be2fcf4372d418/lifecycle-livedata-2.0.0/AndroidManifest.xml:20:5-44
MERGED from [androidx.lifecycle:lifecycle-livedata:2.0.0] /Users/aftab/.gradle/caches/transforms-2/files-2.1/2a522df79fe054d3c4be2fcf4372d418/lifecycle-livedata-2.0.0/AndroidManifest.xml:20:5-44
MERGED from [androidx.lifecycle:lifecycle-livedata-core:2.0.0] /Users/aftab/.gradle/caches/transforms-2/files-2.1/12aac63b6e75d4572a201e5f50229ce0/lifecycle-livedata-core-2.0.0/AndroidManifest.xml:20:5-44
MERGED from [androidx.lifecycle:lifecycle-livedata-core:2.0.0] /Users/aftab/.gradle/caches/transforms-2/files-2.1/12aac63b6e75d4572a201e5f50229ce0/lifecycle-livedata-core-2.0.0/AndroidManifest.xml:20:5-44
MERGED from [androidx.localbroadcastmanager:localbroadcastmanager:1.0.0] /Users/aftab/.gradle/caches/transforms-2/files-2.1/037ee24b5b3f538a95ddcfdfa92577c1/localbroadcastmanager-1.0.0/AndroidManifest.xml:20:5-44
MERGED from [androidx.localbroadcastmanager:localbroadcastmanager:1.0.0] /Users/aftab/.gradle/caches/transforms-2/files-2.1/037ee24b5b3f538a95ddcfdfa92577c1/localbroadcastmanager-1.0.0/AndroidManifest.xml:20:5-44
MERGED from [com.google.firebase:firebase-components:17.0.0] /Users/aftab/.gradle/caches/transforms-2/files-2.1/d91cfa0932403332b5f5a09c6ab43870/jetified-firebase-components-17.0.0/AndroidManifest.xml:19:5-21:41
MERGED from [com.google.firebase:firebase-components:17.0.0] /Users/aftab/.gradle/caches/transforms-2/files-2.1/d91cfa0932403332b5f5a09c6ab43870/jetified-firebase-components-17.0.0/AndroidManifest.xml:19:5-21:41
MERGED from [androidx.arch.core:core-runtime:2.0.0] /Users/aftab/.gradle/caches/transforms-2/files-2.1/db4344b748ef3399b2e640f6a9f82267/core-runtime-2.0.0/AndroidManifest.xml:20:5-44
MERGED from [androidx.arch.core:core-runtime:2.0.0] /Users/aftab/.gradle/caches/transforms-2/files-2.1/db4344b748ef3399b2e640f6a9f82267/core-runtime-2.0.0/AndroidManifest.xml:20:5-44
MERGED from [androidx.versionedparcelable:versionedparcelable:1.1.1] /Users/aftab/.gradle/caches/transforms-2/files-2.1/e6fc4bef2cc53eb5eff5c3f556452965/versionedparcelable-1.1.1/AndroidManifest.xml:20:5-22:41
MERGED from [androidx.versionedparcelable:versionedparcelable:1.1.1] /Users/aftab/.gradle/caches/transforms-2/files-2.1/e6fc4bef2cc53eb5eff5c3f556452965/versionedparcelable-1.1.1/AndroidManifest.xml:20:5-22:41
MERGED from [androidx.interpolator:interpolator:1.0.0] /Users/aftab/.gradle/caches/transforms-2/files-2.1/fd13a86db37d35aeac1515c8c8123ad9/interpolator-1.0.0/AndroidManifest.xml:20:5-44
MERGED from [androidx.interpolator:interpolator:1.0.0] /Users/aftab/.gradle/caches/transforms-2/files-2.1/fd13a86db37d35aeac1515c8c8123ad9/interpolator-1.0.0/AndroidManifest.xml:20:5-44
MERGED from [androidx.lifecycle:lifecycle-viewmodel:2.1.0] /Users/aftab/.gradle/caches/transforms-2/files-2.1/c2fbe90178aaf86cbb6a8a4bcecca280/lifecycle-viewmodel-2.1.0/AndroidManifest.xml:20:5-44
MERGED from [androidx.lifecycle:lifecycle-viewmodel:2.1.0] /Users/aftab/.gradle/caches/transforms-2/files-2.1/c2fbe90178aaf86cbb6a8a4bcecca280/lifecycle-viewmodel-2.1.0/AndroidManifest.xml:20:5-44
MERGED from [androidx.cursoradapter:cursoradapter:1.0.0] /Users/aftab/.gradle/caches/transforms-2/files-2.1/bfb31a760d71ec0e96ce43c9c3ca83d3/cursoradapter-1.0.0/AndroidManifest.xml:20:5-44
MERGED from [androidx.cursoradapter:cursoradapter:1.0.0] /Users/aftab/.gradle/caches/transforms-2/files-2.1/bfb31a760d71ec0e96ce43c9c3ca83d3/cursoradapter-1.0.0/AndroidManifest.xml:20:5-44
MERGED from [androidx.documentfile:documentfile:1.0.0] /Users/aftab/.gradle/caches/transforms-2/files-2.1/4f61f21a55fda513d5ca90fce5a3cf68/documentfile-1.0.0/AndroidManifest.xml:20:5-44
MERGED from [androidx.documentfile:documentfile:1.0.0] /Users/aftab/.gradle/caches/transforms-2/files-2.1/4f61f21a55fda513d5ca90fce5a3cf68/documentfile-1.0.0/AndroidManifest.xml:20:5-44
MERGED from [androidx.print:print:1.0.0] /Users/aftab/.gradle/caches/transforms-2/files-2.1/1df5b336215a60349673ca13fd66a64b/print-1.0.0/AndroidManifest.xml:20:5-44
MERGED from [androidx.print:print:1.0.0] /Users/aftab/.gradle/caches/transforms-2/files-2.1/1df5b336215a60349673ca13fd66a64b/print-1.0.0/AndroidManifest.xml:20:5-44
MERGED from [io.grpc:grpc-android:1.41.0] /Users/aftab/.gradle/caches/transforms-2/files-2.1/9677a0cc0e8847fae54c245994ab2761/jetified-grpc-android-1.41.0/AndroidManifest.xml:7:5-9:41
MERGED from [io.grpc:grpc-android:1.41.0] /Users/aftab/.gradle/caches/transforms-2/files-2.1/9677a0cc0e8847fae54c245994ab2761/jetified-grpc-android-1.41.0/AndroidManifest.xml:7:5-9:41
MERGED from [com.google.firebase:protolite-well-known-types:18.0.0] /Users/aftab/.gradle/caches/transforms-2/files-2.1/2acfd1913c576371e40b17dde6b70445/jetified-protolite-well-known-types-18.0.0/AndroidManifest.xml:7:5-9:41
MERGED from [com.google.firebase:protolite-well-known-types:18.0.0] /Users/aftab/.gradle/caches/transforms-2/files-2.1/2acfd1913c576371e40b17dde6b70445/jetified-protolite-well-known-types-18.0.0/AndroidManifest.xml:7:5-9:41
MERGED from [androidx.annotation:annotation-experimental:1.1.0] /Users/aftab/.gradle/caches/transforms-2/files-2.1/d399316d96a9364b1593cafb882c2969/jetified-annotation-experimental-1.1.0/AndroidManifest.xml:20:5-22:41
MERGED from [androidx.annotation:annotation-experimental:1.1.0] /Users/aftab/.gradle/caches/transforms-2/files-2.1/d399316d96a9364b1593cafb882c2969/jetified-annotation-experimental-1.1.0/AndroidManifest.xml:20:5-22:41
INJECTED from /Users/aftab/Desktop/phonemia/android/app/src/debug/AndroidManifest.xml
INJECTED from /Users/aftab/Desktop/phonemia/android/app/src/debug/AndroidManifest.xml
	android:targetSdkVersion
		INJECTED from /Users/aftab/Desktop/phonemia/android/app/src/main/AndroidManifest.xml
		INJECTED from /Users/aftab/Desktop/phonemia/android/app/src/debug/AndroidManifest.xml
	android:minSdkVersion
		INJECTED from /Users/aftab/Desktop/phonemia/android/app/src/main/AndroidManifest.xml
		INJECTED from /Users/aftab/Desktop/phonemia/android/app/src/debug/AndroidManifest.xml
uses-permission#android.permission.INTERNET
ADDED from /Users/aftab/Desktop/phonemia/android/app/src/debug/AndroidManifest.xml:6:5-66
MERGED from [com.google.firebase:firebase-auth:21.0.1] /Users/aftab/.gradle/caches/transforms-2/files-2.1/499d23dc3ef10de152fc54312b4b7237/jetified-firebase-auth-21.0.1/AndroidManifest.xml:23:5-67
MERGED from [com.google.firebase:firebase-auth:21.0.1] /Users/aftab/.gradle/caches/transforms-2/files-2.1/499d23dc3ef10de152fc54312b4b7237/jetified-firebase-auth-21.0.1/AndroidManifest.xml:23:5-67
MERGED from [com.google.firebase:firebase-firestore:24.0.0] /Users/aftab/.gradle/caches/transforms-2/files-2.1/f21a76f24437b73ad1f45e532dc64453/jetified-firebase-firestore-24.0.0/AndroidManifest.xml:14:5-67
MERGED from [com.google.firebase:firebase-firestore:24.0.0] /Users/aftab/.gradle/caches/transforms-2/files-2.1/f21a76f24437b73ad1f45e532dc64453/jetified-firebase-firestore-24.0.0/AndroidManifest.xml:14:5-67
MERGED from [com.google.firebase:firebase-storage:20.0.0] /Users/aftab/.gradle/caches/transforms-2/files-2.1/400f0e5c52d1bf847c9a139cafefd0a5/jetified-firebase-storage-20.0.0/AndroidManifest.xml:27:5-67
MERGED from [com.google.firebase:firebase-storage:20.0.0] /Users/aftab/.gradle/caches/transforms-2/files-2.1/400f0e5c52d1bf847c9a139cafefd0a5/jetified-firebase-storage-20.0.0/AndroidManifest.xml:27:5-67
	android:name
		ADDED from /Users/aftab/Desktop/phonemia/android/app/src/debug/AndroidManifest.xml:6:22-64
service#com.google.firebase.components.ComponentDiscoveryService
ADDED from [:firebase_auth] /Users/aftab/Desktop/phonemia/build/firebase_auth/intermediates/library_manifest/debug/AndroidManifest.xml:8:9-12:19
MERGED from [:firebase_storage] /Users/aftab/Desktop/phonemia/build/firebase_storage/intermediates/library_manifest/debug/AndroidManifest.xml:8:9-12:19
MERGED from [:firebase_storage] /Users/aftab/Desktop/phonemia/build/firebase_storage/intermediates/library_manifest/debug/AndroidManifest.xml:8:9-12:19
MERGED from [:cloud_firestore] /Users/aftab/Desktop/phonemia/build/cloud_firestore/intermediates/library_manifest/debug/AndroidManifest.xml:8:9-12:19
MERGED from [:cloud_firestore] /Users/aftab/Desktop/phonemia/build/cloud_firestore/intermediates/library_manifest/debug/AndroidManifest.xml:8:9-12:19
MERGED from [:firebase_core] /Users/aftab/Desktop/phonemia/build/firebase_core/intermediates/library_manifest/debug/AndroidManifest.xml:8:9-12:19
MERGED from [:firebase_core] /Users/aftab/Desktop/phonemia/build/firebase_core/intermediates/library_manifest/debug/AndroidManifest.xml:8:9-12:19
MERGED from [com.google.firebase:firebase-auth:21.0.1] /Users/aftab/.gradle/caches/transforms-2/files-2.1/499d23dc3ef10de152fc54312b4b7237/jetified-firebase-auth-21.0.1/AndroidManifest.xml:74:9-80:19
MERGED from [com.google.firebase:firebase-auth:21.0.1] /Users/aftab/.gradle/caches/transforms-2/files-2.1/499d23dc3ef10de152fc54312b4b7237/jetified-firebase-auth-21.0.1/AndroidManifest.xml:74:9-80:19
MERGED from [com.google.firebase:firebase-firestore:24.0.0] /Users/aftab/.gradle/caches/transforms-2/files-2.1/f21a76f24437b73ad1f45e532dc64453/jetified-firebase-firestore-24.0.0/AndroidManifest.xml:17:9-23:19
MERGED from [com.google.firebase:firebase-firestore:24.0.0] /Users/aftab/.gradle/caches/transforms-2/files-2.1/f21a76f24437b73ad1f45e532dc64453/jetified-firebase-firestore-24.0.0/AndroidManifest.xml:17:9-23:19
MERGED from [com.google.firebase:firebase-storage:20.0.0] /Users/aftab/.gradle/caches/transforms-2/files-2.1/400f0e5c52d1bf847c9a139cafefd0a5/jetified-firebase-storage-20.0.0/AndroidManifest.xml:30:9-36:19
MERGED from [com.google.firebase:firebase-storage:20.0.0] /Users/aftab/.gradle/caches/transforms-2/files-2.1/400f0e5c52d1bf847c9a139cafefd0a5/jetified-firebase-storage-20.0.0/AndroidManifest.xml:30:9-36:19
MERGED from [com.google.firebase:firebase-common:20.0.0] /Users/aftab/.gradle/caches/transforms-2/files-2.1/d5eb73e07577dc9aed23faaa7798a90b/jetified-firebase-common-20.0.0/AndroidManifest.xml:33:9-37:35
MERGED from [com.google.firebase:firebase-common:20.0.0] /Users/aftab/.gradle/caches/transforms-2/files-2.1/d5eb73e07577dc9aed23faaa7798a90b/jetified-firebase-common-20.0.0/AndroidManifest.xml:33:9-37:35
	android:exported
		ADDED from [com.google.firebase:firebase-auth:21.0.1] /Users/aftab/.gradle/caches/transforms-2/files-2.1/499d23dc3ef10de152fc54312b4b7237/jetified-firebase-auth-21.0.1/AndroidManifest.xml:76:13-37
	tools:targetApi
		ADDED from [com.google.firebase:firebase-common:20.0.0] /Users/aftab/.gradle/caches/transforms-2/files-2.1/d5eb73e07577dc9aed23faaa7798a90b/jetified-firebase-common-20.0.0/AndroidManifest.xml:37:13-32
	android:directBootAware
		ADDED from [com.google.firebase:firebase-common:20.0.0] /Users/aftab/.gradle/caches/transforms-2/files-2.1/d5eb73e07577dc9aed23faaa7798a90b/jetified-firebase-common-20.0.0/AndroidManifest.xml:35:13-43
	android:name
		ADDED from [:firebase_auth] /Users/aftab/Desktop/phonemia/build/firebase_auth/intermediates/library_manifest/debug/AndroidManifest.xml:8:18-89
meta-data#com.google.firebase.components:io.flutter.plugins.firebase.auth.FlutterFirebaseAuthRegistrar
ADDED from [:firebase_auth] /Users/aftab/Desktop/phonemia/build/firebase_auth/intermediates/library_manifest/debug/AndroidManifest.xml:9:13-11:85
	android:value
		ADDED from [:firebase_auth] /Users/aftab/Desktop/phonemia/build/firebase_auth/intermediates/library_manifest/debug/AndroidManifest.xml:11:17-82
	android:name
		ADDED from [:firebase_auth] /Users/aftab/Desktop/phonemia/build/firebase_auth/intermediates/library_manifest/debug/AndroidManifest.xml:10:17-124
meta-data#com.google.firebase.components:io.flutter.plugins.firebase.storage.FlutterFirebaseAppRegistrar
ADDED from [:firebase_storage] /Users/aftab/Desktop/phonemia/build/firebase_storage/intermediates/library_manifest/debug/AndroidManifest.xml:9:13-11:85
	android:value
		ADDED from [:firebase_storage] /Users/aftab/Desktop/phonemia/build/firebase_storage/intermediates/library_manifest/debug/AndroidManifest.xml:11:17-82
	android:name
		ADDED from [:firebase_storage] /Users/aftab/Desktop/phonemia/build/firebase_storage/intermediates/library_manifest/debug/AndroidManifest.xml:10:17-126
meta-data#com.google.firebase.components:io.flutter.plugins.firebase.firestore.FlutterFirebaseFirestoreRegistrar
ADDED from [:cloud_firestore] /Users/aftab/Desktop/phonemia/build/cloud_firestore/intermediates/library_manifest/debug/AndroidManifest.xml:9:13-11:85
	android:value
		ADDED from [:cloud_firestore] /Users/aftab/Desktop/phonemia/build/cloud_firestore/intermediates/library_manifest/debug/AndroidManifest.xml:11:17-82
	android:name
		ADDED from [:cloud_firestore] /Users/aftab/Desktop/phonemia/build/cloud_firestore/intermediates/library_manifest/debug/AndroidManifest.xml:10:17-134
meta-data#com.google.firebase.components:io.flutter.plugins.firebase.core.FlutterFirebaseCoreRegistrar
ADDED from [:firebase_core] /Users/aftab/Desktop/phonemia/build/firebase_core/intermediates/library_manifest/debug/AndroidManifest.xml:9:13-11:85
	android:value
		ADDED from [:firebase_core] /Users/aftab/Desktop/phonemia/build/firebase_core/intermediates/library_manifest/debug/AndroidManifest.xml:11:17-82
	android:name
		ADDED from [:firebase_core] /Users/aftab/Desktop/phonemia/build/firebase_core/intermediates/library_manifest/debug/AndroidManifest.xml:10:17-124
uses-permission#android.permission.READ_EXTERNAL_STORAGE
ADDED from [:file_picker] /Users/aftab/Desktop/phonemia/build/file_picker/intermediates/library_manifest/debug/AndroidManifest.xml:7:5-80
	android:name
		ADDED from [:file_picker] /Users/aftab/Desktop/phonemia/build/file_picker/intermediates/library_manifest/debug/AndroidManifest.xml:7:22-77
queries
ADDED from [:file_picker] /Users/aftab/Desktop/phonemia/build/file_picker/intermediates/library_manifest/debug/AndroidManifest.xml:9:5-15:15
intent#action:name:android.intent.action.GET_CONTENT+data:mimeType:*/*
ADDED from [:file_picker] /Users/aftab/Desktop/phonemia/build/file_picker/intermediates/library_manifest/debug/AndroidManifest.xml:10:9-14:18
action#android.intent.action.GET_CONTENT
ADDED from [:file_picker] /Users/aftab/Desktop/phonemia/build/file_picker/intermediates/library_manifest/debug/AndroidManifest.xml:11:13-72
	android:name
		ADDED from [:file_picker] /Users/aftab/Desktop/phonemia/build/file_picker/intermediates/library_manifest/debug/AndroidManifest.xml:11:21-69
data
ADDED from [:file_picker] /Users/aftab/Desktop/phonemia/build/file_picker/intermediates/library_manifest/debug/AndroidManifest.xml:13:13-44
	android:mimeType
		ADDED from [:file_picker] /Users/aftab/Desktop/phonemia/build/file_picker/intermediates/library_manifest/debug/AndroidManifest.xml:13:19-41
uses-permission#android.permission.ACCESS_NETWORK_STATE
ADDED from [com.google.firebase:firebase-auth:21.0.1] /Users/aftab/.gradle/caches/transforms-2/files-2.1/499d23dc3ef10de152fc54312b4b7237/jetified-firebase-auth-21.0.1/AndroidManifest.xml:24:5-79
MERGED from [com.google.firebase:firebase-firestore:24.0.0] /Users/aftab/.gradle/caches/transforms-2/files-2.1/f21a76f24437b73ad1f45e532dc64453/jetified-firebase-firestore-24.0.0/AndroidManifest.xml:13:5-79
MERGED from [com.google.firebase:firebase-firestore:24.0.0] /Users/aftab/.gradle/caches/transforms-2/files-2.1/f21a76f24437b73ad1f45e532dc64453/jetified-firebase-firestore-24.0.0/AndroidManifest.xml:13:5-79
MERGED from [com.google.firebase:firebase-storage:20.0.0] /Users/aftab/.gradle/caches/transforms-2/files-2.1/400f0e5c52d1bf847c9a139cafefd0a5/jetified-firebase-storage-20.0.0/AndroidManifest.xml:26:5-79
MERGED from [com.google.firebase:firebase-storage:20.0.0] /Users/aftab/.gradle/caches/transforms-2/files-2.1/400f0e5c52d1bf847c9a139cafefd0a5/jetified-firebase-storage-20.0.0/AndroidManifest.xml:26:5-79
MERGED from [io.grpc:grpc-android:1.41.0] /Users/aftab/.gradle/caches/transforms-2/files-2.1/9677a0cc0e8847fae54c245994ab2761/jetified-grpc-android-1.41.0/AndroidManifest.xml:11:5-79
MERGED from [io.grpc:grpc-android:1.41.0] /Users/aftab/.gradle/caches/transforms-2/files-2.1/9677a0cc0e8847fae54c245994ab2761/jetified-grpc-android-1.41.0/AndroidManifest.xml:11:5-79
	android:name
		ADDED from [com.google.firebase:firebase-auth:21.0.1] /Users/aftab/.gradle/caches/transforms-2/files-2.1/499d23dc3ef10de152fc54312b4b7237/jetified-firebase-auth-21.0.1/AndroidManifest.xml:24:22-76
activity#com.google.firebase.auth.internal.GenericIdpActivity
ADDED from [com.google.firebase:firebase-auth:21.0.1] /Users/aftab/.gradle/caches/transforms-2/files-2.1/499d23dc3ef10de152fc54312b4b7237/jetified-firebase-auth-21.0.1/AndroidManifest.xml:27:9-44:20
	android:excludeFromRecents
		ADDED from [com.google.firebase:firebase-auth:21.0.1] /Users/aftab/.gradle/caches/transforms-2/files-2.1/499d23dc3ef10de152fc54312b4b7237/jetified-firebase-auth-21.0.1/AndroidManifest.xml:29:13-46
	android:launchMode
		ADDED from [com.google.firebase:firebase-auth:21.0.1] /Users/aftab/.gradle/caches/transforms-2/files-2.1/499d23dc3ef10de152fc54312b4b7237/jetified-firebase-auth-21.0.1/AndroidManifest.xml:31:13-44
	android:exported
		ADDED from [com.google.firebase:firebase-auth:21.0.1] /Users/aftab/.gradle/caches/transforms-2/files-2.1/499d23dc3ef10de152fc54312b4b7237/jetified-firebase-auth-21.0.1/AndroidManifest.xml:30:13-36
	android:theme
		ADDED from [com.google.firebase:firebase-auth:21.0.1] /Users/aftab/.gradle/caches/transforms-2/files-2.1/499d23dc3ef10de152fc54312b4b7237/jetified-firebase-auth-21.0.1/AndroidManifest.xml:32:13-72
	android:name
		ADDED from [com.google.firebase:firebase-auth:21.0.1] /Users/aftab/.gradle/caches/transforms-2/files-2.1/499d23dc3ef10de152fc54312b4b7237/jetified-firebase-auth-21.0.1/AndroidManifest.xml:28:13-80
intent-filter#action:name:android.intent.action.VIEW+category:name:android.intent.category.BROWSABLE+category:name:android.intent.category.DEFAULT+data:host:firebase.auth+data:path:/+data:scheme:genericidp
ADDED from [com.google.firebase:firebase-auth:21.0.1] /Users/aftab/.gradle/caches/transforms-2/files-2.1/499d23dc3ef10de152fc54312b4b7237/jetified-firebase-auth-21.0.1/AndroidManifest.xml:33:13-43:29
action#android.intent.action.VIEW
ADDED from [com.google.firebase:firebase-auth:21.0.1] /Users/aftab/.gradle/caches/transforms-2/files-2.1/499d23dc3ef10de152fc54312b4b7237/jetified-firebase-auth-21.0.1/AndroidManifest.xml:34:17-69
	android:name
		ADDED from [com.google.firebase:firebase-auth:21.0.1] /Users/aftab/.gradle/caches/transforms-2/files-2.1/499d23dc3ef10de152fc54312b4b7237/jetified-firebase-auth-21.0.1/AndroidManifest.xml:34:25-66
category#android.intent.category.DEFAULT
ADDED from [com.google.firebase:firebase-auth:21.0.1] /Users/aftab/.gradle/caches/transforms-2/files-2.1/499d23dc3ef10de152fc54312b4b7237/jetified-firebase-auth-21.0.1/AndroidManifest.xml:36:17-76
	android:name
		ADDED from [com.google.firebase:firebase-auth:21.0.1] /Users/aftab/.gradle/caches/transforms-2/files-2.1/499d23dc3ef10de152fc54312b4b7237/jetified-firebase-auth-21.0.1/AndroidManifest.xml:36:27-73
category#android.intent.category.BROWSABLE
ADDED from [com.google.firebase:firebase-auth:21.0.1] /Users/aftab/.gradle/caches/transforms-2/files-2.1/499d23dc3ef10de152fc54312b4b7237/jetified-firebase-auth-21.0.1/AndroidManifest.xml:37:17-78
	android:name
		ADDED from [com.google.firebase:firebase-auth:21.0.1] /Users/aftab/.gradle/caches/transforms-2/files-2.1/499d23dc3ef10de152fc54312b4b7237/jetified-firebase-auth-21.0.1/AndroidManifest.xml:37:27-75
activity#com.google.firebase.auth.internal.RecaptchaActivity
ADDED from [com.google.firebase:firebase-auth:21.0.1] /Users/aftab/.gradle/caches/transforms-2/files-2.1/499d23dc3ef10de152fc54312b4b7237/jetified-firebase-auth-21.0.1/AndroidManifest.xml:45:9-62:20
	android:excludeFromRecents
		ADDED from [com.google.firebase:firebase-auth:21.0.1] /Users/aftab/.gradle/caches/transforms-2/files-2.1/499d23dc3ef10de152fc54312b4b7237/jetified-firebase-auth-21.0.1/AndroidManifest.xml:47:13-46
	android:launchMode
		ADDED from [com.google.firebase:firebase-auth:21.0.1] /Users/aftab/.gradle/caches/transforms-2/files-2.1/499d23dc3ef10de152fc54312b4b7237/jetified-firebase-auth-21.0.1/AndroidManifest.xml:49:13-44
	android:exported
		ADDED from [com.google.firebase:firebase-auth:21.0.1] /Users/aftab/.gradle/caches/transforms-2/files-2.1/499d23dc3ef10de152fc54312b4b7237/jetified-firebase-auth-21.0.1/AndroidManifest.xml:48:13-36
	android:theme
		ADDED from [com.google.firebase:firebase-auth:21.0.1] /Users/aftab/.gradle/caches/transforms-2/files-2.1/499d23dc3ef10de152fc54312b4b7237/jetified-firebase-auth-21.0.1/AndroidManifest.xml:50:13-72
	android:name
		ADDED from [com.google.firebase:firebase-auth:21.0.1] /Users/aftab/.gradle/caches/transforms-2/files-2.1/499d23dc3ef10de152fc54312b4b7237/jetified-firebase-auth-21.0.1/AndroidManifest.xml:46:13-79
intent-filter#action:name:android.intent.action.VIEW+category:name:android.intent.category.BROWSABLE+category:name:android.intent.category.DEFAULT+data:host:firebase.auth+data:path:/+data:scheme:recaptcha
ADDED from [com.google.firebase:firebase-auth:21.0.1] /Users/aftab/.gradle/caches/transforms-2/files-2.1/499d23dc3ef10de152fc54312b4b7237/jetified-firebase-auth-21.0.1/AndroidManifest.xml:51:13-61:29
service#com.google.firebase.auth.api.fallback.service.FirebaseAuthFallbackService
ADDED from [com.google.firebase:firebase-auth:21.0.1] /Users/aftab/.gradle/caches/transforms-2/files-2.1/499d23dc3ef10de152fc54312b4b7237/jetified-firebase-auth-21.0.1/AndroidManifest.xml:64:9-73:19
	android:enabled
		ADDED from [com.google.firebase:firebase-auth:21.0.1] /Users/aftab/.gradle/caches/transforms-2/files-2.1/499d23dc3ef10de152fc54312b4b7237/jetified-firebase-auth-21.0.1/AndroidManifest.xml:66:13-35
	android:exported
		ADDED from [com.google.firebase:firebase-auth:21.0.1] /Users/aftab/.gradle/caches/transforms-2/files-2.1/499d23dc3ef10de152fc54312b4b7237/jetified-firebase-auth-21.0.1/AndroidManifest.xml:67:13-37
	android:name
		ADDED from [com.google.firebase:firebase-auth:21.0.1] /Users/aftab/.gradle/caches/transforms-2/files-2.1/499d23dc3ef10de152fc54312b4b7237/jetified-firebase-auth-21.0.1/AndroidManifest.xml:65:13-101
intent-filter#action:name:com.google.firebase.auth.api.gms.service.START+category:name:android.intent.category.DEFAULT
ADDED from [com.google.firebase:firebase-auth:21.0.1] /Users/aftab/.gradle/caches/transforms-2/files-2.1/499d23dc3ef10de152fc54312b4b7237/jetified-firebase-auth-21.0.1/AndroidManifest.xml:68:13-72:29
action#com.google.firebase.auth.api.gms.service.START
ADDED from [com.google.firebase:firebase-auth:21.0.1] /Users/aftab/.gradle/caches/transforms-2/files-2.1/499d23dc3ef10de152fc54312b4b7237/jetified-firebase-auth-21.0.1/AndroidManifest.xml:69:17-89
	android:name
		ADDED from [com.google.firebase:firebase-auth:21.0.1] /Users/aftab/.gradle/caches/transforms-2/files-2.1/499d23dc3ef10de152fc54312b4b7237/jetified-firebase-auth-21.0.1/AndroidManifest.xml:69:25-86
meta-data#com.google.firebase.components:com.google.firebase.auth.FirebaseAuthRegistrar
ADDED from [com.google.firebase:firebase-auth:21.0.1] /Users/aftab/.gradle/caches/transforms-2/files-2.1/499d23dc3ef10de152fc54312b4b7237/jetified-firebase-auth-21.0.1/AndroidManifest.xml:77:13-79:85
	android:value
		ADDED from [com.google.firebase:firebase-auth:21.0.1] /Users/aftab/.gradle/caches/transforms-2/files-2.1/499d23dc3ef10de152fc54312b4b7237/jetified-firebase-auth-21.0.1/AndroidManifest.xml:79:17-82
	android:name
		ADDED from [com.google.firebase:firebase-auth:21.0.1] /Users/aftab/.gradle/caches/transforms-2/files-2.1/499d23dc3ef10de152fc54312b4b7237/jetified-firebase-auth-21.0.1/AndroidManifest.xml:78:17-109
meta-data#com.google.firebase.components:com.google.firebase.firestore.FirestoreRegistrar
ADDED from [com.google.firebase:firebase-firestore:24.0.0] /Users/aftab/.gradle/caches/transforms-2/files-2.1/f21a76f24437b73ad1f45e532dc64453/jetified-firebase-firestore-24.0.0/AndroidManifest.xml:20:13-22:85
	android:value
		ADDED from [com.google.firebase:firebase-firestore:24.0.0] /Users/aftab/.gradle/caches/transforms-2/files-2.1/f21a76f24437b73ad1f45e532dc64453/jetified-firebase-firestore-24.0.0/AndroidManifest.xml:22:17-82
	android:name
		ADDED from [com.google.firebase:firebase-firestore:24.0.0] /Users/aftab/.gradle/caches/transforms-2/files-2.1/f21a76f24437b73ad1f45e532dc64453/jetified-firebase-firestore-24.0.0/AndroidManifest.xml:21:17-111
meta-data#com.google.firebase.components:com.google.firebase.storage.StorageRegistrar
ADDED from [com.google.firebase:firebase-storage:20.0.0] /Users/aftab/.gradle/caches/transforms-2/files-2.1/400f0e5c52d1bf847c9a139cafefd0a5/jetified-firebase-storage-20.0.0/AndroidManifest.xml:33:13-35:85
	android:value
		ADDED from [com.google.firebase:firebase-storage:20.0.0] /Users/aftab/.gradle/caches/transforms-2/files-2.1/400f0e5c52d1bf847c9a139cafefd0a5/jetified-firebase-storage-20.0.0/AndroidManifest.xml:35:17-82
	android:name
		ADDED from [com.google.firebase:firebase-storage:20.0.0] /Users/aftab/.gradle/caches/transforms-2/files-2.1/400f0e5c52d1bf847c9a139cafefd0a5/jetified-firebase-storage-20.0.0/AndroidManifest.xml:34:17-107
provider#com.google.firebase.provider.FirebaseInitProvider
ADDED from [com.google.firebase:firebase-common:20.0.0] /Users/aftab/.gradle/caches/transforms-2/files-2.1/d5eb73e07577dc9aed23faaa7798a90b/jetified-firebase-common-20.0.0/AndroidManifest.xml:26:9-31:39
	android:authorities
		ADDED from [com.google.firebase:firebase-common:20.0.0] /Users/aftab/.gradle/caches/transforms-2/files-2.1/d5eb73e07577dc9aed23faaa7798a90b/jetified-firebase-common-20.0.0/AndroidManifest.xml:28:13-72
	android:exported
		ADDED from [com.google.firebase:firebase-common:20.0.0] /Users/aftab/.gradle/caches/transforms-2/files-2.1/d5eb73e07577dc9aed23faaa7798a90b/jetified-firebase-common-20.0.0/AndroidManifest.xml:30:13-37
	android:directBootAware
		ADDED from [com.google.firebase:firebase-common:20.0.0] /Users/aftab/.gradle/caches/transforms-2/files-2.1/d5eb73e07577dc9aed23faaa7798a90b/jetified-firebase-common-20.0.0/AndroidManifest.xml:29:13-43
	android:initOrder
		ADDED from [com.google.firebase:firebase-common:20.0.0] /Users/aftab/.gradle/caches/transforms-2/files-2.1/d5eb73e07577dc9aed23faaa7798a90b/jetified-firebase-common-20.0.0/AndroidManifest.xml:31:13-36
	android:name
		ADDED from [com.google.firebase:firebase-common:20.0.0] /Users/aftab/.gradle/caches/transforms-2/files-2.1/d5eb73e07577dc9aed23faaa7798a90b/jetified-firebase-common-20.0.0/AndroidManifest.xml:27:13-77
activity#com.google.android.gms.common.api.GoogleApiActivity
ADDED from [com.google.android.gms:play-services-base:17.1.0] /Users/aftab/.gradle/caches/transforms-2/files-2.1/e91c76fa5178367a03077f75662eefda/jetified-play-services-base-17.1.0/AndroidManifest.xml:23:9-26:75
	android:exported
		ADDED from [com.google.android.gms:play-services-base:17.1.0] /Users/aftab/.gradle/caches/transforms-2/files-2.1/e91c76fa5178367a03077f75662eefda/jetified-play-services-base-17.1.0/AndroidManifest.xml:25:13-37
	android:theme
		ADDED from [com.google.android.gms:play-services-base:17.1.0] /Users/aftab/.gradle/caches/transforms-2/files-2.1/e91c76fa5178367a03077f75662eefda/jetified-play-services-base-17.1.0/AndroidManifest.xml:26:13-72
	android:name
		ADDED from [com.google.android.gms:play-services-base:17.1.0] /Users/aftab/.gradle/caches/transforms-2/files-2.1/e91c76fa5178367a03077f75662eefda/jetified-play-services-base-17.1.0/AndroidManifest.xml:24:13-79
meta-data#com.google.android.gms.version
ADDED from [com.google.android.gms:play-services-basement:17.1.0] /Users/aftab/.gradle/caches/transforms-2/files-2.1/6c6a30651b973815be9d778b61d96729/jetified-play-services-basement-17.1.0/AndroidManifest.xml:23:9-25:69
	android:value
		ADDED from [com.google.android.gms:play-services-basement:17.1.0] /Users/aftab/.gradle/caches/transforms-2/files-2.1/6c6a30651b973815be9d778b61d96729/jetified-play-services-basement-17.1.0/AndroidManifest.xml:25:13-66
	android:name
		ADDED from [com.google.android.gms:play-services-basement:17.1.0] /Users/aftab/.gradle/caches/transforms-2/files-2.1/6c6a30651b973815be9d778b61d96729/jetified-play-services-basement-17.1.0/AndroidManifest.xml:24:13-58
