2022-02-09 11:24:34.737 +05:30 [INF] Now listening on: https://localhost:7205
2022-02-09 11:24:34.752 +05:30 [INF] Now listening on: http://localhost:5097
2022-02-09 11:24:34.761 +05:30 [INF] Application started. Press Ctrl+C to shut down.
2022-02-09 11:24:34.762 +05:30 [INF] Hosting environment: Development
2022-02-09 11:24:34.763 +05:30 [INF] Content root path: D:\Shivani Khandelwal\Projects\MangoRestaurent\Mango.Service.ProductAPI\
2022-02-09 11:24:36.018 +05:30 [INF] Request starting HTTP/2 GET https://localhost:7205/swagger/index.html - -
2022-02-09 11:24:36.613 +05:30 [INF] HTTP GET /swagger/index.html ({UserId}) responded 200 in 462.3771ms
2022-02-09 11:24:36.632 +05:30 [INF] Request starting HTTP/2 GET https://localhost:7205/_framework/aspnetcore-browser-refresh.js - -
2022-02-09 11:24:36.656 +05:30 [INF] Request finished HTTP/2 GET https://localhost:7205/swagger/index.html - - - 200 - text/html;charset=utf-8 646.6432ms
2022-02-09 11:24:36.657 +05:30 [INF] Request finished HTTP/2 GET https://localhost:7205/_framework/aspnetcore-browser-refresh.js - - - 200 11958 application/javascript;+charset=utf-8 23.5584ms
2022-02-09 11:24:37.117 +05:30 [INF] Request starting HTTP/2 GET https://localhost:7205/swagger/v1/swagger.json - -
2022-02-09 11:24:37.419 +05:30 [INF] HTTP GET /swagger/v1/swagger.json ({UserId}) responded 200 in 299.3702ms
2022-02-09 11:24:37.424 +05:30 [INF] Request finished HTTP/2 GET https://localhost:7205/swagger/v1/swagger.json - - - 200 - application/json;charset=utf-8 307.3097ms
2022-02-09 11:26:06.166 +05:30 [INF] Request starting HTTP/2 GET https://localhost:7205/api/product/Products - -
2022-02-09 11:26:06.184 +05:30 [INF] Executing endpoint 'Mango.Service.ProductAPI.Controllers.ProductAPIController.GetProducts (Mango.Service.ProductAPI)'
2022-02-09 11:26:06.228 +05:30 [INF] Route matched with {action = "GetProducts", controller = "ProductAPI"}. Executing controller action with signature System.Threading.Tasks.Task`1[Mango.Service.ProductAPI.Models.DTO.ResultDTO] GetProducts() on controller Mango.Service.ProductAPI.Controllers.ProductAPIController (Mango.Service.ProductAPI).
2022-02-09 11:26:09.587 +05:30 [INF] Entity Framework Core 6.0.1 initialized 'ApplicationDbContext' using provider 'Microsoft.EntityFrameworkCore.SqlServer:6.0.1' with options: None
2022-02-09 11:26:14.116 +05:30 [INF] Executed DbCommand (191ms) [Parameters=[], CommandType='"Text"', CommandTimeout='30']
SELECT [p].[ProductId], [p].[CategoryName], [p].[Description], [p].[ImageURL], [p].[Name], [p].[Price]
FROM [Products] AS [p]
2022-02-09 11:26:14.298 +05:30 [INF] Executing ObjectResult, writing value of type 'Mango.Service.ProductAPI.Models.DTO.ResultDTO'.
2022-02-09 11:26:14.327 +05:30 [INF] Executed action Mango.Service.ProductAPI.Controllers.ProductAPIController.GetProducts (Mango.Service.ProductAPI) in 8085.2793ms
2022-02-09 11:26:14.333 +05:30 [INF] Executed endpoint 'Mango.Service.ProductAPI.Controllers.ProductAPIController.GetProducts (Mango.Service.ProductAPI)'
2022-02-09 11:26:14.337 +05:30 [INF] HTTP GET /api/product/Products ({UserId}) responded 200 in 8167.5957ms
2022-02-09 11:26:14.361 +05:30 [INF] Request finished HTTP/2 GET https://localhost:7205/api/product/Products - - - 200 - application/json;+charset=utf-8 8197.7290ms
2022-02-09 11:45:00.279 +05:30 [INF] Now listening on: https://localhost:7205
2022-02-09 11:45:00.302 +05:30 [INF] Now listening on: http://localhost:5097
2022-02-09 11:45:00.310 +05:30 [INF] Application started. Press Ctrl+C to shut down.
2022-02-09 11:45:00.312 +05:30 [INF] Hosting environment: Development
2022-02-09 11:45:00.313 +05:30 [INF] Content root path: D:\Shivani Khandelwal\Projects\MangoRestaurent\Mango.Service.ProductAPI\
2022-02-09 11:45:01.323 +05:30 [INF] Request starting HTTP/2 GET https://localhost:7205/swagger/index.html - -
2022-02-09 11:45:01.628 +05:30 [INF] HTTP GET /swagger/index.html ({UserId}) responded 200 in 232.2003ms
2022-02-09 11:45:01.644 +05:30 [INF] Request finished HTTP/2 GET https://localhost:7205/swagger/index.html - - - 200 - text/html;charset=utf-8 322.3817ms
2022-02-09 11:45:01.649 +05:30 [INF] Request starting HTTP/2 GET https://localhost:7205/_framework/aspnetcore-browser-refresh.js - -
2022-02-09 11:45:01.664 +05:30 [INF] Request finished HTTP/2 GET https://localhost:7205/_framework/aspnetcore-browser-refresh.js - - - 200 11958 application/javascript;+charset=utf-8 15.4128ms
2022-02-09 11:45:01.923 +05:30 [INF] Request starting HTTP/2 GET https://localhost:7205/swagger/v1/swagger.json - -
2022-02-09 11:45:02.027 +05:30 [INF] HTTP GET /swagger/v1/swagger.json ({UserId}) responded 200 in 103.4800ms
2022-02-09 11:45:02.031 +05:30 [INF] Request finished HTTP/2 GET https://localhost:7205/swagger/v1/swagger.json - - - 200 - application/json;charset=utf-8 108.4916ms
2022-02-09 11:45:35.000 +05:30 [INF] Request starting HTTP/2 GET https://localhost:7205/api/product/Products - -
2022-02-09 11:45:35.008 +05:30 [INF] Executing endpoint 'Mango.Service.ProductAPI.Controllers.ProductAPIController.GetProducts (Mango.Service.ProductAPI)'
2022-02-09 11:45:35.027 +05:30 [INF] Route matched with {action = "GetProducts", controller = "ProductAPI"}. Executing controller action with signature System.Threading.Tasks.Task`1[Mango.Service.ProductAPI.Models.DTO.ResultDTO] GetProducts() on controller Mango.Service.ProductAPI.Controllers.ProductAPIController (Mango.Service.ProductAPI).
2022-02-09 11:45:35.204 +05:30 [INF] Inside Get Product Method
2022-02-09 11:45:35.725 +05:30 [INF] Entity Framework Core 6.0.1 initialized 'ApplicationDbContext' using provider 'Microsoft.EntityFrameworkCore.SqlServer:6.0.1' with options: None
2022-02-09 11:45:37.202 +05:30 [INF] Executed DbCommand (131ms) [Parameters=[], CommandType='"Text"', CommandTimeout='30']
SELECT [p].[ProductId], [p].[CategoryName], [p].[Description], [p].[ImageURL], [p].[Name], [p].[Price]
FROM [Products] AS [p]
2022-02-09 11:45:37.263 +05:30 [INF] Executing ObjectResult, writing value of type 'Mango.Service.ProductAPI.Models.DTO.ResultDTO'.
2022-02-09 11:45:37.274 +05:30 [INF] Executed action Mango.Service.ProductAPI.Controllers.ProductAPIController.GetProducts (Mango.Service.ProductAPI) in 2238.0423ms
2022-02-09 11:45:37.276 +05:30 [INF] Executed endpoint 'Mango.Service.ProductAPI.Controllers.ProductAPIController.GetProducts (Mango.Service.ProductAPI)'
2022-02-09 11:45:37.278 +05:30 [INF] HTTP GET /api/product/Products ({UserId}) responded 200 in 2275.9183ms
2022-02-09 11:45:37.286 +05:30 [INF] Request finished HTTP/2 GET https://localhost:7205/api/product/Products - - - 200 - application/json;+charset=utf-8 2286.0924ms
2022-02-09 11:55:06.998 +05:30 [INF] Now listening on: https://localhost:7205
2022-02-09 11:55:07.007 +05:30 [INF] Now listening on: http://localhost:5097
2022-02-09 11:55:07.012 +05:30 [INF] Application started. Press Ctrl+C to shut down.
2022-02-09 11:55:07.013 +05:30 [INF] Hosting environment: Development
2022-02-09 11:55:07.013 +05:30 [INF] Content root path: D:\Shivani Khandelwal\Projects\MangoRestaurent\Mango.Service.ProductAPI\
2022-02-09 11:55:08.394 +05:30 [INF] Request starting HTTP/2 GET https://localhost:7205/swagger/index.html - -
2022-02-09 11:55:08.687 +05:30 [INF] HTTP GET /swagger/index.html ({UserId}) responded 200 in 225.8594ms
2022-02-09 11:55:08.699 +05:30 [INF] Request finished HTTP/2 GET https://localhost:7205/swagger/index.html - - - 200 - text/html;charset=utf-8 309.4075ms
2022-02-09 11:55:08.711 +05:30 [INF] Request starting HTTP/2 GET https://localhost:7205/_framework/aspnetcore-browser-refresh.js - -
2022-02-09 11:55:08.715 +05:30 [INF] Request finished HTTP/2 GET https://localhost:7205/_framework/aspnetcore-browser-refresh.js - - - 200 11958 application/javascript;+charset=utf-8 4.2465ms
2022-02-09 11:55:08.923 +05:30 [INF] Request starting HTTP/2 GET https://localhost:7205/swagger/v1/swagger.json - -
2022-02-09 11:55:09.025 +05:30 [INF] HTTP GET /swagger/v1/swagger.json ({UserId}) responded 200 in 101.5231ms
2022-02-09 11:55:09.027 +05:30 [INF] Request finished HTTP/2 GET https://localhost:7205/swagger/v1/swagger.json - - - 200 - application/json;charset=utf-8 104.2083ms
2022-02-09 11:56:00.225 +05:30 [INF] Request starting HTTP/2 POST https://localhost:7205/api/product/CreateProduct application/json 272
2022-02-09 11:56:00.365 +05:30 [INF] Executing endpoint 'Mango.Service.ProductAPI.Controllers.ProductAPIController.CreateProduct (Mango.Service.ProductAPI)'
2022-02-09 11:56:00.400 +05:30 [INF] Route matched with {action = "CreateProduct", controller = "ProductAPI"}. Executing controller action with signature System.Threading.Tasks.Task`1[Mango.Service.ProductAPI.Models.DTO.ResultDTO] CreateProduct(Mango.Service.ProductAPI.Models.DTO.ProductDTO) on controller Mango.Service.ProductAPI.Controllers.ProductAPIController (Mango.Service.ProductAPI).
2022-02-09 11:56:01.084 +05:30 [INF] Entity Framework Core 6.0.1 initialized 'ApplicationDbContext' using provider 'Microsoft.EntityFrameworkCore.SqlServer:6.0.1' with options: None
2022-02-09 11:56:02.024 +05:30 [INF] Executed DbCommand (324ms) [Parameters=[@p0='?' (Size = 4000), @p1='?' (Size = 4000), @p2='?' (Size = 4000), @p3='?' (Size = 4000), @p4='?' (DbType = Double)], CommandType='"Text"', CommandTimeout='30']
SET NOCOUNT ON;
INSERT INTO [Products] ([CategoryName], [Description], [ImageURL], [Name], [Price])
VALUES (@p0, @p1, @p2, @p3, @p4);
SELECT [ProductId]
FROM [Products]
WHERE @@ROWCOUNT = 1 AND [ProductId] = scope_identity();
2022-02-09 11:56:02.093 +05:30 [INF] Executing ObjectResult, writing value of type 'Mango.Service.ProductAPI.Models.DTO.ResultDTO'.
2022-02-09 11:56:02.104 +05:30 [INF] Executed action Mango.Service.ProductAPI.Controllers.ProductAPIController.CreateProduct (Mango.Service.ProductAPI) in 1697.6423ms
2022-02-09 11:56:02.106 +05:30 [INF] Executed endpoint 'Mango.Service.ProductAPI.Controllers.ProductAPIController.CreateProduct (Mango.Service.ProductAPI)'
2022-02-09 11:56:02.108 +05:30 [INF] HTTP POST /api/product/CreateProduct ({UserId}) responded 200 in 1750.4282ms
2022-02-09 11:56:02.116 +05:30 [INF] Request finished HTTP/2 POST https://localhost:7205/api/product/CreateProduct application/json 272 - 200 - application/json;+charset=utf-8 1891.7307ms
2022-02-09 11:56:33.517 +05:30 [INF] Request starting HTTP/2 POST https://localhost:7205/api/product/CreateProduct application/json 272
2022-02-09 11:56:33.532 +05:30 [INF] Executing endpoint 'Mango.Service.ProductAPI.Controllers.ProductAPIController.CreateProduct (Mango.Service.ProductAPI)'
2022-02-09 11:56:33.533 +05:30 [INF] Route matched with {action = "CreateProduct", controller = "ProductAPI"}. Executing controller action with signature System.Threading.Tasks.Task`1[Mango.Service.ProductAPI.Models.DTO.ResultDTO] CreateProduct(Mango.Service.ProductAPI.Models.DTO.ProductDTO) on controller Mango.Service.ProductAPI.Controllers.ProductAPIController (Mango.Service.ProductAPI).
2022-02-09 11:56:33.581 +05:30 [INF] Entity Framework Core 6.0.1 initialized 'ApplicationDbContext' using provider 'Microsoft.EntityFrameworkCore.SqlServer:6.0.1' with options: None
2022-02-09 11:56:33.603 +05:30 [INF] Executed DbCommand (15ms) [Parameters=[@p0='?' (Size = 4000), @p1='?' (Size = 4000), @p2='?' (Size = 4000), @p3='?' (Size = 4000), @p4='?' (DbType = Double)], CommandType='"Text"', CommandTimeout='30']
SET NOCOUNT ON;
INSERT INTO [Products] ([CategoryName], [Description], [ImageURL], [Name], [Price])
VALUES (@p0, @p1, @p2, @p3, @p4);
SELECT [ProductId]
FROM [Products]
WHERE @@ROWCOUNT = 1 AND [ProductId] = scope_identity();
2022-02-09 11:56:33.608 +05:30 [INF] Executing ObjectResult, writing value of type 'Mango.Service.ProductAPI.Models.DTO.ResultDTO'.
2022-02-09 11:56:33.609 +05:30 [INF] Executed action Mango.Service.ProductAPI.Controllers.ProductAPIController.CreateProduct (Mango.Service.ProductAPI) in 75.2689ms
2022-02-09 11:56:33.611 +05:30 [INF] Executed endpoint 'Mango.Service.ProductAPI.Controllers.ProductAPIController.CreateProduct (Mango.Service.ProductAPI)'
2022-02-09 11:56:33.611 +05:30 [INF] HTTP POST /api/product/CreateProduct ({UserId}) responded 200 in 80.0378ms
2022-02-09 11:56:33.613 +05:30 [INF] Request finished HTTP/2 POST https://localhost:7205/api/product/CreateProduct application/json 272 - 200 - application/json;+charset=utf-8 96.4129ms
2022-02-09 11:56:56.450 +05:30 [INF] Request starting HTTP/2 POST https://localhost:7205/api/product/CreateProduct application/json 272
2022-02-09 11:56:56.454 +05:30 [INF] Executing endpoint 'Mango.Service.ProductAPI.Controllers.ProductAPIController.CreateProduct (Mango.Service.ProductAPI)'
2022-02-09 11:56:56.461 +05:30 [INF] Route matched with {action = "CreateProduct", controller = "ProductAPI"}. Executing controller action with signature System.Threading.Tasks.Task`1[Mango.Service.ProductAPI.Models.DTO.ResultDTO] CreateProduct(Mango.Service.ProductAPI.Models.DTO.ProductDTO) on controller Mango.Service.ProductAPI.Controllers.ProductAPIController (Mango.Service.ProductAPI).
2022-02-09 11:56:56.475 +05:30 [INF] Entity Framework Core 6.0.1 initialized 'ApplicationDbContext' using provider 'Microsoft.EntityFrameworkCore.SqlServer:6.0.1' with options: None
2022-02-09 11:56:56.481 +05:30 [INF] Executed DbCommand (2ms) [Parameters=[@p0='?' (Size = 4000), @p1='?' (Size = 4000), @p2='?' (Size = 4000), @p3='?' (Size = 4000), @p4='?' (DbType = Double)], CommandType='"Text"', CommandTimeout='30']
SET NOCOUNT ON;
INSERT INTO [Products] ([CategoryName], [Description], [ImageURL], [Name], [Price])
VALUES (@p0, @p1, @p2, @p3, @p4);
SELECT [ProductId]
FROM [Products]
WHERE @@ROWCOUNT = 1 AND [ProductId] = scope_identity();
2022-02-09 11:56:56.484 +05:30 [INF] Executing ObjectResult, writing value of type 'Mango.Service.ProductAPI.Models.DTO.ResultDTO'.
2022-02-09 11:56:56.485 +05:30 [INF] Executed action Mango.Service.ProductAPI.Controllers.ProductAPIController.CreateProduct (Mango.Service.ProductAPI) in 19.6659ms
2022-02-09 11:56:56.486 +05:30 [INF] Executed endpoint 'Mango.Service.ProductAPI.Controllers.ProductAPIController.CreateProduct (Mango.Service.ProductAPI)'
2022-02-09 11:56:56.487 +05:30 [INF] HTTP POST /api/product/CreateProduct ({UserId}) responded 200 in 33.2447ms
2022-02-09 11:56:56.488 +05:30 [INF] Request finished HTTP/2 POST https://localhost:7205/api/product/CreateProduct application/json 272 - 200 - application/json;+charset=utf-8 38.5113ms
2022-02-09 11:57:08.839 +05:30 [INF] Request starting HTTP/2 POST https://localhost:7205/api/product/CreateProduct application/json 272
2022-02-09 11:57:08.840 +05:30 [INF] Executing endpoint 'Mango.Service.ProductAPI.Controllers.ProductAPIController.CreateProduct (Mango.Service.ProductAPI)'
2022-02-09 11:57:08.842 +05:30 [INF] Route matched with {action = "CreateProduct", controller = "ProductAPI"}. Executing controller action with signature System.Threading.Tasks.Task`1[Mango.Service.ProductAPI.Models.DTO.ResultDTO] CreateProduct(Mango.Service.ProductAPI.Models.DTO.ProductDTO) on controller Mango.Service.ProductAPI.Controllers.ProductAPIController (Mango.Service.ProductAPI).
2022-02-09 11:57:08.846 +05:30 [INF] Entity Framework Core 6.0.1 initialized 'ApplicationDbContext' using provider 'Microsoft.EntityFrameworkCore.SqlServer:6.0.1' with options: None
2022-02-09 11:57:08.852 +05:30 [INF] Executed DbCommand (3ms) [Parameters=[@p0='?' (Size = 4000), @p1='?' (Size = 4000), @p2='?' (Size = 4000), @p3='?' (Size = 4000), @p4='?' (DbType = Double)], CommandType='"Text"', CommandTimeout='30']
SET NOCOUNT ON;
INSERT INTO [Products] ([CategoryName], [Description], [ImageURL], [Name], [Price])
VALUES (@p0, @p1, @p2, @p3, @p4);
SELECT [ProductId]
FROM [Products]
WHERE @@ROWCOUNT = 1 AND [ProductId] = scope_identity();
2022-02-09 11:57:08.855 +05:30 [INF] Executing ObjectResult, writing value of type 'Mango.Service.ProductAPI.Models.DTO.ResultDTO'.
2022-02-09 11:57:08.857 +05:30 [INF] Executed action Mango.Service.ProductAPI.Controllers.ProductAPIController.CreateProduct (Mango.Service.ProductAPI) in 12.8001ms
2022-02-09 11:57:08.858 +05:30 [INF] Executed endpoint 'Mango.Service.ProductAPI.Controllers.ProductAPIController.CreateProduct (Mango.Service.ProductAPI)'
2022-02-09 11:57:08.859 +05:30 [INF] HTTP POST /api/product/CreateProduct ({UserId}) responded 200 in 18.4803ms
2022-02-09 11:57:08.860 +05:30 [INF] Request finished HTTP/2 POST https://localhost:7205/api/product/CreateProduct application/json 272 - 200 - application/json;+charset=utf-8 21.6414ms
2022-02-09 12:48:14.194 +05:30 [INF] Now listening on: https://localhost:7205
2022-02-09 12:48:14.309 +05:30 [INF] Now listening on: http://localhost:5097
2022-02-09 12:48:14.318 +05:30 [INF] Application started. Press Ctrl+C to shut down.
2022-02-09 12:48:14.319 +05:30 [INF] Hosting environment: Development
2022-02-09 12:48:14.320 +05:30 [INF] Content root path: D:\Shivani Khandelwal\Projects\MangoRestaurent\Mango.Service.ProductAPI\
2022-02-09 12:48:15.632 +05:30 [INF] Request starting HTTP/2 GET https://localhost:7205/swagger/index.html - -
2022-02-09 12:48:15.929 +05:30 [INF] HTTP GET /swagger/index.html ({UserId}) responded 200 in 240.1971ms
2022-02-09 12:48:15.943 +05:30 [INF] Request starting HTTP/2 GET https://localhost:7205/_framework/aspnetcore-browser-refresh.js - -
2022-02-09 12:48:15.948 +05:30 [INF] Request finished HTTP/2 GET https://localhost:7205/swagger/index.html - - - 200 - text/html;charset=utf-8 322.9490ms
2022-02-09 12:48:15.955 +05:30 [INF] Request finished HTTP/2 GET https://localhost:7205/_framework/aspnetcore-browser-refresh.js - - - 200 11958 application/javascript;+charset=utf-8 12.5950ms
2022-02-09 12:48:16.356 +05:30 [INF] Request starting HTTP/2 GET https://localhost:7205/swagger/v1/swagger.json - -
2022-02-09 12:48:16.479 +05:30 [INF] HTTP GET /swagger/v1/swagger.json ({UserId}) responded 200 in 122.2617ms
2022-02-09 12:48:16.481 +05:30 [INF] Request finished HTTP/2 GET https://localhost:7205/swagger/v1/swagger.json - - - 200 - application/json;charset=utf-8 125.3075ms
2022-02-11 12:23:20.099 +05:30 [INF] Now listening on: https://localhost:7205
2022-02-11 12:23:20.113 +05:30 [INF] Now listening on: http://localhost:5097
2022-02-11 12:23:20.121 +05:30 [INF] Application started. Press Ctrl+C to shut down.
2022-02-11 12:23:20.123 +05:30 [INF] Hosting environment: Development
2022-02-11 12:23:20.124 +05:30 [INF] Content root path: D:\Shivani Khandelwal\Projects\MangoRestaurent\Mango.Service.ProductAPI\
2022-02-11 12:23:21.102 +05:30 [INF] Request starting HTTP/2 GET https://localhost:7205/swagger/index.html - -
2022-02-11 12:23:21.480 +05:30 [INF] HTTP GET /swagger/index.html ({UserId}) responded 200 in 306.8634ms
2022-02-11 12:23:21.509 +05:30 [INF] Request starting HTTP/2 GET https://localhost:7205/_framework/aspnetcore-browser-refresh.js - -
2022-02-11 12:23:21.510 +05:30 [INF] Request finished HTTP/2 GET https://localhost:7205/swagger/index.html - - - 200 - text/html;charset=utf-8 411.4897ms
2022-02-11 12:23:21.514 +05:30 [INF] Request finished HTTP/2 GET https://localhost:7205/_framework/aspnetcore-browser-refresh.js - - - 200 11958 application/javascript;+charset=utf-8 4.7620ms
2022-02-11 12:23:21.721 +05:30 [INF] Request starting HTTP/2 GET https://localhost:7205/swagger/v1/swagger.json - -
2022-02-11 12:23:21.833 +05:30 [INF] HTTP GET /swagger/v1/swagger.json ({UserId}) responded 200 in 109.7838ms
2022-02-11 12:23:21.838 +05:30 [INF] Request finished HTTP/2 GET https://localhost:7205/swagger/v1/swagger.json - - - 200 - application/json;charset=utf-8 116.4289ms
2022-02-11 12:23:34.290 +05:30 [INF] Request starting HTTP/1.1 GET https://localhost:7205/api/product/Products - -
2022-02-11 12:23:34.300 +05:30 [INF] Executing endpoint 'Mango.Service.ProductAPI.Controllers.ProductAPIController.GetProducts (Mango.Service.ProductAPI)'
2022-02-11 12:23:34.322 +05:30 [INF] Route matched with {action = "GetProducts", controller = "ProductAPI"}. Executing controller action with signature System.Threading.Tasks.Task`1[Mango.Service.ProductAPI.Models.DTO.ResultDTO] GetProducts() on controller Mango.Service.ProductAPI.Controllers.ProductAPIController (Mango.Service.ProductAPI).
2022-02-11 12:23:35.564 +05:30 [INF] Entity Framework Core 6.0.1 initialized 'ApplicationDbContext' using provider 'Microsoft.EntityFrameworkCore.SqlServer:6.0.1' with options: None
2022-02-11 12:23:37.529 +05:30 [INF] Executed DbCommand (62ms) [Parameters=[], CommandType='"Text"', CommandTimeout='30']
SELECT [p].[ProductId], [p].[CategoryName], [p].[Description], [p].[ImageURL], [p].[Name], [p].[Price]
FROM [Products] AS [p]
2022-02-11 12:23:37.746 +05:30 [INF] Executing ObjectResult, writing value of type 'Mango.Service.ProductAPI.Models.DTO.ResultDTO'.
2022-02-11 12:23:37.761 +05:30 [INF] Executed action Mango.Service.ProductAPI.Controllers.ProductAPIController.GetProducts (Mango.Service.ProductAPI) in 3433.0035ms
2022-02-11 12:23:37.764 +05:30 [INF] Executed endpoint 'Mango.Service.ProductAPI.Controllers.ProductAPIController.GetProducts (Mango.Service.ProductAPI)'
2022-02-11 12:23:37.766 +05:30 [INF] HTTP GET /api/product/Products ({UserId}) responded 200 in 3472.3889ms
2022-02-11 12:23:37.774 +05:30 [INF] Request finished HTTP/1.1 GET https://localhost:7205/api/product/Products - - - 200 - application/json;+charset=utf-8 3483.3465ms
2022-02-11 12:24:30.819 +05:30 [INF] Request starting HTTP/1.1 GET https://localhost:7205/api/product/Products - -
2022-02-11 12:24:30.825 +05:30 [INF] Executing endpoint 'Mango.Service.ProductAPI.Controllers.ProductAPIController.GetProducts (Mango.Service.ProductAPI)'
2022-02-11 12:24:30.830 +05:30 [INF] Route matched with {action = "GetProducts", controller = "ProductAPI"}. Executing controller action with signature System.Threading.Tasks.Task`1[Mango.Service.ProductAPI.Models.DTO.ResultDTO] GetProducts() on controller Mango.Service.ProductAPI.Controllers.ProductAPIController (Mango.Service.ProductAPI).
2022-02-11 12:24:30.866 +05:30 [INF] Entity Framework Core 6.0.1 initialized 'ApplicationDbContext' using provider 'Microsoft.EntityFrameworkCore.SqlServer:6.0.1' with options: None
2022-02-11 12:24:30.880 +05:30 [INF] Executed DbCommand (6ms) [Parameters=[], CommandType='"Text"', CommandTimeout='30']
SELECT [p].[ProductId], [p].[CategoryName], [p].[Description], [p].[ImageURL], [p].[Name], [p].[Price]
FROM [Products] AS [p]
2022-02-11 12:24:30.883 +05:30 [INF] Executing ObjectResult, writing value of type 'Mango.Service.ProductAPI.Models.DTO.ResultDTO'.
2022-02-11 12:24:30.884 +05:30 [INF] Executed action Mango.Service.ProductAPI.Controllers.ProductAPIController.GetProducts (Mango.Service.ProductAPI) in 46.928ms
2022-02-11 12:24:30.886 +05:30 [INF] Executed endpoint 'Mango.Service.ProductAPI.Controllers.ProductAPIController.GetProducts (Mango.Service.ProductAPI)'
2022-02-11 12:24:30.889 +05:30 [INF] HTTP GET /api/product/Products ({UserId}) responded 200 in 64.3158ms
2022-02-11 12:24:30.891 +05:30 [INF] Request finished HTTP/1.1 GET https://localhost:7205/api/product/Products - - - 200 - application/json;+charset=utf-8 72.2368ms
2022-02-11 12:31:28.652 +05:30 [INF] Now listening on: https://localhost:7205
2022-02-11 12:31:28.688 +05:30 [INF] Now listening on: http://localhost:5097
2022-02-11 12:31:28.697 +05:30 [INF] Application started. Press Ctrl+C to shut down.
2022-02-11 12:31:28.699 +05:30 [INF] Hosting environment: Development
2022-02-11 12:31:28.700 +05:30 [INF] Content root path: D:\Shivani Khandelwal\Projects\MangoRestaurent\Mango.Service.ProductAPI\
2022-02-11 12:31:29.756 +05:30 [INF] Request starting HTTP/2 GET https://localhost:7205/swagger/index.html - -
2022-02-11 12:31:30.096 +05:30 [INF] HTTP GET /swagger/index.html ({UserId}) responded 200 in 276.3738ms
2022-02-11 12:31:30.109 +05:30 [INF] Request finished HTTP/2 GET https://localhost:7205/swagger/index.html - - - 200 - text/html;charset=utf-8 358.3150ms
2022-02-11 12:31:30.111 +05:30 [INF] Request starting HTTP/2 GET https://localhost:7205/_framework/aspnetcore-browser-refresh.js - -
2022-02-11 12:31:30.115 +05:30 [INF] Request finished HTTP/2 GET https://localhost:7205/_framework/aspnetcore-browser-refresh.js - - - 200 11958 application/javascript;+charset=utf-8 4.0086ms
2022-02-11 12:31:30.318 +05:30 [INF] Request starting HTTP/2 GET https://localhost:7205/swagger/v1/swagger.json - -
2022-02-11 12:31:30.436 +05:30 [INF] HTTP GET /swagger/v1/swagger.json ({UserId}) responded 200 in 115.5651ms
2022-02-11 12:31:30.440 +05:30 [INF] Request finished HTTP/2 GET https://localhost:7205/swagger/v1/swagger.json - - - 200 - application/json;charset=utf-8 122.4120ms
2022-02-11 12:32:06.970 +05:30 [INF] Request starting HTTP/1.1 GET https://localhost:7205/api/product/Products - -
2022-02-11 12:32:06.978 +05:30 [INF] Executing endpoint 'Mango.Service.ProductAPI.Controllers.ProductAPIController.GetProducts (Mango.Service.ProductAPI)'
2022-02-11 12:32:06.994 +05:30 [INF] Route matched with {action = "GetProducts", controller = "ProductAPI"}. Executing controller action with signature System.Threading.Tasks.Task`1[Mango.Service.ProductAPI.Models.DTO.ResultDTO] GetProducts() on controller Mango.Service.ProductAPI.Controllers.ProductAPIController (Mango.Service.ProductAPI).
2022-02-11 12:32:07.889 +05:30 [INF] Entity Framework Core 6.0.1 initialized 'ApplicationDbContext' using provider 'Microsoft.EntityFrameworkCore.SqlServer:6.0.1' with options: None
2022-02-11 12:32:09.631 +05:30 [INF] Executed DbCommand (129ms) [Parameters=[], CommandType='"Text"', CommandTimeout='30']
SELECT [p].[ProductId], [p].[CategoryName], [p].[Description], [p].[ImageURL], [p].[Name], [p].[Price]
FROM [Products] AS [p]
2022-02-11 12:32:09.734 +05:30 [INF] Executing ObjectResult, writing value of type 'Mango.Service.ProductAPI.Models.DTO.ResultDTO'.
2022-02-11 12:32:09.747 +05:30 [INF] Executed action Mango.Service.ProductAPI.Controllers.ProductAPIController.GetProducts (Mango.Service.ProductAPI) in 2746.0457ms
2022-02-11 12:32:09.749 +05:30 [INF] Executed endpoint 'Mango.Service.ProductAPI.Controllers.ProductAPIController.GetProducts (Mango.Service.ProductAPI)'
2022-02-11 12:32:09.751 +05:30 [INF] HTTP GET /api/product/Products ({UserId}) responded 200 in 2777.6963ms
2022-02-11 12:32:09.759 +05:30 [INF] Request finished HTTP/1.1 GET https://localhost:7205/api/product/Products - - - 200 - application/json;+charset=utf-8 2788.7504ms
2022-02-11 12:36:21.658 +05:30 [INF] Now listening on: https://localhost:7205
2022-02-11 12:36:21.667 +05:30 [INF] Now listening on: http://localhost:5097
2022-02-11 12:36:21.675 +05:30 [INF] Application started. Press Ctrl+C to shut down.
2022-02-11 12:36:21.676 +05:30 [INF] Hosting environment: Development
2022-02-11 12:36:21.676 +05:30 [INF] Content root path: D:\Shivani Khandelwal\Projects\MangoRestaurent\Mango.Service.ProductAPI\
2022-02-11 12:36:23.078 +05:30 [INF] Request starting HTTP/2 GET https://localhost:7205/swagger/index.html - -
2022-02-11 12:36:23.492 +05:30 [INF] HTTP GET /swagger/index.html ({UserId}) responded 200 in 320.7234ms
2022-02-11 12:36:23.514 +05:30 [INF] Request starting HTTP/2 GET https://localhost:7205/_framework/aspnetcore-browser-refresh.js - -
2022-02-11 12:36:23.523 +05:30 [INF] Request finished HTTP/2 GET https://localhost:7205/swagger/index.html - - - 200 - text/html;charset=utf-8 450.0272ms
2022-02-11 12:36:23.545 +05:30 [INF] Request finished HTTP/2 GET https://localhost:7205/_framework/aspnetcore-browser-refresh.js - - - 200 11958 application/javascript;+charset=utf-8 31.0764ms
2022-02-11 12:36:23.847 +05:30 [INF] Request starting HTTP/2 GET https://localhost:7205/swagger/v1/swagger.json - -
2022-02-11 12:36:24.052 +05:30 [INF] HTTP GET /swagger/v1/swagger.json ({UserId}) responded 200 in 203.6094ms
2022-02-11 12:36:24.054 +05:30 [INF] Request finished HTTP/2 GET https://localhost:7205/swagger/v1/swagger.json - - - 200 - application/json;charset=utf-8 206.9317ms
2022-02-11 12:36:32.947 +05:30 [INF] Request starting HTTP/1.1 GET https://localhost:7205/api/product/Products - -
2022-02-11 12:36:32.955 +05:30 [INF] Executing endpoint 'Mango.Service.ProductAPI.Controllers.ProductAPIController.GetProducts (Mango.Service.ProductAPI)'
2022-02-11 12:36:32.973 +05:30 [INF] Route matched with {action = "GetProducts", controller = "ProductAPI"}. Executing controller action with signature System.Threading.Tasks.Task`1[Mango.Service.ProductAPI.Models.DTO.ResultDTO] GetProducts() on controller Mango.Service.ProductAPI.Controllers.ProductAPIController (Mango.Service.ProductAPI).
2022-02-11 12:36:33.656 +05:30 [INF] Entity Framework Core 6.0.1 initialized 'ApplicationDbContext' using provider 'Microsoft.EntityFrameworkCore.SqlServer:6.0.1' with options: None
2022-02-11 12:36:34.757 +05:30 [INF] Executed DbCommand (154ms) [Parameters=[], CommandType='"Text"', CommandTimeout='30']
SELECT [p].[ProductId], [p].[CategoryName], [p].[Description], [p].[ImageURL], [p].[Name], [p].[Price]
FROM [Products] AS [p]
2022-02-11 12:36:34.891 +05:30 [INF] Executing ObjectResult, writing value of type 'Mango.Service.ProductAPI.Models.DTO.ResultDTO'.
2022-02-11 12:36:34.906 +05:30 [INF] Executed action Mango.Service.ProductAPI.Controllers.ProductAPIController.GetProducts (Mango.Service.ProductAPI) in 1926.1426ms
2022-02-11 12:36:34.909 +05:30 [INF] Executed endpoint 'Mango.Service.ProductAPI.Controllers.ProductAPIController.GetProducts (Mango.Service.ProductAPI)'
2022-02-11 12:36:34.912 +05:30 [INF] HTTP GET /api/product/Products ({UserId}) responded 200 in 1961.9376ms
2022-02-11 12:36:34.921 +05:30 [INF] Request finished HTTP/1.1 GET https://localhost:7205/api/product/Products - - - 200 - application/json;+charset=utf-8 1974.0037ms
2022-02-11 12:37:50.856 +05:30 [INF] Now listening on: https://localhost:7205
2022-02-11 12:37:50.875 +05:30 [INF] Now listening on: http://localhost:5097
2022-02-11 12:37:50.884 +05:30 [INF] Application started. Press Ctrl+C to shut down.
2022-02-11 12:37:50.886 +05:30 [INF] Hosting environment: Development
2022-02-11 12:37:50.887 +05:30 [INF] Content root path: D:\Shivani Khandelwal\Projects\MangoRestaurent\Mango.Service.ProductAPI\
2022-02-11 12:37:52.067 +05:30 [INF] Request starting HTTP/2 GET https://localhost:7205/swagger/index.html - -
2022-02-11 12:37:52.367 +05:30 [INF] HTTP GET /swagger/index.html ({UserId}) responded 200 in 240.7946ms
2022-02-11 12:37:52.391 +05:30 [INF] Request finished HTTP/2 GET https://localhost:7205/swagger/index.html - - - 200 - text/html;charset=utf-8 328.9281ms
2022-02-11 12:37:52.399 +05:30 [INF] Request starting HTTP/2 GET https://localhost:7205/_framework/aspnetcore-browser-refresh.js - -
2022-02-11 12:37:52.408 +05:30 [INF] Request finished HTTP/2 GET https://localhost:7205/_framework/aspnetcore-browser-refresh.js - - - 200 11958 application/javascript;+charset=utf-8 12.2026ms
2022-02-11 12:37:52.710 +05:30 [INF] Request starting HTTP/2 GET https://localhost:7205/swagger/v1/swagger.json - -
2022-02-11 12:37:52.872 +05:30 [INF] HTTP GET /swagger/v1/swagger.json ({UserId}) responded 200 in 160.5708ms
2022-02-11 12:37:52.874 +05:30 [INF] Request finished HTTP/2 GET https://localhost:7205/swagger/v1/swagger.json - - - 200 - application/json;charset=utf-8 164.2834ms
2022-02-11 12:37:58.349 +05:30 [INF] Request starting HTTP/1.1 GET https://localhost:7205/api/product/Products - -
2022-02-11 12:37:58.357 +05:30 [INF] Executing endpoint 'Mango.Service.ProductAPI.Controllers.ProductAPIController.GetProducts (Mango.Service.ProductAPI)'
2022-02-11 12:37:58.373 +05:30 [INF] Route matched with {action = "GetProducts", controller = "ProductAPI"}. Executing controller action with signature System.Threading.Tasks.Task`1[Mango.Service.ProductAPI.Models.DTO.ResultDTO] GetProducts() on controller Mango.Service.ProductAPI.Controllers.ProductAPIController (Mango.Service.ProductAPI).
2022-02-11 12:37:59.036 +05:30 [INF] Entity Framework Core 6.0.1 initialized 'ApplicationDbContext' using provider 'Microsoft.EntityFrameworkCore.SqlServer:6.0.1' with options: None
2022-02-11 12:38:00.683 +05:30 [INF] Executed DbCommand (179ms) [Parameters=[], CommandType='"Text"', CommandTimeout='30']
SELECT [p].[ProductId], [p].[CategoryName], [p].[Description], [p].[ImageURL], [p].[Name], [p].[Price]
FROM [Products] AS [p]
2022-02-11 12:38:00.861 +05:30 [INF] Executing ObjectResult, writing value of type 'Mango.Service.ProductAPI.Models.DTO.ResultDTO'.
2022-02-11 12:38:00.874 +05:30 [INF] Executed action Mango.Service.ProductAPI.Controllers.ProductAPIController.GetProducts (Mango.Service.ProductAPI) in 2494.2565ms
2022-02-11 12:38:00.876 +05:30 [INF] Executed endpoint 'Mango.Service.ProductAPI.Controllers.ProductAPIController.GetProducts (Mango.Service.ProductAPI)'
2022-02-11 12:38:00.878 +05:30 [INF] HTTP GET /api/product/Products ({UserId}) responded 200 in 2524.7049ms
2022-02-11 12:38:00.884 +05:30 [INF] Request finished HTTP/1.1 GET https://localhost:7205/api/product/Products - - - 200 - application/json;+charset=utf-8 2534.5052ms
2022-02-11 12:41:35.636 +05:30 [INF] Now listening on: https://localhost:7205
2022-02-11 12:41:35.647 +05:30 [INF] Now listening on: http://localhost:5097
2022-02-11 12:41:35.654 +05:30 [INF] Application started. Press Ctrl+C to shut down.
2022-02-11 12:41:35.655 +05:30 [INF] Hosting environment: Development
2022-02-11 12:41:35.656 +05:30 [INF] Content root path: D:\Shivani Khandelwal\Projects\MangoRestaurent\Mango.Service.ProductAPI\
2022-02-11 12:41:37.201 +05:30 [INF] Request starting HTTP/2 GET https://localhost:7205/swagger/index.html - -
2022-02-11 12:41:37.494 +05:30 [INF] HTTP GET /swagger/index.html ({UserId}) responded 200 in 217.6015ms
2022-02-11 12:41:37.512 +05:30 [INF] Request starting HTTP/2 GET https://localhost:7205/_framework/aspnetcore-browser-refresh.js - -
2022-02-11 12:41:37.518 +05:30 [INF] Request finished HTTP/2 GET https://localhost:7205/swagger/index.html - - - 200 - text/html;charset=utf-8 321.2844ms
2022-02-11 12:41:37.525 +05:30 [INF] Request finished HTTP/2 GET https://localhost:7205/_framework/aspnetcore-browser-refresh.js - - - 200 11958 application/javascript;+charset=utf-8 12.9254ms
2022-02-11 12:41:37.814 +05:30 [INF] Request starting HTTP/2 GET https://localhost:7205/swagger/v1/swagger.json - -
2022-02-11 12:41:37.966 +05:30 [INF] HTTP GET /swagger/v1/swagger.json ({UserId}) responded 200 in 149.9696ms
2022-02-11 12:41:37.970 +05:30 [INF] Request finished HTTP/2 GET https://localhost:7205/swagger/v1/swagger.json - - - 200 - application/json;charset=utf-8 155.6051ms
2022-02-11 12:41:43.394 +05:30 [INF] Request starting HTTP/1.1 GET https://localhost:7205/api/product/Products - -
2022-02-11 12:41:43.402 +05:30 [INF] Executing endpoint 'Mango.Service.ProductAPI.Controllers.ProductAPIController.GetProducts (Mango.Service.ProductAPI)'
2022-02-11 12:41:43.417 +05:30 [INF] Route matched with {action = "GetProducts", controller = "ProductAPI"}. Executing controller action with signature System.Threading.Tasks.Task`1[Mango.Service.ProductAPI.Models.DTO.ResultDTO] GetProducts() on controller Mango.Service.ProductAPI.Controllers.ProductAPIController (Mango.Service.ProductAPI).
2022-02-11 12:41:44.046 +05:30 [INF] Entity Framework Core 6.0.1 initialized 'ApplicationDbContext' using provider 'Microsoft.EntityFrameworkCore.SqlServer:6.0.1' with options: None
2022-02-11 12:41:45.496 +05:30 [INF] Executed DbCommand (132ms) [Parameters=[], CommandType='"Text"', CommandTimeout='30']
SELECT [p].[ProductId], [p].[CategoryName], [p].[Description], [p].[ImageURL], [p].[Name], [p].[Price]
FROM [Products] AS [p]
2022-02-11 12:41:45.609 +05:30 [INF] Executing ObjectResult, writing value of type 'Mango.Service.ProductAPI.Models.DTO.ResultDTO'.
2022-02-11 12:41:45.622 +05:30 [INF] Executed action Mango.Service.ProductAPI.Controllers.ProductAPIController.GetProducts (Mango.Service.ProductAPI) in 2195.8318ms
2022-02-11 12:41:45.625 +05:30 [INF] Executed endpoint 'Mango.Service.ProductAPI.Controllers.ProductAPIController.GetProducts (Mango.Service.ProductAPI)'
2022-02-11 12:41:45.628 +05:30 [INF] HTTP GET /api/product/Products ({UserId}) responded 200 in 2230.0553ms
2022-02-11 12:41:45.633 +05:30 [INF] Request finished HTTP/1.1 GET https://localhost:7205/api/product/Products - - - 200 - application/json;+charset=utf-8 2238.5783ms
2022-02-11 12:42:47.645 +05:30 [INF] Now listening on: https://localhost:7205
2022-02-11 12:42:47.658 +05:30 [INF] Now listening on: http://localhost:5097
2022-02-11 12:42:47.669 +05:30 [INF] Application started. Press Ctrl+C to shut down.
2022-02-11 12:42:47.671 +05:30 [INF] Hosting environment: Development
2022-02-11 12:42:47.672 +05:30 [INF] Content root path: D:\Shivani Khandelwal\Projects\MangoRestaurent\Mango.Service.ProductAPI\
2022-02-11 12:42:49.134 +05:30 [INF] Request starting HTTP/2 GET https://localhost:7205/swagger/index.html - -
2022-02-11 12:42:49.467 +05:30 [INF] HTTP GET /swagger/index.html ({UserId}) responded 200 in 252.6181ms
2022-02-11 12:42:49.485 +05:30 [INF] Request starting HTTP/2 GET https://localhost:7205/_framework/aspnetcore-browser-refresh.js - -
2022-02-11 12:42:49.504 +05:30 [INF] Request finished HTTP/2 GET https://localhost:7205/_framework/aspnetcore-browser-refresh.js - - - 200 11958 application/javascript;+charset=utf-8 18.8698ms
2022-02-11 12:42:49.504 +05:30 [INF] Request finished HTTP/2 GET https://localhost:7205/swagger/index.html - - - 200 - text/html;charset=utf-8 378.1735ms
2022-02-11 12:42:49.847 +05:30 [INF] Request starting HTTP/2 GET https://localhost:7205/swagger/v1/swagger.json - -
2022-02-11 12:42:50.020 +05:30 [INF] HTTP GET /swagger/v1/swagger.json ({UserId}) responded 200 in 170.3847ms
2022-02-11 12:42:50.027 +05:30 [INF] Request finished HTTP/2 GET https://localhost:7205/swagger/v1/swagger.json - - - 200 - application/json;charset=utf-8 179.8490ms
2022-02-11 12:46:13.580 +05:30 [INF] Now listening on: https://localhost:7205
2022-02-11 12:46:13.593 +05:30 [INF] Now listening on: http://localhost:5097
2022-02-11 12:46:13.600 +05:30 [INF] Application started. Press Ctrl+C to shut down.
2022-02-11 12:46:13.602 +05:30 [INF] Hosting environment: Development
2022-02-11 12:46:13.603 +05:30 [INF] Content root path: D:\Shivani Khandelwal\Projects\MangoRestaurent\Mango.Service.ProductAPI\
2022-02-11 12:46:15.213 +05:30 [INF] Request starting HTTP/2 GET https://localhost:7205/swagger/index.html - -
2022-02-11 12:46:15.692 +05:30 [INF] HTTP GET /swagger/index.html ({UserId}) responded 200 in 391.7965ms
2022-02-11 12:46:15.750 +05:30 [INF] Request starting HTTP/2 GET https://localhost:7205/_framework/aspnetcore-browser-refresh.js - -
2022-02-11 12:46:15.777 +05:30 [INF] Request finished HTTP/2 GET https://localhost:7205/swagger/index.html - - - 200 - text/html;charset=utf-8 567.9874ms
2022-02-11 12:46:15.782 +05:30 [INF] Request finished HTTP/2 GET https://localhost:7205/_framework/aspnetcore-browser-refresh.js - - - 200 11958 application/javascript;+charset=utf-8 31.6556ms
2022-02-11 12:46:16.016 +05:30 [INF] Request starting HTTP/2 GET https://localhost:7205/swagger/v1/swagger.json - -
2022-02-11 12:46:16.168 +05:30 [INF] HTTP GET /swagger/v1/swagger.json ({UserId}) responded 200 in 149.9858ms
2022-02-11 12:46:16.170 +05:30 [INF] Request finished HTTP/2 GET https://localhost:7205/swagger/v1/swagger.json - - - 200 - application/json;charset=utf-8 153.6906ms
2022-02-11 12:46:23.385 +05:30 [INF] Request starting HTTP/1.1 GET https://localhost:7205/api/product/Products - -
2022-02-11 12:46:23.393 +05:30 [INF] Executing endpoint 'Mango.Service.ProductAPI.Controllers.ProductAPIController.GetProducts (Mango.Service.ProductAPI)'
2022-02-11 12:46:23.409 +05:30 [INF] Route matched with {action = "GetProducts", controller = "ProductAPI"}. Executing controller action with signature System.Threading.Tasks.Task`1[Mango.Service.ProductAPI.Models.DTO.ResultDTO] GetProducts() on controller Mango.Service.ProductAPI.Controllers.ProductAPIController (Mango.Service.ProductAPI).
2022-02-11 12:46:24.127 +05:30 [INF] Entity Framework Core 6.0.1 initialized 'ApplicationDbContext' using provider 'Microsoft.EntityFrameworkCore.SqlServer:6.0.1' with options: None
2022-02-11 12:46:24.926 +05:30 [INF] Executed DbCommand (39ms) [Parameters=[], CommandType='"Text"', CommandTimeout='30']
SELECT [p].[ProductId], [p].[CategoryName], [p].[Description], [p].[ImageURL], [p].[Name], [p].[Price]
FROM [Products] AS [p]
2022-02-11 12:46:25.063 +05:30 [INF] Executing ObjectResult, writing value of type 'Mango.Service.ProductAPI.Models.DTO.ResultDTO'.
2022-02-11 12:46:25.077 +05:30 [INF] Executed action Mango.Service.ProductAPI.Controllers.ProductAPIController.GetProducts (Mango.Service.ProductAPI) in 1659.9243ms
2022-02-11 12:46:25.079 +05:30 [INF] Executed endpoint 'Mango.Service.ProductAPI.Controllers.ProductAPIController.GetProducts (Mango.Service.ProductAPI)'
2022-02-11 12:46:25.082 +05:30 [INF] HTTP GET /api/product/Products ({UserId}) responded 200 in 1693.3345ms
2022-02-11 12:46:25.088 +05:30 [INF] Request finished HTTP/1.1 GET https://localhost:7205/api/product/Products - - - 200 - application/json;+charset=utf-8 1702.5330ms
2022-02-11 12:46:51.962 +05:30 [INF] Now listening on: https://localhost:7205
2022-02-11 12:46:51.977 +05:30 [INF] Now listening on: http://localhost:5097
2022-02-11 12:46:51.986 +05:30 [INF] Application started. Press Ctrl+C to shut down.
2022-02-11 12:46:51.988 +05:30 [INF] Hosting environment: Development
2022-02-11 12:46:51.989 +05:30 [INF] Content root path: D:\Shivani Khandelwal\Projects\MangoRestaurent\Mango.Service.ProductAPI\
2022-02-11 12:46:53.060 +05:30 [INF] Request starting HTTP/2 GET https://localhost:7205/swagger/index.html - -
2022-02-11 12:46:53.283 +05:30 [INF] HTTP GET /swagger/index.html ({UserId}) responded 200 in 173.1322ms
2022-02-11 12:46:53.296 +05:30 [INF] Request finished HTTP/2 GET https://localhost:7205/swagger/index.html - - - 200 - text/html;charset=utf-8 239.6355ms
2022-02-11 12:46:53.297 +05:30 [INF] Request starting HTTP/2 GET https://localhost:7205/_framework/aspnetcore-browser-refresh.js - -
2022-02-11 12:46:53.303 +05:30 [INF] Request finished HTTP/2 GET https://localhost:7205/_framework/aspnetcore-browser-refresh.js - - - 200 11958 application/javascript;+charset=utf-8 6.0810ms
2022-02-11 12:46:53.478 +05:30 [INF] Request starting HTTP/2 GET https://localhost:7205/swagger/v1/swagger.json - -
2022-02-11 12:46:53.571 +05:30 [INF] HTTP GET /swagger/v1/swagger.json ({UserId}) responded 200 in 90.2718ms
2022-02-11 12:46:53.575 +05:30 [INF] Request finished HTTP/2 GET https://localhost:7205/swagger/v1/swagger.json - - - 200 - application/json;charset=utf-8 96.7049ms
2022-02-11 12:46:58.991 +05:30 [INF] Request starting HTTP/1.1 GET https://localhost:7205/api/product/Products - -
2022-02-11 12:46:59.000 +05:30 [INF] Executing endpoint 'Mango.Service.ProductAPI.Controllers.ProductAPIController.GetProducts (Mango.Service.ProductAPI)'
2022-02-11 12:46:59.016 +05:30 [INF] Route matched with {action = "GetProducts", controller = "ProductAPI"}. Executing controller action with signature System.Threading.Tasks.Task`1[Mango.Service.ProductAPI.Models.DTO.ResultDTO] GetProducts() on controller Mango.Service.ProductAPI.Controllers.ProductAPIController (Mango.Service.ProductAPI).
2022-02-11 12:46:59.674 +05:30 [INF] Entity Framework Core 6.0.1 initialized 'ApplicationDbContext' using provider 'Microsoft.EntityFrameworkCore.SqlServer:6.0.1' with options: None
2022-02-11 12:47:01.189 +05:30 [INF] Executed DbCommand (151ms) [Parameters=[], CommandType='"Text"', CommandTimeout='30']
SELECT [p].[ProductId], [p].[CategoryName], [p].[Description], [p].[ImageURL], [p].[Name], [p].[Price]
FROM [Products] AS [p]
2022-02-11 12:47:01.393 +05:30 [INF] Executing ObjectResult, writing value of type 'Mango.Service.ProductAPI.Models.DTO.ResultDTO'.
2022-02-11 12:47:01.419 +05:30 [INF] Executed action Mango.Service.ProductAPI.Controllers.ProductAPIController.GetProducts (Mango.Service.ProductAPI) in 2391.4281ms
2022-02-11 12:47:01.424 +05:30 [INF] Executed endpoint 'Mango.Service.ProductAPI.Controllers.ProductAPIController.GetProducts (Mango.Service.ProductAPI)'
2022-02-11 12:47:01.426 +05:30 [INF] HTTP GET /api/product/Products ({UserId}) responded 200 in 2430.8044ms
2022-02-11 12:47:01.434 +05:30 [INF] Request finished HTTP/1.1 GET https://localhost:7205/api/product/Products - - - 200 - application/json;+charset=utf-8 2442.5971ms
2022-02-11 12:47:54.772 +05:30 [INF] Now listening on: https://localhost:7205
2022-02-11 12:47:54.784 +05:30 [INF] Now listening on: http://localhost:5097
2022-02-11 12:47:54.793 +05:30 [INF] Application started. Press Ctrl+C to shut down.
2022-02-11 12:47:54.794 +05:30 [INF] Hosting environment: Development
2022-02-11 12:47:54.795 +05:30 [INF] Content root path: D:\Shivani Khandelwal\Projects\MangoRestaurent\Mango.Service.ProductAPI\
2022-02-11 12:47:56.087 +05:30 [INF] Request starting HTTP/2 GET https://localhost:7205/swagger/index.html - -
2022-02-11 12:47:56.378 +05:30 [INF] HTTP GET /swagger/index.html ({UserId}) responded 200 in 225.8471ms
2022-02-11 12:47:56.401 +05:30 [INF] Request starting HTTP/2 GET https://localhost:7205/_framework/aspnetcore-browser-refresh.js - -
2022-02-11 12:47:56.405 +05:30 [INF] Request finished HTTP/2 GET https://localhost:7205/swagger/index.html - - - 200 - text/html;charset=utf-8 323.7982ms
2022-02-11 12:47:56.407 +05:30 [INF] Request finished HTTP/2 GET https://localhost:7205/_framework/aspnetcore-browser-refresh.js - - - 200 11958 application/javascript;+charset=utf-8 5.7233ms
2022-02-11 12:47:56.673 +05:30 [INF] Request starting HTTP/2 GET https://localhost:7205/swagger/v1/swagger.json - -
2022-02-11 12:47:56.804 +05:30 [INF] HTTP GET /swagger/v1/swagger.json ({UserId}) responded 200 in 130.1068ms
2022-02-11 12:47:56.807 +05:30 [INF] Request finished HTTP/2 GET https://localhost:7205/swagger/v1/swagger.json - - - 200 - application/json;charset=utf-8 134.6518ms
2022-02-11 12:48:02.222 +05:30 [INF] Request starting HTTP/1.1 GET https://localhost:7205/api/product/Products - -
2022-02-11 12:48:02.233 +05:30 [INF] Executing endpoint 'Mango.Service.ProductAPI.Controllers.ProductAPIController.GetProducts (Mango.Service.ProductAPI)'
2022-02-11 12:48:02.255 +05:30 [INF] Route matched with {action = "GetProducts", controller = "ProductAPI"}. Executing controller action with signature System.Threading.Tasks.Task`1[Mango.Service.ProductAPI.Models.DTO.ResultDTO] GetProducts() on controller Mango.Service.ProductAPI.Controllers.ProductAPIController (Mango.Service.ProductAPI).
2022-02-11 12:48:02.916 +05:30 [INF] Entity Framework Core 6.0.1 initialized 'ApplicationDbContext' using provider 'Microsoft.EntityFrameworkCore.SqlServer:6.0.1' with options: None
2022-02-11 12:48:04.389 +05:30 [INF] Executed DbCommand (142ms) [Parameters=[], CommandType='"Text"', CommandTimeout='30']
SELECT [p].[ProductId], [p].[CategoryName], [p].[Description], [p].[ImageURL], [p].[Name], [p].[Price]
FROM [Products] AS [p]
2022-02-11 12:48:04.488 +05:30 [INF] Executing ObjectResult, writing value of type 'Mango.Service.ProductAPI.Models.DTO.ResultDTO'.
2022-02-11 12:48:04.500 +05:30 [INF] Executed action Mango.Service.ProductAPI.Controllers.ProductAPIController.GetProducts (Mango.Service.ProductAPI) in 2238.1042ms
2022-02-11 12:48:04.503 +05:30 [INF] Executed endpoint 'Mango.Service.ProductAPI.Controllers.ProductAPIController.GetProducts (Mango.Service.ProductAPI)'
2022-02-11 12:48:04.506 +05:30 [INF] HTTP GET /api/product/Products ({UserId}) responded 200 in 2279.9426ms
2022-02-11 12:48:04.512 +05:30 [INF] Request finished HTTP/1.1 GET https://localhost:7205/api/product/Products - - - 200 - application/json;+charset=utf-8 2290.8232ms
2022-02-11 12:49:06.742 +05:30 [INF] Now listening on: https://localhost:7205
2022-02-11 12:49:06.766 +05:30 [INF] Now listening on: http://localhost:5097
2022-02-11 12:49:06.777 +05:30 [INF] Application started. Press Ctrl+C to shut down.
2022-02-11 12:49:06.779 +05:30 [INF] Hosting environment: Development
2022-02-11 12:49:06.781 +05:30 [INF] Content root path: D:\Shivani Khandelwal\Projects\MangoRestaurent\Mango.Service.ProductAPI\
2022-02-11 12:49:08.201 +05:30 [INF] Request starting HTTP/2 GET https://localhost:7205/swagger/index.html - -
2022-02-11 12:49:08.483 +05:30 [INF] HTTP GET /swagger/index.html ({UserId}) responded 200 in 193.5185ms
2022-02-11 12:49:08.495 +05:30 [INF] Request finished HTTP/2 GET https://localhost:7205/swagger/index.html - - - 200 - text/html;charset=utf-8 298.2331ms
2022-02-11 12:49:08.515 +05:30 [INF] Request starting HTTP/2 GET https://localhost:7205/_framework/aspnetcore-browser-refresh.js - -
2022-02-11 12:49:08.521 +05:30 [INF] Request finished HTTP/2 GET https://localhost:7205/_framework/aspnetcore-browser-refresh.js - - - 200 11958 application/javascript;+charset=utf-8 6.1354ms
2022-02-11 12:49:08.748 +05:30 [INF] Request starting HTTP/2 GET https://localhost:7205/swagger/v1/swagger.json - -
2022-02-11 12:49:08.874 +05:30 [INF] HTTP GET /swagger/v1/swagger.json ({UserId}) responded 200 in 125.1819ms
2022-02-11 12:49:08.878 +05:30 [INF] Request finished HTTP/2 GET https://localhost:7205/swagger/v1/swagger.json - - - 200 - application/json;charset=utf-8 129.9853ms
2022-02-11 12:49:14.865 +05:30 [INF] Request starting HTTP/1.1 GET https://localhost:7205/api/product/Products - -
2022-02-11 12:49:14.875 +05:30 [INF] Executing endpoint 'Mango.Service.ProductAPI.Controllers.ProductAPIController.GetProducts (Mango.Service.ProductAPI)'
2022-02-11 12:49:14.890 +05:30 [INF] Route matched with {action = "GetProducts", controller = "ProductAPI"}. Executing controller action with signature System.Threading.Tasks.Task`1[Mango.Service.ProductAPI.Models.DTO.ResultDTO] GetProducts() on controller Mango.Service.ProductAPI.Controllers.ProductAPIController (Mango.Service.ProductAPI).
2022-02-11 12:49:15.565 +05:30 [INF] Entity Framework Core 6.0.1 initialized 'ApplicationDbContext' using provider 'Microsoft.EntityFrameworkCore.SqlServer:6.0.1' with options: None
2022-02-11 12:49:16.515 +05:30 [INF] Executed DbCommand (155ms) [Parameters=[], CommandType='"Text"', CommandTimeout='30']
SELECT [p].[ProductId], [p].[CategoryName], [p].[Description], [p].[ImageURL], [p].[Name], [p].[Price]
FROM [Products] AS [p]
2022-02-11 12:49:16.627 +05:30 [INF] Executing ObjectResult, writing value of type 'Mango.Service.ProductAPI.Models.DTO.ResultDTO'.
2022-02-11 12:49:16.640 +05:30 [INF] Executed action Mango.Service.ProductAPI.Controllers.ProductAPIController.GetProducts (Mango.Service.ProductAPI) in 1741.72ms
2022-02-11 12:49:16.643 +05:30 [INF] Executed endpoint 'Mango.Service.ProductAPI.Controllers.ProductAPIController.GetProducts (Mango.Service.ProductAPI)'
2022-02-11 12:49:16.645 +05:30 [INF] HTTP GET /api/product/Products ({UserId}) responded 200 in 1775.6872ms
2022-02-11 12:49:16.652 +05:30 [INF] Request finished HTTP/1.1 GET https://localhost:7205/api/product/Products - - - 200 - application/json;+charset=utf-8 1786.4561ms
2022-03-01 11:57:43.007 +05:30 [INF] Now listening on: https://localhost:7205
2022-03-01 11:57:43.053 +05:30 [INF] Now listening on: http://localhost:5097
2022-03-01 11:57:43.071 +05:30 [INF] Application started. Press Ctrl+C to shut down.
2022-03-01 11:57:43.072 +05:30 [INF] Hosting environment: Development
2022-03-01 11:57:43.073 +05:30 [INF] Content root path: D:\Shivani Khandelwal\Projects\Microservices\microservices_net\Mango.Service.ProductAPI\
2022-03-01 11:57:44.536 +05:30 [INF] Request starting HTTP/2 GET https://localhost:7205/swagger/index.html - -
2022-03-01 11:57:44.938 +05:30 [INF] HTTP GET /swagger/index.html ({UserId}) responded 200 in 306.8500ms
2022-03-01 11:57:44.949 +05:30 [INF] Request finished HTTP/2 GET https://localhost:7205/swagger/index.html - - - 200 - text/html;charset=utf-8 417.9845ms
2022-03-01 11:57:44.981 +05:30 [INF] Request starting HTTP/2 GET https://localhost:7205/_framework/aspnetcore-browser-refresh.js - -
2022-03-01 11:57:44.987 +05:30 [INF] Request finished HTTP/2 GET https://localhost:7205/_framework/aspnetcore-browser-refresh.js - - - 200 11958 application/javascript;+charset=utf-8 5.5476ms
2022-03-01 11:57:45.482 +05:30 [INF] Request starting HTTP/2 GET https://localhost:7205/swagger/v1/swagger.json - -
2022-03-01 11:57:45.624 +05:30 [INF] HTTP GET /swagger/v1/swagger.json ({UserId}) responded 200 in 140.8399ms
2022-03-01 11:57:45.628 +05:30 [INF] Request finished HTTP/2 GET https://localhost:7205/swagger/v1/swagger.json - - - 200 - application/json;charset=utf-8 145.4950ms
