EESchema Schematic File Version 4
EELAYER 30 0
EELAYER END
$Descr A4 11693 8268
encoding utf-8
Sheet 4 4
Title ""
Date ""
Rev ""
Comp ""
Comment1 ""
Comment2 ""
Comment3 ""
Comment4 ""
$EndDescr
Text HLabel 9600 3350 2    50   Input ~ 0
CAN_H
Text HLabel 9600 3550 2    50   Input ~ 0
CAN_L
Text HLabel 3150 2450 0    50   Output ~ 0
SPI_MISO
Text HLabel 3150 2350 0    50   Output ~ 0
SPI_MOSI
Text HLabel 3150 2650 0    50   Output ~ 0
SPI_SCK
Text HLabel 4350 2950 2    50   Output ~ 0
SPI_INT
Text HLabel 3150 2550 0    50   Output ~ 0
SPI_SS
$Comp
L Interface_CAN_LIN:MCP2551-I-P U3
U 1 1 5EE84F4D
P 8650 3450
F 0 "U3" H 9150 3000 50  0000 C CNN
F 1 "MCP2551-I-P" H 9350 2900 50  0000 C CNN
F 2 "Package_DIP:DIP-8_W7.62mm" H 8650 2950 50  0001 C CIN
F 3 "http://ww1.microchip.com/downloads/en/devicedoc/21667d.pdf" H 8650 3450 50  0001 C CNN
	1    8650 3450
	1    0    0    -1  
$EndComp
$Comp
L Interface_CAN_LIN:MCP2515-xSO U2
U 1 1 5EE85C43
P 3750 2950
F 0 "U2" H 4400 3250 50  0000 C CNN
F 1 "MCP2515-xSO" H 4600 3150 50  0000 C CNN
F 2 "Package_SO:SOIC-18W_7.5x11.6mm_P1.27mm" H 3750 2050 50  0001 C CIN
F 3 "http://ww1.microchip.com/downloads/en/DeviceDoc/21801e.pdf" H 3850 2150 50  0001 C CNN
	1    3750 2950
	1    0    0    -1  
$EndComp
Wire Wire Line
	9600 3350 9150 3350
Wire Wire Line
	9600 3550 9150 3550
$Comp
L power:GNDD #PWR045
U 1 1 5EE875D5
P 8650 3850
F 0 "#PWR045" H 8650 3600 50  0001 C CNN
F 1 "GNDD" H 8654 3695 50  0000 C CNN
F 2 "" H 8650 3850 50  0001 C CNN
F 3 "" H 8650 3850 50  0001 C CNN
	1    8650 3850
	1    0    0    -1  
$EndComp
$Comp
L power:+5V #PWR044
U 1 1 5EE8808C
P 8650 2750
F 0 "#PWR044" H 8650 2600 50  0001 C CNN
F 1 "+5V" H 8665 2923 50  0000 C CNN
F 2 "" H 8650 2750 50  0001 C CNN
F 3 "" H 8650 2750 50  0001 C CNN
	1    8650 2750
	1    0    0    -1  
$EndComp
Text Label 8000 3250 2    50   ~ 0
TXD
Wire Wire Line
	8000 3250 8150 3250
Text Label 8000 3350 2    50   ~ 0
RXD
Wire Wire Line
	8000 3350 8150 3350
Text Label 4350 2450 0    50   ~ 0
TXD
Text Label 4350 2350 0    50   ~ 0
RXD
NoConn ~ 8150 3550
$Comp
L Device:R R11
U 1 1 5EE8CD7F
P 8000 3800
F 0 "R11" H 8150 3850 50  0000 R CNN
F 1 "47k" H 8150 3750 50  0000 R CNN
F 2 "" V 7930 3800 50  0001 C CNN
F 3 "~" H 8000 3800 50  0001 C CNN
	1    8000 3800
	-1   0    0    -1  
$EndComp
Wire Wire Line
	8000 3650 8150 3650
$Comp
L power:GNDD #PWR043
U 1 1 5EE8D97B
P 8000 3950
F 0 "#PWR043" H 8000 3700 50  0001 C CNN
F 1 "GNDD" H 8004 3795 50  0000 C CNN
F 2 "" H 8000 3950 50  0001 C CNN
F 3 "" H 8000 3950 50  0001 C CNN
	1    8000 3950
	1    0    0    -1  
$EndComp
$Comp
L power:+5V #PWR039
U 1 1 5EE8E277
P 3750 1750
F 0 "#PWR039" H 3750 1600 50  0001 C CNN
F 1 "+5V" H 3765 1923 50  0000 C CNN
F 2 "" H 3750 1750 50  0001 C CNN
F 3 "" H 3750 1750 50  0001 C CNN
	1    3750 1750
	1    0    0    -1  
$EndComp
$Comp
L Device:Crystal Y2
U 1 1 5EE8F3B2
P 2550 3100
F 0 "Y2" V 2504 3231 50  0000 L CNN
F 1 "Crystal" V 2595 3231 50  0000 L CNN
F 2 "" H 2550 3100 50  0001 C CNN
F 3 "~" H 2550 3100 50  0001 C CNN
	1    2550 3100
	0    1    1    0   
$EndComp
Wire Wire Line
	3150 3250 2550 3250
Wire Wire Line
	3150 3150 3150 2950
Wire Wire Line
	3150 2950 2550 2950
$Comp
L Device:C C5
U 1 1 5EE91BF0
P 2150 2950
F 0 "C5" V 1898 2950 50  0000 C CNN
F 1 "22pF" V 1989 2950 50  0000 C CNN
F 2 "" H 2188 2800 50  0001 C CNN
F 3 "~" H 2150 2950 50  0001 C CNN
	1    2150 2950
	0    1    1    0   
$EndComp
$Comp
L Device:C C6
U 1 1 5EE923BF
P 2150 3250
F 0 "C6" V 2400 3250 50  0000 C CNN
F 1 "22pF" V 2300 3250 50  0000 C CNN
F 2 "" H 2188 3100 50  0001 C CNN
F 3 "~" H 2150 3250 50  0001 C CNN
	1    2150 3250
	0    1    1    0   
$EndComp
Wire Wire Line
	2300 2950 2550 2950
Connection ~ 2550 2950
Wire Wire Line
	2550 3250 2300 3250
Connection ~ 2550 3250
$Comp
L power:GNDD #PWR040
U 1 1 5EE93E90
P 3750 3750
F 0 "#PWR040" H 3750 3500 50  0001 C CNN
F 1 "GNDD" H 3754 3595 50  0000 C CNN
F 2 "" H 3750 3750 50  0001 C CNN
F 3 "" H 3750 3750 50  0001 C CNN
	1    3750 3750
	1    0    0    -1  
$EndComp
$Comp
L power:GNDD #PWR038
U 1 1 5EE94310
P 1600 3100
F 0 "#PWR038" H 1600 2850 50  0001 C CNN
F 1 "GNDD" V 1604 2990 50  0000 R CNN
F 2 "" H 1600 3100 50  0001 C CNN
F 3 "" H 1600 3100 50  0001 C CNN
	1    1600 3100
	0    1    1    0   
$EndComp
Wire Wire Line
	1600 3100 1600 2950
Wire Wire Line
	1600 2950 2000 2950
Wire Wire Line
	1600 3100 1600 3250
Wire Wire Line
	1600 3250 2000 3250
Connection ~ 1600 3100
NoConn ~ 3150 3350
NoConn ~ 4350 3050
NoConn ~ 4350 3150
NoConn ~ 4350 3250
NoConn ~ 4350 3350
NoConn ~ 4350 3450
$Comp
L Device:R R10
U 1 1 5EE961A0
P 4550 3700
F 0 "R10" H 4700 3750 50  0000 R CNN
F 1 "10k" H 4700 3650 50  0000 R CNN
F 2 "" V 4480 3700 50  0001 C CNN
F 3 "~" H 4550 3700 50  0001 C CNN
	1    4550 3700
	-1   0    0    -1  
$EndComp
Wire Wire Line
	4350 3550 4550 3550
$Comp
L power:+5V #PWR042
U 1 1 5EE971CC
P 4550 3850
F 0 "#PWR042" H 4550 3700 50  0001 C CNN
F 1 "+5V" H 4565 4023 50  0000 C CNN
F 2 "" H 4550 3850 50  0001 C CNN
F 3 "" H 4550 3850 50  0001 C CNN
	1    4550 3850
	-1   0    0    1   
$EndComp
$Comp
L Device:C_Small C8
U 1 1 5EEA31F5
P 8900 2950
F 0 "C8" V 8671 2950 50  0000 C CNN
F 1 "100nF" V 8762 2950 50  0000 C CNN
F 2 "" H 8900 2950 50  0001 C CNN
F 3 "~" H 8900 2950 50  0001 C CNN
	1    8900 2950
	0    1    1    0   
$EndComp
Wire Wire Line
	8650 2750 8650 2950
Wire Wire Line
	8800 2950 8650 2950
Connection ~ 8650 2950
Wire Wire Line
	8650 2950 8650 3050
$Comp
L power:GNDD #PWR046
U 1 1 5EEA5584
P 9050 2950
F 0 "#PWR046" H 9050 2700 50  0001 C CNN
F 1 "GNDD" H 9054 2795 50  0000 C CNN
F 2 "" H 9050 2950 50  0001 C CNN
F 3 "" H 9050 2950 50  0001 C CNN
	1    9050 2950
	1    0    0    -1  
$EndComp
Wire Wire Line
	9050 2950 9000 2950
$Comp
L Device:C_Small C7
U 1 1 5EEA93D5
P 3850 2000
F 0 "C7" V 3600 2050 50  0000 C CNN
F 1 "100nF" V 3700 2050 50  0000 C CNN
F 2 "" H 3850 2000 50  0001 C CNN
F 3 "~" H 3850 2000 50  0001 C CNN
	1    3850 2000
	0    1    1    0   
$EndComp
$Comp
L power:GNDD #PWR041
U 1 1 5EEA9B5A
P 4050 2000
F 0 "#PWR041" H 4050 1750 50  0001 C CNN
F 1 "GNDD" H 4054 1845 50  0000 C CNN
F 2 "" H 4050 2000 50  0001 C CNN
F 3 "" H 4050 2000 50  0001 C CNN
	1    4050 2000
	1    0    0    -1  
$EndComp
Wire Wire Line
	4050 2000 3950 2000
Wire Wire Line
	3750 2150 3750 2000
Connection ~ 3750 2000
Wire Wire Line
	3750 2000 3750 1750
$EndSCHEMATC
