EESchema Schematic File Version 4
EELAYER 30 0
EELAYER END
$Descr A4 11693 8268
encoding utf-8
Sheet 1 4
Title ""
Date ""
Rev ""
Comp ""
Comment1 ""
Comment2 ""
Comment3 ""
Comment4 ""
$EndDescr
$Sheet
S 8200 1850 1050 1250
U 5EEAACEF
F0 "Temp. Sensors conection" 50
F1 "SensorsConn.sch" 50
F2 "Panel1Bus" I L 8200 2550 50 
F3 "InverterBus" I L 8200 2150 50 
F4 "MotorBus" I L 8200 2000 50 
F5 "BatBus" I L 8200 2350 50 
F6 "Panel2Bus" I L 8200 2650 50 
F7 "Panel4Bus" I L 8200 2750 50 
F8 "Panel3Bus" I L 8200 2850 50 
$EndSheet
$Sheet
S 5650 1550 1400 1700
U 5EFD211C
F0 "atmega328p" 50
F1 "atmega328p.sch" 50
F2 "PANEL4" O R 7050 2850 50 
F3 "PANEL3" O R 7050 2750 50 
F4 "PANEL2" O R 7050 2650 50 
F5 "PANEL1" O R 7050 2550 50 
F6 "SPI_SCK" O L 5650 2100 50 
F7 "SPI_MISO" O L 5650 2200 50 
F8 "SPI_MOSI" O L 5650 2300 50 
F9 "SPI_SS" O L 5650 2500 50 
F10 "SPI_INT" O L 5650 2400 50 
F11 "MOTOR" O R 7050 2000 50 
F12 "BATTERY" O R 7050 2350 50 
F13 "INVERTER" O R 7050 2150 50 
$EndSheet
$Sheet
S 3650 1900 1650 900 
U 5EFD29D6
F0 "CAN Bus" 50
F1 "CAN.sch" 50
F2 "CAN_H" I L 3650 2200 50 
F3 "CAN_L" I L 3650 2350 50 
F4 "SPI_MISO" O R 5300 2300 50 
F5 "SPI_MOSI" O R 5300 2200 50 
F6 "SPI_SCK" O R 5300 2100 50 
F7 "SPI_INT" O R 5300 2400 50 
F8 "SPI_SS" O R 5300 2500 50 
$EndSheet
Wire Wire Line
	8200 2550 7050 2550
Wire Wire Line
	7050 2650 8200 2650
Wire Wire Line
	8200 2750 7050 2750
Wire Wire Line
	7050 2850 8200 2850
Wire Wire Line
	7050 2350 8200 2350
Wire Wire Line
	7050 2150 8200 2150
Wire Wire Line
	8200 2000 7050 2000
Wire Wire Line
	5300 2100 5650 2100
Wire Wire Line
	5300 2200 5650 2200
Wire Wire Line
	5650 2300 5300 2300
Wire Wire Line
	5650 2400 5300 2400
Wire Wire Line
	5650 2500 5300 2500
Text Label 3550 2200 2    50   ~ 0
CAN_H
Wire Wire Line
	3550 2200 3650 2200
Text Label 3550 2350 2    50   ~ 0
CAN_L
Wire Wire Line
	3550 2350 3650 2350
$Comp
L Connector:RJ45 J8
U 1 1 5EFDE8B8
P 1550 4150
F 0 "J8" H 1607 4817 50  0000 C CNN
F 1 "RJ45" H 1607 4726 50  0000 C CNN
F 2 "" V 1550 4175 50  0001 C CNN
F 3 "~" V 1550 4175 50  0001 C CNN
	1    1550 4150
	1    0    0    -1  
$EndComp
Text Label 2100 4450 0    50   ~ 0
CAN_H
Wire Wire Line
	2100 4450 1950 4450
Text Label 2100 4350 0    50   ~ 0
CAN_L
Wire Wire Line
	2100 4350 1950 4350
$Comp
L power:GNDD #PWR029
U 1 1 5EFE0D75
P 2550 4250
F 0 "#PWR029" H 2550 4000 50  0001 C CNN
F 1 "GNDD" H 2554 4095 50  0000 C CNN
F 2 "" H 2550 4250 50  0001 C CNN
F 3 "" H 2550 4250 50  0001 C CNN
	1    2550 4250
	1    0    0    -1  
$EndComp
Wire Wire Line
	2550 4250 1950 4250
NoConn ~ 1950 4150
NoConn ~ 1950 4050
NoConn ~ 1950 3950
NoConn ~ 1950 3750
$Comp
L Connector:RJ45 J9
U 1 1 5EFE5A44
P 1550 5350
F 0 "J9" H 1607 6017 50  0000 C CNN
F 1 "RJ45" H 1607 5926 50  0000 C CNN
F 2 "" V 1550 5375 50  0001 C CNN
F 3 "~" V 1550 5375 50  0001 C CNN
	1    1550 5350
	1    0    0    -1  
$EndComp
Text Label 2100 5650 0    50   ~ 0
CAN_H
Wire Wire Line
	2100 5650 1950 5650
Text Label 2100 5550 0    50   ~ 0
CAN_L
Wire Wire Line
	2100 5550 1950 5550
$Comp
L power:GNDD #PWR030
U 1 1 5EFE5A52
P 2550 5450
F 0 "#PWR030" H 2550 5200 50  0001 C CNN
F 1 "GNDD" H 2554 5295 50  0000 C CNN
F 2 "" H 2550 5450 50  0001 C CNN
F 3 "" H 2550 5450 50  0001 C CNN
	1    2550 5450
	1    0    0    -1  
$EndComp
Wire Wire Line
	2550 5450 1950 5450
NoConn ~ 1950 5350
NoConn ~ 1950 5250
NoConn ~ 1950 5150
NoConn ~ 1950 4950
$Comp
L power:GNDD #PWR047
U 1 1 5EFD7D87
P 2550 3850
F 0 "#PWR047" H 2550 3600 50  0001 C CNN
F 1 "GNDD" H 2554 3695 50  0000 C CNN
F 2 "" H 2550 3850 50  0001 C CNN
F 3 "" H 2550 3850 50  0001 C CNN
	1    2550 3850
	1    0    0    -1  
$EndComp
Wire Wire Line
	1950 3850 2550 3850
$Comp
L power:GNDD #PWR048
U 1 1 5EFD8832
P 2550 5050
F 0 "#PWR048" H 2550 4800 50  0001 C CNN
F 1 "GNDD" H 2554 4895 50  0000 C CNN
F 2 "" H 2550 5050 50  0001 C CNN
F 3 "" H 2550 5050 50  0001 C CNN
	1    2550 5050
	1    0    0    -1  
$EndComp
Wire Wire Line
	2550 5050 1950 5050
$Comp
L Device:R R12
U 1 1 5EFD3DF3
P 3500 4800
F 0 "R12" H 3570 4846 50  0000 L CNN
F 1 "120" H 3570 4755 50  0000 L CNN
F 2 "" V 3430 4800 50  0001 C CNN
F 3 "~" H 3500 4800 50  0001 C CNN
	1    3500 4800
	1    0    0    -1  
$EndComp
Text Label 3500 4650 2    50   ~ 0
CAN_H
Text Label 3500 5000 2    50   ~ 0
CAN_L
Wire Wire Line
	3500 5000 3500 4950
Text Notes 3250 4450 0    50   ~ 0
R12 SÓ DEVE SER SOLDADO SE FOR TERMINAÇÃO DO CAN BUS
$EndSCHEMATC
