EESchema Schematic File Version 4
EELAYER 30 0
EELAYER END
$Descr A4 11693 8268
encoding utf-8
Sheet 3 4
Title ""
Date ""
Rev ""
Comp ""
Comment1 ""
Comment2 ""
Comment3 ""
Comment4 ""
$EndDescr
$Comp
L MCU_Microchip_ATmega:ATmega328P-PU U1
U 1 1 5EE6905B
P 5250 3750
F 0 "U1" H 4606 3796 50  0000 R CNN
F 1 "ATmega328P-PU" H 4606 3705 50  0000 R CNN
F 2 "Package_DIP:DIP-28_W7.62mm" H 5250 3750 50  0001 C CIN
F 3 "http://ww1.microchip.com/downloads/en/DeviceDoc/ATmega328_P%20AVR%20MCU%20with%20picoPower%20Technology%20Data%20Sheet%2040001984A.pdf" H 5250 3750 50  0001 C CNN
	1    5250 3750
	1    0    0    -1  
$EndComp
$Comp
L power:+5V #PWR032
U 1 1 5EE7B1B3
P 5350 1850
F 0 "#PWR032" H 5350 1700 50  0001 C CNN
F 1 "+5V" H 5365 2023 50  0000 C CNN
F 2 "" H 5350 1850 50  0001 C CNN
F 3 "" H 5350 1850 50  0001 C CNN
	1    5350 1850
	1    0    0    -1  
$EndComp
$Comp
L Device:R R8
U 1 1 5EE7BA98
P 7000 4050
F 0 "R8" V 6793 4050 50  0000 C CNN
F 1 "10k" V 6884 4050 50  0000 C CNN
F 2 "" V 6930 4050 50  0001 C CNN
F 3 "~" H 7000 4050 50  0001 C CNN
	1    7000 4050
	0    1    1    0   
$EndComp
$Comp
L power:+5V #PWR034
U 1 1 5EE7CB91
P 7400 4000
F 0 "#PWR034" H 7400 3850 50  0001 C CNN
F 1 "+5V" H 7415 4173 50  0000 C CNN
F 2 "" H 7400 4000 50  0001 C CNN
F 3 "" H 7400 4000 50  0001 C CNN
	1    7400 4000
	1    0    0    -1  
$EndComp
Wire Wire Line
	7400 4000 7400 4050
Wire Wire Line
	7400 4050 7200 4050
Wire Wire Line
	5350 1850 5350 1950
Wire Wire Line
	5250 2250 5250 1950
Wire Wire Line
	5250 1950 5350 1950
Connection ~ 5350 1950
Wire Wire Line
	5350 1950 5350 2100
$Comp
L Device:CP C1
U 1 1 5EE7E690
P 5500 2100
F 0 "C1" V 5755 2100 50  0000 C CNN
F 1 "10uF" V 5664 2100 50  0000 C CNN
F 2 "" H 5538 1950 50  0001 C CNN
F 3 "~" H 5500 2100 50  0001 C CNN
	1    5500 2100
	0    -1   -1   0   
$EndComp
Connection ~ 5350 2100
Wire Wire Line
	5350 2100 5350 2250
$Comp
L power:GNDD #PWR033
U 1 1 5EE7F7F4
P 5700 2100
F 0 "#PWR033" H 5700 1850 50  0001 C CNN
F 1 "GNDD" H 5704 1945 50  0000 C CNN
F 2 "" H 5700 2100 50  0001 C CNN
F 3 "" H 5700 2100 50  0001 C CNN
	1    5700 2100
	1    0    0    -1  
$EndComp
Wire Wire Line
	5700 2100 5650 2100
$Comp
L power:GNDD #PWR031
U 1 1 5EE800E7
P 5250 5250
F 0 "#PWR031" H 5250 5000 50  0001 C CNN
F 1 "GNDD" H 5254 5095 50  0000 C CNN
F 2 "" H 5250 5250 50  0001 C CNN
F 3 "" H 5250 5250 50  0001 C CNN
	1    5250 5250
	1    0    0    -1  
$EndComp
$Comp
L Device:Crystal Y1
U 1 1 5EE80866
P 8450 2300
F 0 "Y1" V 8404 2431 50  0000 L CNN
F 1 "16MHz" V 8495 2431 50  0000 L CNN
F 2 "" H 8450 2300 50  0001 C CNN
F 3 "~" H 8450 2300 50  0001 C CNN
	1    8450 2300
	0    1    1    0   
$EndComp
$Comp
L Device:C C3
U 1 1 5EE82494
P 8950 2150
F 0 "C3" V 8698 2150 50  0000 C CNN
F 1 "22pF" V 8789 2150 50  0000 C CNN
F 2 "" H 8988 2000 50  0001 C CNN
F 3 "~" H 8950 2150 50  0001 C CNN
	1    8950 2150
	0    1    1    0   
$EndComp
$Comp
L Device:C C4
U 1 1 5EE830AE
P 8950 2450
F 0 "C4" V 8700 2450 50  0000 C CNN
F 1 "22pF" V 8800 2450 50  0000 C CNN
F 2 "" H 8988 2300 50  0001 C CNN
F 3 "~" H 8950 2450 50  0001 C CNN
	1    8950 2450
	0    1    -1   0   
$EndComp
$Comp
L power:GNDD #PWR037
U 1 1 5EE83862
P 9400 2300
F 0 "#PWR037" H 9400 2050 50  0001 C CNN
F 1 "GNDD" V 9404 2190 50  0000 R CNN
F 2 "" H 9400 2300 50  0001 C CNN
F 3 "" H 9400 2300 50  0001 C CNN
	1    9400 2300
	0    -1   -1   0   
$EndComp
Text HLabel 6050 4950 2    50   Output ~ 0
PANEL4
Wire Wire Line
	6050 4950 5850 4950
Text HLabel 6050 4850 2    50   Output ~ 0
PANEL3
Wire Wire Line
	6050 4850 5850 4850
Text HLabel 6050 4750 2    50   Output ~ 0
PANEL2
Wire Wire Line
	6050 4750 5850 4750
Text HLabel 6050 4650 2    50   Output ~ 0
PANEL1
Wire Wire Line
	6050 4650 5850 4650
Wire Wire Line
	8450 2450 8800 2450
Wire Wire Line
	8450 2150 8800 2150
Connection ~ 8450 2150
Wire Wire Line
	9400 2300 9400 2150
Wire Wire Line
	9400 2150 9100 2150
Wire Wire Line
	9100 2450 9400 2450
Wire Wire Line
	9400 2450 9400 2300
Connection ~ 9400 2300
Text HLabel 5850 3050 2    50   Output ~ 0
SPI_SCK
Wire Wire Line
	8100 2150 8450 2150
Wire Wire Line
	8450 2450 8100 2450
Connection ~ 8450 2450
Text HLabel 5850 2950 2    50   Output ~ 0
SPI_MISO
Text HLabel 5850 2850 2    50   Output ~ 0
SPI_MOSI
Text HLabel 5850 2750 2    50   Output ~ 0
SPI_SS
$Comp
L power:+5V #PWR036
U 1 1 5EE94626
P 8550 4750
F 0 "#PWR036" H 8550 4600 50  0001 C CNN
F 1 "+5V" H 8565 4923 50  0000 C CNN
F 2 "" H 8550 4750 50  0001 C CNN
F 3 "" H 8550 4750 50  0001 C CNN
	1    8550 4750
	1    0    0    -1  
$EndComp
$Comp
L power:GNDD #PWR035
U 1 1 5EE94EC6
P 8300 5100
F 0 "#PWR035" H 8300 4850 50  0001 C CNN
F 1 "GNDD" H 8304 4945 50  0000 C CNN
F 2 "" H 8300 5100 50  0001 C CNN
F 3 "" H 8300 5100 50  0001 C CNN
	1    8300 5100
	1    0    0    -1  
$EndComp
$Comp
L Connector:Conn_01x06_Male J10
U 1 1 5EE96CD1
P 9350 4800
F 0 "J10" H 9322 4682 50  0000 R CNN
F 1 "Conn_01x06_Male" H 9322 4773 50  0000 R CNN
F 2 "" H 9350 4800 50  0001 C CNN
F 3 "~" H 9350 4800 50  0001 C CNN
	1    9350 4800
	-1   0    0    1   
$EndComp
NoConn ~ 9150 4900
Wire Wire Line
	8550 4750 8550 4800
Wire Wire Line
	8550 4800 9150 4800
Text GLabel 9000 4600 0    50   Input ~ 0
TX
Wire Wire Line
	9000 4700 9150 4700
Text GLabel 9000 4700 0    50   Input ~ 0
RX
Wire Wire Line
	9000 4600 9150 4600
Wire Wire Line
	9150 5000 8300 5000
Wire Wire Line
	8300 5000 8300 5100
$Comp
L Device:R R9
U 1 1 5EE9EFF6
P 8300 4850
F 0 "R9" H 8370 4896 50  0000 L CNN
F 1 "1k" H 8370 4805 50  0000 L CNN
F 2 "" V 8230 4850 50  0001 C CNN
F 3 "~" H 8300 4850 50  0001 C CNN
	1    8300 4850
	1    0    0    -1  
$EndComp
Connection ~ 8300 5000
Wire Wire Line
	8300 4700 8300 4500
Wire Wire Line
	8300 4500 9150 4500
Text Label 8700 4500 0    50   ~ 0
DTR
Text GLabel 8300 4500 0    50   Input ~ 0
DTR
Text GLabel 7100 4300 2    50   Input ~ 0
DTR
$Comp
L Device:C_Small C2
U 1 1 5EEA0878
P 6800 4200
F 0 "C2" H 6892 4246 50  0000 L CNN
F 1 "0.1uF" H 6892 4155 50  0000 L CNN
F 2 "" H 6800 4200 50  0001 C CNN
F 3 "~" H 6800 4200 50  0001 C CNN
	1    6800 4200
	1    0    0    -1  
$EndComp
Wire Wire Line
	6800 4300 7100 4300
Wire Wire Line
	6800 4100 6800 4050
Connection ~ 6800 4050
Wire Wire Line
	6800 4050 6850 4050
Text GLabel 5850 4250 2    50   Input ~ 0
RX
Wire Wire Line
	5850 4050 6800 4050
Text GLabel 5850 4350 2    50   Input ~ 0
TX
Text HLabel 5850 2550 2    50   Output ~ 0
SPI_INT
$Comp
L Diode:1N4148 D1
U 1 1 5EE799CD
P 7000 3700
F 0 "D1" H 7000 3483 50  0000 C CNN
F 1 "1N4148" H 7000 3574 50  0000 C CNN
F 2 "Diode_THT:D_DO-35_SOD27_P7.62mm_Horizontal" H 7000 3525 50  0001 C CNN
F 3 "https://assets.nexperia.com/documents/data-sheet/1N4148_1N4448.pdf" H 7000 3700 50  0001 C CNN
	1    7000 3700
	-1   0    0    1   
$EndComp
Wire Wire Line
	6850 3700 6800 3700
Wire Wire Line
	6800 3700 6800 4050
Wire Wire Line
	7150 3700 7200 3700
Wire Wire Line
	7200 3700 7200 4050
Connection ~ 7200 4050
Wire Wire Line
	7200 4050 7150 4050
Text GLabel 5850 3150 2    50   Input ~ 0
XTAL1
Text GLabel 8100 2150 0    50   Input ~ 0
XTAL1
Text GLabel 5850 3250 2    50   Input ~ 0
XTAL2
Text GLabel 8100 2450 0    50   Input ~ 0
XTAL2
NoConn ~ 5850 3450
NoConn ~ 5850 3550
NoConn ~ 5850 3650
NoConn ~ 5850 3750
NoConn ~ 5850 3850
NoConn ~ 5850 3950
Text HLabel 6050 4450 2    50   Output ~ 0
MOTOR
Text HLabel 6050 4550 2    50   Output ~ 0
BATTERY
Wire Wire Line
	6050 4450 5850 4450
Wire Wire Line
	6050 4550 5850 4550
Text HLabel 6050 2650 2    50   Output ~ 0
INVERTER
Wire Wire Line
	6050 2650 5850 2650
$EndSCHEMATC
