{
    "common" : {
        "client_id" : "${APP_NAME}",
        "master_password" : "homerr",
        "server_timezone" : "Europe/Berlin",
        "register_nic": false
    },
    "database" : {
        "type" : "innodb",
        "host" : "${APP}mariadb",
        "user" : "root",
        "password" : "root",
        "database" : "${APP_NAME}",
        "create_database" : true
    },
    "chatroom" : {},
    "filesystem" : {
        "data_dir" : "/var/www/data"
    },
    "logging" : {
        "enable": true,
        "path_to_logfile": "/var/www/data/ilias.log",
        "errorlog_dir": "/var/www/data/errors"
    },
    "http" : {
        "path" : "https://${APP}.${DOMAIN}"
    },
    "systemfolder" : {
        "contact" : {
            "firstname" : "${APP_NAME}",
            "lastname" : "${APP_NAME}",
            "email" : "${APP_NAME}@${APP_NAME}.ex"
        },
        "client" : {
            "name" : "${APP_NAME}",
            "description" : "Description",
            "institution" : "Example Inc."
        }
    },
    "language" : {
        "install_languages" : ["de","en"],
        "default_language" : "de"
    },
    "utilities" : {
        "path_to_convert" : "/usr/bin/convert",
        "path_to_zip" : "/usr/bin/zip",
        "path_to_unzip" : "/usr/bin/unzip"
    }
}