<svg version="1.1" xmlns="http://www.w3.org/2000/svg" viewBox="0 0 4114.563963959035 2691.263709079089" width="4114.563963959035" height="2691.263709079089" filter="invert(93%) hue-rotate(180deg)">
  <!-- svg-source:excalidraw -->
  
  <defs>
    <style class="style-fonts">
      @font-face {
        font-family: "Virgil";
        src: url("https://excalidraw.com/Virgil.woff2");
      }
      @font-face {
        font-family: "Cascadia";
        src: url("https://excalidraw.com/Cascadia.woff2");
      }
      @font-face {
        font-family: "Assistant";
        src: url("https://excalidraw.com/Assistant-Regular.woff2");
      }
    </style>
    
  </defs>
  <rect x="0" y="0" width="4114.563963959035" height="2691.263709079089" fill="#ffffff"></rect><g stroke-linecap="round" transform="translate(1542.8460085273018 247.58880622256083) rotate(0 162.47469501785963 115.49372970109903)"><path d="M32 0 C87.08 0.57, 141.41 1.52, 292.95 0 M32 0 C104.54 -0.61, 176.54 -0.14, 292.95 0 M292.95 0 C312.72 0.27, 326.32 9.7, 324.95 32 M292.95 0 C315.97 -1.44, 323.65 11.56, 324.95 32 M324.95 32 C325.82 84.15, 325.96 137.51, 324.95 198.99 M324.95 32 C326.57 96.18, 327.3 159.57, 324.95 198.99 M324.95 198.99 C325.73 221.31, 312.57 232.2, 292.95 230.99 M324.95 198.99 C325.68 221.04, 312.03 232.37, 292.95 230.99 M292.95 230.99 C200.24 233.54, 106.91 233.43, 32 230.99 M292.95 230.99 C238.12 233.15, 183.09 232.23, 32 230.99 M32 230.99 C10.89 232.83, -1.04 220.08, 0 198.99 M32 230.99 C8.84 229.23, 0.85 221.13, 0 198.99 M0 198.99 C-1.26 166.37, 2.29 132.34, 0 32 M0 198.99 C0.93 151.75, 0.44 104.19, 0 32 M0 32 C1.89 10.07, 12.43 -0.8, 32 0 M0 32 C-1.13 8.54, 12.58 -0.19, 32 0" stroke="#1e1e1e" stroke-width="1" fill="none"></path></g><g transform="translate(1634.8925138163322 321.87133232990027) rotate(0 67.08333587646484 36.76703806354317)"><text x="0" y="51.532680549861986" font-family="Virgil, Segoe UI Emoji" font-size="58.82726090166893px" fill="#1e1e1e" text-anchor="start" style="white-space: pre;" direction="ltr" dominant-baseline="alphabetic">BDD</text></g><g stroke-linecap="round" transform="translate(1447.3229342613831 2450.2762496768905) rotate(0 162.47469501785963 115.49372970109926)"><path d="M32 0 C129.22 -0.45, 225.84 -1.03, 292.95 0 M32 0 C103.85 -1.18, 175.21 -0.04, 292.95 0 M292.95 0 C315.18 1.21, 326.07 8.91, 324.95 32 M292.95 0 C314.35 0.71, 322.81 10.2, 324.95 32 M324.95 32 C325.24 92.67, 322.27 151.37, 324.95 198.99 M324.95 32 C323.98 74.34, 323.84 116.77, 324.95 198.99 M324.95 198.99 C326.02 218.85, 312.39 229.33, 292.95 230.99 M324.95 198.99 C326.25 220.56, 316.04 232.26, 292.95 230.99 M292.95 230.99 C192.06 229.54, 92.71 229.77, 32 230.99 M292.95 230.99 C206.11 232.39, 119.96 232.05, 32 230.99 M32 230.99 C11.87 230.71, 1.42 219.86, 0 198.99 M32 230.99 C11.48 233.12, -0.83 222.06, 0 198.99 M0 198.99 C1.71 131.65, 2.81 68.18, 0 32 M0 198.99 C0.84 136.46, 0.76 71.88, 0 32 M0 32 C0.52 11.51, 12.04 1.96, 32 0 M0 32 C0.96 9.69, 12.74 1.43, 32 0" stroke="#1e1e1e" stroke-width="1" fill="none"></path></g><g transform="translate(1469.2725166207838 2507.6389115379366) rotate(0 146.022216796875 63.8655032380525)"><text x="0" y="44.75694466922705" font-family="Virgil, Segoe UI Emoji" font-size="51.09240259044184px" fill="#1e1e1e" text-anchor="start" style="white-space: pre;" direction="ltr" dominant-baseline="alphabetic">ECRAN </text><text x="0" y="108.62244790727937" font-family="Virgil, Segoe UI Emoji" font-size="51.09240259044184px" fill="#1e1e1e" text-anchor="start" style="white-space: pre;" direction="ltr" dominant-baseline="alphabetic">DE CAISSE</text></g><g stroke-linecap="round" transform="translate(2020.5496146223377 1651.3900975242573) rotate(0 167.26968832992316 127.4023383040485)"><path d="M32 0 C96.85 0.84, 162.01 0.65, 302.54 0 M32 0 C138.81 0.34, 244.53 0.57, 302.54 0 M302.54 0 C323.23 -1.8, 333.68 11.67, 334.54 32 M302.54 0 C323.54 0.25, 336.55 8.69, 334.54 32 M334.54 32 C333.55 82.42, 334.34 135.32, 334.54 222.8 M334.54 32 C335.69 71.23, 336.36 111.64, 334.54 222.8 M334.54 222.8 C333.36 245.01, 324.31 255.87, 302.54 254.8 M334.54 222.8 C334.19 244.83, 325.73 255.14, 302.54 254.8 M302.54 254.8 C244.11 257.47, 186.44 255.62, 32 254.8 M302.54 254.8 C221.83 255.21, 140.13 254.45, 32 254.8 M32 254.8 C10.03 256.71, -1.8 243.77, 0 222.8 M32 254.8 C11.22 252.78, 1.63 245.34, 0 222.8 M0 222.8 C-0.51 157, 1.66 90.11, 0 32 M0 222.8 C-1.78 160.54, -1.71 97.15, 0 32 M0 32 C-0.62 10.2, 10.97 -1.39, 32 0 M0 32 C0.05 10.82, 12.81 -2.29, 32 0" stroke="#1e1e1e" stroke-width="1" fill="none"></path></g><g transform="translate(2062.2311149504167 1749.7495467286922) rotate(0 133.44223022460938 24.63350250111398)"><text x="0" y="34.526317105561674" font-family="Virgil, Segoe UI Emoji" font-size="39.41360400178273px" fill="#1e1e1e" text-anchor="start" style="white-space: pre;" direction="ltr" dominant-baseline="alphabetic">CONTROLLER</text></g><g stroke-linecap="round"><g transform="translate(1694.0720902072117 2433.1674599434286) rotate(0 180.00566615021035 -253.08614595108747)"><path d="M1.01 0.42 C61 -84.07, 300.71 -421.37, 360.42 -505.79 M0.08 -0.4 C59.9 -84.75, 299.4 -423.66, 359.68 -507.71" stroke="#1e1e1e" stroke-width="1" fill="none"></path></g><g transform="translate(1694.0720902072117 2433.1674599434286) rotate(0 180.00566615021035 -253.08614595108747)"><path d="M353.04 -483.61 C355.78 -491.24, 358 -501.38, 359.68 -507.71 M353.04 -483.61 C354.77 -490.25, 358.06 -498.15, 359.68 -507.71" stroke="#1e1e1e" stroke-width="1" fill="none"></path></g><g transform="translate(1694.0720902072117 2433.1674599434286) rotate(0 180.00566615021035 -253.08614595108747)"><path d="M339.1 -493.52 C346.71 -497.87, 353.69 -504.63, 359.68 -507.71 M339.1 -493.52 C345.07 -497.01, 352.65 -501.86, 359.68 -507.71" stroke="#1e1e1e" stroke-width="1" fill="none"></path></g></g><mask></mask><g stroke-linecap="round" transform="translate(1450.492504373482 155.1638634400647) rotate(0 257.40489961065396 199.690760424759)"><path d="M32 0 C174.63 -1.07, 316.5 -1.04, 482.81 0 M482.81 0 C503.09 0.22, 515.94 11.34, 514.81 32 M514.81 32 C514.54 104.7, 514.45 177.36, 514.81 367.38 M514.81 367.38 C516.52 390.24, 505.03 400.54, 482.81 399.38 M482.81 399.38 C327.25 398.61, 172.47 399.89, 32 399.38 M32 399.38 C10.23 400.2, 1.43 388.79, 0 367.38 M0 367.38 C-0.32 276.22, -1.33 183.72, 0 32 M0 32 C1.73 11.75, 11.44 1.3, 32 0" stroke="#e03131" stroke-width="1.5" fill="none" stroke-dasharray="8 9"></path></g><g stroke-linecap="round" transform="translate(1102.4881484929774 704.4013758714077) rotate(0 657.3349127013516 783.1930188047158)"><path d="M32 0 C508.57 -0.05, 983.3 1.07, 1282.67 0 M1282.67 0 C1304.45 0.37, 1313.55 12.14, 1314.67 32 M1314.67 32 C1313.84 552.32, 1314.04 1072.3, 1314.67 1534.39 M1314.67 1534.39 C1315.16 1557.34, 1304.1 1565.75, 1282.67 1566.39 M1282.67 1566.39 C864.35 1567.86, 445.75 1567.93, 32 1566.39 M32 1566.39 C12.6 1565.42, 0.72 1554.96, 0 1534.39 M0 1534.39 C-0.9 1069.68, 0.08 603.1, 0 32 M0 32 C0.17 10.92, 10.73 0.25, 32 0" stroke="#e03131" stroke-width="1.5" fill="none" stroke-dasharray="8 9"></path></g><g transform="translate(771.7718574173377 673.1507749517846) rotate(0 142.34445190429688 39.04847496415414)"><text x="0" y="54.73034250975845" font-family="Virgil, Segoe UI Emoji" font-size="62.477559942646636px" fill="#e03131" text-anchor="start" style="white-space: pre;" direction="ltr" dominant-baseline="alphabetic">SERVEUR</text></g><g transform="translate(1088.1310402206982 154.80139745029328) rotate(0 174.24444580078125 39.04847496415414)"><text x="0" y="54.73034250975845" font-family="Virgil, Segoe UI Emoji" font-size="62.477559942646636px" fill="#e03131" text-anchor="start" style="white-space: pre;" direction="ltr" dominant-baseline="alphabetic">DATABASE</text></g><g stroke-linecap="round" transform="translate(2040.4886672091343 786.9682311645256) rotate(0 167.26968832992316 127.4023383040485)"><path d="M32 0 C122.14 -1, 211.05 -0.89, 302.54 0 M32 0 C138.49 -1.32, 245.48 -1.99, 302.54 0 M302.54 0 C324.27 0.06, 333.79 9.24, 334.54 32 M302.54 0 C325.3 -0.28, 332.46 10.34, 334.54 32 M334.54 32 C333.88 76.6, 332.58 123.3, 334.54 222.8 M334.54 32 C336.69 84.51, 335.8 138.82, 334.54 222.8 M334.54 222.8 C333.88 245.1, 323.55 253.32, 302.54 254.8 M334.54 222.8 C334.79 244.59, 321.85 257.02, 302.54 254.8 M302.54 254.8 C200.04 256.14, 100.42 255.57, 32 254.8 M302.54 254.8 C234.7 255.57, 168.19 255.67, 32 254.8 M32 254.8 C11.54 255.23, -1.69 243.36, 0 222.8 M32 254.8 C8.76 255.07, 1.8 242.04, 0 222.8 M0 222.8 C-2.99 158.19, -0.71 95.53, 0 32 M0 222.8 C1.58 146.79, 1.97 73.07, 0 32 M0 32 C-1.37 11.5, 9.06 0.65, 32 0 M0 32 C1.24 8.61, 11.23 -0.33, 32 0" stroke="#1e1e1e" stroke-width="1" fill="none"></path></g><g transform="translate(2074.722614576747 892.7564282069156) rotate(0 130.11111450195312 24.633502501114208)"><text x="0" y="34.526317105561674" font-family="Virgil, Segoe UI Emoji" font-size="39.41360400178273px" fill="#1e1e1e" text-anchor="start" style="white-space: pre;" direction="ltr" dominant-baseline="alphabetic">REPOSITORY</text></g><g stroke-linecap="round"><g transform="translate(2177.098892205673 1645.449017994531) rotate(0 8.428136815531616 -298.2112132083687)"><path d="M1.15 0.25 C4.12 -99.06, 15.09 -495.86, 17.62 -595.26 M0.29 -0.66 C3.19 -100.33, 14.58 -497.77, 17.07 -596.77" stroke="#1e1e1e" stroke-width="1" fill="none"></path></g><g transform="translate(2177.098892205673 1645.449017994531) rotate(0 8.428136815531616 -298.2112132083687)"><path d="M24.98 -573.06 C23.06 -578.38, 22.35 -587.2, 17.07 -596.77 M24.98 -573.06 C22.19 -580.26, 19.19 -587.83, 17.07 -596.77" stroke="#1e1e1e" stroke-width="1" fill="none"></path></g><g transform="translate(2177.098892205673 1645.449017994531) rotate(0 8.428136815531616 -298.2112132083687)"><path d="M7.89 -573.52 C10.78 -578.87, 14.87 -587.57, 17.07 -596.77 M7.89 -573.52 C10.59 -580.48, 13.1 -587.89, 17.07 -596.77" stroke="#1e1e1e" stroke-width="1" fill="none"></path></g></g><mask></mask><g stroke-linecap="round"><g transform="translate(2076.470480139915 769.2497667087423) rotate(0 -122.5655396523016 -130.60517504100403)"><path d="M0.78 -0.2 C-40.34 -43.79, -205.17 -217.25, -246 -260.63 M-0.27 -1.35 C-41.08 -45.37, -203.05 -218.93, -243.75 -262.45" stroke="#1e1e1e" stroke-width="1" fill="none"></path></g><g transform="translate(2076.470480139915 769.2497667087423) rotate(0 -122.5655396523016 -130.60517504100403)"><path d="M-221.46 -251.12 C-229.92 -256.51, -236.67 -257.58, -243.75 -262.45 M-221.46 -251.12 C-229.65 -254.38, -238.24 -258.57, -243.75 -262.45" stroke="#1e1e1e" stroke-width="1" fill="none"></path></g><g transform="translate(2076.470480139915 769.2497667087423) rotate(0 -122.5655396523016 -130.60517504100403)"><path d="M-233.96 -239.45 C-237.99 -249.14, -240.23 -254.41, -243.75 -262.45 M-233.96 -239.45 C-237.59 -246.81, -241.68 -255.19, -243.75 -262.45" stroke="#1e1e1e" stroke-width="1" fill="none"></path></g></g><mask></mask><g stroke-linecap="round" transform="translate(2441.559190636426 221.38536255376357) rotate(0 190.98947004397814 123.58147781524917)"><path d="M32 0 C123.07 -1.53, 214.66 -2.5, 349.98 0 M32 0 C147.17 -2.4, 262.67 -1.8, 349.98 0 M349.98 0 C372.05 -1.42, 381.29 11.25, 381.98 32 M349.98 0 C371.56 0.54, 383.11 8.64, 381.98 32 M381.98 32 C383.46 76.92, 383.5 120.27, 381.98 215.16 M381.98 32 C380.76 81.96, 381.03 131.47, 381.98 215.16 M381.98 215.16 C381.87 236.74, 371.93 246.7, 349.98 247.16 M381.98 215.16 C380.23 234.6, 373.31 247.46, 349.98 247.16 M349.98 247.16 C274.85 245.29, 197.43 246.87, 32 247.16 M349.98 247.16 C280.29 249.68, 211.64 248.67, 32 247.16 M32 247.16 C10.83 247.01, -1.7 235.58, 0 215.16 M32 247.16 C9.63 247.34, 1.97 236.61, 0 215.16 M0 215.16 C3.37 145.78, 3.15 74.28, 0 32 M0 215.16 C0.39 142.37, 0.3 71.38, 0 32 M0 32 C0.96 12.52, 11.5 -1.6, 32 0 M0 32 C1.19 11.16, 10.33 0.32, 32 0" stroke="#1e1e1e" stroke-width="1" fill="none"></path></g><g transform="translate(2458.2966499334307 284.9354002529585) rotate(0 180.10000610351562 59.39192202855452)"><text x="0" y="41.621858957611" font-family="Virgil, Segoe UI Emoji" font-size="47.51353762284361px" fill="#1e1e1e" text-anchor="start" style="white-space: pre;" direction="ltr" dominant-baseline="alphabetic">SERVICE </text><text x="0" y="101.01378098616551" font-family="Virgil, Segoe UI Emoji" font-size="47.51353762284361px" fill="#1e1e1e" text-anchor="start" style="white-space: pre;" direction="ltr" dominant-baseline="alphabetic">DE COMMANDE</text></g><g stroke-linecap="round" transform="translate(3722.585023871079 225.93351227617632) rotate(0 190.98947004397814 123.58147781524917)"><path d="M32 0 C147.05 -1.76, 258.65 -0.95, 349.98 0 M32 0 C95.88 -2.3, 160.9 -2.34, 349.98 0 M349.98 0 C369.59 0.52, 383.28 9.32, 381.98 32 M349.98 0 C371.35 -1.62, 382.71 9.56, 381.98 32 M381.98 32 C382.6 78.39, 383.36 128.91, 381.98 215.16 M381.98 32 C380.62 95.86, 379.77 157.68, 381.98 215.16 M381.98 215.16 C382.02 235.99, 372.5 245.67, 349.98 247.16 M381.98 215.16 C380.52 238.42, 372.07 247.83, 349.98 247.16 M349.98 247.16 C278.49 247.6, 204.52 247.91, 32 247.16 M349.98 247.16 C272.7 246.99, 195.96 246.23, 32 247.16 M32 247.16 C10.76 247.06, -0.64 235.56, 0 215.16 M32 247.16 C11.98 245.85, 1.31 236.33, 0 215.16 M0 215.16 C-2.32 156.69, -0.35 98.65, 0 32 M0 215.16 C-2.6 179.27, -2.75 141.11, 0 32 M0 32 C-0.97 9.66, 10.05 -0.22, 32 0 M0 32 C-1.78 12.01, 12.39 0.98, 32 0" stroke="#1e1e1e" stroke-width="1" fill="none"></path></g><g transform="translate(3767.7865051716235 283.1321888632592) rotate(0 160.76666259765625 68.45278230360827)"><text x="0" y="31.98113989224577" font-family="Virgil, Segoe UI Emoji" font-size="36.5081505619244px" fill="#1e1e1e" text-anchor="start" style="white-space: pre;" direction="ltr" dominant-baseline="alphabetic">API OU </text><text x="0" y="77.61632809465127" font-family="Virgil, Segoe UI Emoji" font-size="36.5081505619244px" fill="#1e1e1e" text-anchor="start" style="white-space: pre;" direction="ltr" dominant-baseline="alphabetic">SPECIFICATION </text><text x="0" y="123.25151629705678" font-family="Virgil, Segoe UI Emoji" font-size="36.5081505619244px" fill="#1e1e1e" text-anchor="start" style="white-space: pre;" direction="ltr" dominant-baseline="alphabetic">PDF</text></g><g stroke-linecap="round"><g transform="translate(2403.802231517464 357.26497790909616) rotate(0 -256.40858771223157 -1.3860886992852102)"><path d="M0.61 0.08 C-84.79 -0.47, -427.51 -1.71, -512.9 -2.35 M-0.53 -0.92 C-86.05 -1.92, -428.65 -3.91, -513.9 -4.24" stroke="#1e1e1e" stroke-width="1" fill="none"></path></g><g transform="translate(2403.802231517464 357.26497790909616) rotate(0 -256.40858771223157 -1.3860886992852102)"><path d="M-490.36 -12.67 C-496.24 -10.52, -501.75 -6.45, -513.9 -4.24 M-490.36 -12.67 C-496 -11.36, -499.89 -10.11, -513.9 -4.24" stroke="#1e1e1e" stroke-width="1" fill="none"></path></g><g transform="translate(2403.802231517464 357.26497790909616) rotate(0 -256.40858771223157 -1.3860886992852102)"><path d="M-490.45 4.43 C-496.44 2.16, -501.93 1.81, -513.9 -4.24 M-490.45 4.43 C-495.91 2.02, -499.79 -0.47, -513.9 -4.24" stroke="#1e1e1e" stroke-width="1" fill="none"></path></g></g><mask></mask><g transform="translate(1834.0449983346116 2481.303130703572) rotate(0 339.1944580078125 39.570604688354706)"><text x="0" y="27.73107976559905" font-family="Virgil, Segoe UI Emoji" font-size="31.656483750683844px" fill="#1e1e1e" text-anchor="start" style="white-space: pre;" direction="ltr" dominant-baseline="alphabetic">Ce composant permettra d'afficher l'écran </text><text x="0" y="67.30168445395385" font-family="Virgil, Segoe UI Emoji" font-size="31.656483750683844px" fill="#1e1e1e" text-anchor="start" style="white-space: pre;" direction="ltr" dominant-baseline="alphabetic">de caisse pour les serveurs et le patron </text></g><g transform="translate(2456.2588850143547 1664.2475347417735) rotate(0 413.76666259765625 59.355907032532286)"><text x="0" y="27.73107976559905" font-family="Virgil, Segoe UI Emoji" font-size="31.656483750683844px" fill="#1e1e1e" text-anchor="start" style="white-space: pre;" direction="ltr" dominant-baseline="alphabetic">Ce composant permettra de controller les données </text><text x="0" y="67.30168445395385" font-family="Virgil, Segoe UI Emoji" font-size="31.656483750683844px" fill="#1e1e1e" text-anchor="start" style="white-space: pre;" direction="ltr" dominant-baseline="alphabetic">en appelant des méthodes du repository pour obtenir</text><text x="0" y="106.87228914230866" font-family="Virgil, Segoe UI Emoji" font-size="31.656483750683844px" fill="#1e1e1e" text-anchor="start" style="white-space: pre;" direction="ltr" dominant-baseline="alphabetic">les données et les renvoyer au front</text></g><g transform="translate(2485.3444066960183 870.3417646605035) rotate(0 302.6444396972656 47.63215462833318)"><text x="0" y="33.380613963535836" font-family="Virgil, Segoe UI Emoji" font-size="38.10572370266648px" fill="#1e1e1e" text-anchor="start" style="white-space: pre;" direction="ltr" dominant-baseline="alphabetic">Ce composant permettra de </text><text x="0" y="81.01276859186893" font-family="Virgil, Segoe UI Emoji" font-size="38.10572370266648px" fill="#1e1e1e" text-anchor="start" style="white-space: pre;" direction="ltr" dominant-baseline="alphabetic">récupérer les données à la bdd </text></g><g stroke-linecap="round" transform="translate(3082.171449313848 231.02246571875776) rotate(0 159.6541765560587 120.31903649123478)"><path d="M32 0 C83.42 -1.06, 134.9 -1.34, 287.31 0 M32 0 C128.09 1.4, 222.99 1.06, 287.31 0 M287.31 0 C308.57 -1.22, 317.79 9.38, 319.31 32 M287.31 0 C310.58 -1.61, 319.41 10.6, 319.31 32 M319.31 32 C320.16 75.51, 320.64 120.36, 319.31 208.64 M319.31 32 C321.34 87.81, 320.12 143.22, 319.31 208.64 M319.31 208.64 C320.94 228.5, 307.45 240.77, 287.31 240.64 M319.31 208.64 C319.25 227.79, 309.19 240.27, 287.31 240.64 M287.31 240.64 C223.03 240.36, 161.66 239.95, 32 240.64 M287.31 240.64 C222.45 240.45, 159.66 241.19, 32 240.64 M32 240.64 C10.97 240.37, -0.31 230.08, 0 208.64 M32 240.64 C9.59 240.76, 0.16 227.94, 0 208.64 M0 208.64 C-2.51 172.8, 0.67 137.04, 0 32 M0 208.64 C0.18 164.39, 1.64 118.69, 0 32 M0 32 C-0.61 10.52, 12.08 -0.86, 32 0 M0 32 C2.24 9.87, 11.19 1.99, 32 0" stroke="#1e1e1e" stroke-width="2" fill="none"></path></g><g transform="translate(3130.2780220563345 303.1436462595975) rotate(0 131.30555725097656 68.73673276907562)"><text x="0" y="32.11380154971212" font-family="Virgil, Segoe UI Emoji" font-size="36.659590810173654px" fill="#1e1e1e" text-anchor="start" style="white-space: pre;" direction="ltr" dominant-baseline="alphabetic">ADAPTEUR </text><text x="0" y="77.93829006242919" font-family="Virgil, Segoe UI Emoji" font-size="36.659590810173654px" fill="#1e1e1e" text-anchor="start" style="white-space: pre;" direction="ltr" dominant-baseline="alphabetic">FORMAT</text><text x="0" y="123.76277857514626" font-family="Virgil, Segoe UI Emoji" font-size="36.659590810173654px" fill="#1e1e1e" text-anchor="start" style="white-space: pre;" direction="ltr" dominant-baseline="alphabetic">FOURNISSEUR</text></g><g stroke-linecap="round"><g transform="translate(3419.9901450486886 353.6555157016792) rotate(0 143.45727369902306 -2.313925226148285)"><path d="M-0.09 -0.89 C47.79 -1.76, 238.79 -3.98, 286.48 -4.48 M-1.6 1.26 C46.15 0.53, 236.96 -1.69, 285.31 -2.87" stroke="#1e1e1e" stroke-width="2" fill="none"></path></g><g transform="translate(3419.9901450486886 353.6555157016792) rotate(0 143.45727369902306 -2.313925226148285)"><path d="M261.96 6.09 C265.87 3.29, 273.05 0.5, 285.31 -2.87 M261.96 6.09 C269.84 3.54, 278.41 0.4, 285.31 -2.87" stroke="#1e1e1e" stroke-width="2" fill="none"></path></g><g transform="translate(3419.9901450486886 353.6555157016792) rotate(0 143.45727369902306 -2.313925226148285)"><path d="M261.67 -11.01 C265.76 -9.81, 273.01 -8.61, 285.31 -2.87 M261.67 -11.01 C269.76 -7.35, 278.44 -4.29, 285.31 -2.87" stroke="#1e1e1e" stroke-width="2" fill="none"></path></g></g><mask></mask><g stroke-linecap="round"><g transform="translate(3059.0328149111374 351.34154634276183) rotate(0 -111.0637327815657 0)"><path d="M0.73 -0.45 C-36.51 -0.62, -185.53 -0.48, -222.51 -0.23 M-0.35 -1.74 C-37.86 -1.78, -186.81 1.02, -223.65 1.18" stroke="#1e1e1e" stroke-width="2" fill="none"></path></g><g transform="translate(3059.0328149111374 351.34154634276183) rotate(0 -111.0637327815657 0)"><path d="M-200.27 -7.66 C-209.82 -4.8, -218.3 0.83, -223.65 1.18 M-200.27 -7.66 C-210.37 -4.56, -218.82 -0.13, -223.65 1.18" stroke="#1e1e1e" stroke-width="2" fill="none"></path></g><g transform="translate(3059.0328149111374 351.34154634276183) rotate(0 -111.0637327815657 0)"><path d="M-200.06 9.44 C-209.8 5.83, -218.35 4.99, -223.65 1.18 M-200.06 9.44 C-210.07 5.9, -218.61 3.68, -223.65 1.18" stroke="#1e1e1e" stroke-width="2" fill="none"></path></g></g><mask></mask><g transform="translate(2465.789646407893 10) rotate(0 635.2555541992188 78.17920138955469)"><text x="0" y="27.393992166899935" font-family="Virgil, Segoe UI Emoji" font-size="31.271680555821842px" fill="#1e1e1e" text-anchor="start" style="white-space: pre;" direction="ltr" dominant-baseline="alphabetic">Ce service permettra de récupérer les données des api fournisseurs</text><text x="0" y="66.48359286167724" font-family="Virgil, Segoe UI Emoji" font-size="31.271680555821842px" fill="#1e1e1e" text-anchor="start" style="white-space: pre;" direction="ltr" dominant-baseline="alphabetic">il sera sous le format d'un strategy pattern, c'est à dire qu'il y aura une </text><text x="0" y="105.57319355645454" font-family="Virgil, Segoe UI Emoji" font-size="31.271680555821842px" fill="#1e1e1e" text-anchor="start" style="white-space: pre;" direction="ltr" dominant-baseline="alphabetic">grosse base commune mais qu'ensuite plusieurs méthodes seront dédiés à chaque </text><text x="0" y="144.66279425123184" font-family="Virgil, Segoe UI Emoji" font-size="31.271680555821842px" fill="#1e1e1e" text-anchor="start" style="white-space: pre;" direction="ltr" dominant-baseline="alphabetic">api fournisseur pour s'adapter</text></g><g transform="translate(606.4966171018532 295.3366446442101) rotate(0 421.5 68.78308014246977)"><text x="0" y="32.13545504256186" font-family="Virgil, Segoe UI Emoji" font-size="36.684309409317194px" fill="#1e1e1e" text-anchor="start" style="white-space: pre;" direction="ltr" dominant-baseline="alphabetic">La BDD sera en MysQL car c'est une base</text><text x="0" y="77.99084180420834" font-family="Virgil, Segoe UI Emoji" font-size="36.684309409317194px" fill="#1e1e1e" text-anchor="start" style="white-space: pre;" direction="ltr" dominant-baseline="alphabetic">de données rapide et simple à mettre en place</text><text x="0" y="123.84622856585484" font-family="Virgil, Segoe UI Emoji" font-size="36.684309409317194px" fill="#1e1e1e" text-anchor="start" style="white-space: pre;" direction="ltr" dominant-baseline="alphabetic">et à utiliser.</text></g><g transform="translate(153.76614699099446 770.6747943596583) rotate(0 459.1055603027344 74.71748887332183)"><text x="0" y="26.181008101211987" font-family="Virgil, Segoe UI Emoji" font-size="29.886995549328752px" fill="#1e1e1e" text-anchor="start" style="white-space: pre;" direction="ltr" dominant-baseline="alphabetic">Ce module sera développé en PHP avec le framework symfony </text><text x="0" y="63.53975253787293" font-family="Virgil, Segoe UI Emoji" font-size="29.886995549328752px" fill="#1e1e1e" text-anchor="start" style="white-space: pre;" direction="ltr" dominant-baseline="alphabetic">car il représente bien le système d'architecture mis en place </text><text x="0" y="100.89849697453387" font-family="Virgil, Segoe UI Emoji" font-size="29.886995549328752px" fill="#1e1e1e" text-anchor="start" style="white-space: pre;" direction="ltr" dominant-baseline="alphabetic">avec dez controllers qui renvoie des vues et qui appellent les</text><text x="0" y="138.2572414111948" font-family="Virgil, Segoe UI Emoji" font-size="29.886995549328752px" fill="#1e1e1e" text-anchor="start" style="white-space: pre;" direction="ltr" dominant-baseline="alphabetic">repository des entity associées</text></g><g transform="translate(438.20825463353685 2466.223802446508) rotate(0 502.1222229003906 73.17261267005051)"><text x="0" y="25.639683479585706" font-family="Virgil, Segoe UI Emoji" font-size="29.26904506802021px" fill="#1e1e1e" text-anchor="start" style="white-space: pre;" direction="ltr" dominant-baseline="alphabetic">Cette partie sera fait en twig car c'est le moteur de template du</text><text x="0" y="62.22598981461097" font-family="Virgil, Segoe UI Emoji" font-size="29.26904506802021px" fill="#1e1e1e" text-anchor="start" style="white-space: pre;" direction="ltr" dominant-baseline="alphabetic">framework symfony donc plus simple à utiliser et une mise en place</text><text x="0" y="98.81229614963624" font-family="Virgil, Segoe UI Emoji" font-size="29.26904506802021px" fill="#1e1e1e" text-anchor="start" style="white-space: pre;" direction="ltr" dominant-baseline="alphabetic">déjà prête, et au vu de la simplicité de l'appli demandé il n'y a pas </text><text x="0" y="135.3986024846615" font-family="Virgil, Segoe UI Emoji" font-size="29.26904506802021px" fill="#1e1e1e" text-anchor="start" style="white-space: pre;" direction="ltr" dominant-baseline="alphabetic">de besoin de mettre en place un gros front</text></g><g transform="translate(2463.700168433361 517.7790971076092) rotate(0 703.6500244140625 58.98924208955009)"><text x="0" y="27.55977390423779" font-family="Virgil, Segoe UI Emoji" font-size="31.460929114426698px" fill="#1e1e1e" text-anchor="start" style="white-space: pre;" direction="ltr" dominant-baseline="alphabetic">Le service sera lui aussi fait en symfony pour rester à la fois sur la même</text><text x="0" y="66.88593529727116" font-family="Virgil, Segoe UI Emoji" font-size="31.460929114426698px" fill="#1e1e1e" text-anchor="start" style="white-space: pre;" direction="ltr" dominant-baseline="alphabetic">stack que l'app, nous utiliserons le service grace au commande symfony qui </text><text x="0" y="106.21209669030453" font-family="Virgil, Segoe UI Emoji" font-size="31.460929114426698px" fill="#1e1e1e" text-anchor="start" style="white-space: pre;" direction="ltr" dominant-baseline="alphabetic">permettrons de faire un système en cron pour effectuer rapidement des réapprovionnement</text></g><g transform="translate(2461.567820394772 665.8168247677872) rotate(0 788.7166748046884 67.5)"><text x="0" y="31.536" font-family="Virgil, Segoe UI Emoji" font-size="36px" fill="#ff8787" text-anchor="start" style="white-space: pre;" direction="ltr" dominant-baseline="alphabetic">Attention utilisation de symfony en tant que framework pour faciliter le développement. </text><text x="0" y="76.536" font-family="Virgil, Segoe UI Emoji" font-size="36px" fill="#ff8787" text-anchor="start" style="white-space: pre;" direction="ltr" dominant-baseline="alphabetic">Donc risque imposé par l'utilisation d'une architecture, si la BDD doit changer,</text><text x="0" y="121.536" font-family="Virgil, Segoe UI Emoji" font-size="36px" fill="#ff8787" text-anchor="start" style="white-space: pre;" direction="ltr" dominant-baseline="alphabetic">toute l'application risque d'être impactée.</text></g><g stroke-linecap="round" transform="translate(1153.4360890237585 1967.2352267252131) rotate(0 167.26968832992316 127.4023383040485)"><path d="M32 0 C120.07 0.35, 205.09 1.09, 302.54 0 M32 0 C136.03 0.77, 238.19 1.02, 302.54 0 M302.54 0 C323.29 -1.49, 335.14 11.49, 334.54 32 M302.54 0 C321.84 -0.65, 333.68 9.95, 334.54 32 M334.54 32 C333.48 86.09, 332.44 137.19, 334.54 222.8 M334.54 32 C335.26 79.89, 335.24 128.02, 334.54 222.8 M334.54 222.8 C333.57 243.04, 323.15 253.15, 302.54 254.8 M334.54 222.8 C334.08 245.31, 325.6 252.87, 302.54 254.8 M302.54 254.8 C208.45 254.43, 112.25 253.3, 32 254.8 M302.54 254.8 C238.42 256.31, 176.48 255.38, 32 254.8 M32 254.8 C10.81 256.02, -1.22 244.78, 0 222.8 M32 254.8 C12.25 254.31, -0.91 243.71, 0 222.8 M0 222.8 C-3.2 148.26, -0.38 75.06, 0 32 M0 222.8 C-0.68 161.02, -0.8 99.67, 0 32 M0 32 C0.25 12.26, 11.58 -1.32, 32 0 M0 32 C-1.41 11.7, 10.73 2.16, 32 0" stroke="#1e1e1e" stroke-width="1" fill="none"></path></g><g stroke-linecap="round"><g transform="translate(2010.1146277555508 1797.5652057391294) rotate(0 -248.18722439756039 111.5589058278374)"><path d="M-1 -0.06 C-84.01 37.15, -414.51 187.05, -497.14 224.08 M0.67 -1.14 C-82.02 35.68, -411.76 185.13, -494.84 222.46" stroke="#343a40" stroke-width="2" fill="none"></path></g><g transform="translate(2010.1146277555508 1797.5652057391294) rotate(0 -248.18722439756039 111.5589058278374)"><path d="M-476.94 205 C-483.58 210.06, -488.54 217.16, -494.84 222.46 M-476.94 205 C-480.24 208.33, -483.49 211.42, -494.84 222.46" stroke="#343a40" stroke-width="2" fill="none"></path></g><g transform="translate(2010.1146277555508 1797.5652057391294) rotate(0 -248.18722439756039 111.5589058278374)"><path d="M-469.91 220.58 C-479.27 219.79, -486.84 221.1, -494.84 222.46 M-469.91 220.58 C-474.8 220.57, -479.55 220.34, -494.84 222.46" stroke="#343a40" stroke-width="2" fill="none"></path></g></g><mask></mask><g transform="translate(1245.497539128026 2073.9555194713125) rotate(0 70.23800827544346 31.78767201944129)"><text x="0" y="44.55360110244919" font-family="Virgil, Segoe UI Emoji" font-size="50.86027523110638px" fill="#343a40" text-anchor="start" style="white-space: pre;" direction="ltr" dominant-baseline="alphabetic">DBAL</text></g><g stroke-linecap="round" transform="translate(1163.4637011089635 1572.3920238566175) rotate(0 167.26968832992316 127.4023383040485)"><path d="M32 0 C136.8 1.24, 240.66 -0.22, 302.54 0 M32 0 C139.59 1.15, 247.83 1.72, 302.54 0 M302.54 0 C324.48 -0.37, 334.57 11.94, 334.54 32 M302.54 0 C322.21 -0.13, 332.53 11.31, 334.54 32 M334.54 32 C335.9 73.89, 336.09 115.83, 334.54 222.8 M334.54 32 C333.99 84.87, 333.06 136.95, 334.54 222.8 M334.54 222.8 C334.04 244.51, 325.58 255.57, 302.54 254.8 M334.54 222.8 C335.99 242, 322.56 255.85, 302.54 254.8 M302.54 254.8 C223.45 254.06, 140.64 255.37, 32 254.8 M302.54 254.8 C213.76 253.67, 124.33 254.42, 32 254.8 M32 254.8 C9.98 254.52, 1.9 243.43, 0 222.8 M32 254.8 C9.56 256.61, -0.86 244.22, 0 222.8 M0 222.8 C-1.54 152.68, -1.38 82.36, 0 32 M0 222.8 C1.18 162.9, 0.96 101.57, 0 32 M0 32 C0.53 9.38, 11.66 -1.75, 32 0 M0 32 C-0.86 12.74, 9.31 -0.13, 32 0" stroke="#1e1e1e" stroke-width="1" fill="none"></path></g><g transform="translate(1190.3447163372166 1671.5915119065944) rotate(0 131.80364990234375 31.78767201944129)"><text x="0" y="44.55360110244919" font-family="Virgil, Segoe UI Emoji" font-size="50.86027523110638px" fill="#343a40" text-anchor="start" style="white-space: pre;" direction="ltr" dominant-baseline="alphabetic">SECURITY</text></g><g stroke-linecap="round"><g transform="translate(2010.1146277555508 1739.9055755592358) rotate(0 -245.6803213762596 -17.548512413543904)"><path d="M0.92 -0.47 C-80.74 -6.33, -408.22 -29.29, -490.32 -34.99 M-0.06 -1.77 C-81.76 -7.42, -408.63 -27.56, -490.72 -33.4" stroke="#343a40" stroke-width="2" fill="none"></path></g><g transform="translate(2010.1146277555508 1739.9055755592358) rotate(0 -245.6803213762596 -17.548512413543904)"><path d="M-466.72 -40.39 C-473.99 -36.59, -479.52 -36.94, -490.72 -33.4 M-466.72 -40.39 C-473.98 -37.25, -483.24 -34.68, -490.72 -33.4" stroke="#343a40" stroke-width="2" fill="none"></path></g><g transform="translate(2010.1146277555508 1739.9055755592358) rotate(0 -245.6803213762596 -17.548512413543904)"><path d="M-467.84 -23.33 C-474.83 -24.14, -480.05 -29.11, -490.72 -33.4 M-467.84 -23.33 C-474.6 -25.9, -483.48 -29.03, -490.72 -33.4" stroke="#343a40" stroke-width="2" fill="none"></path></g></g><mask></mask><g stroke-linecap="round" transform="translate(1165.9706041302616 1226.4343384094732) rotate(0 167.26968832992316 127.4023383040485)"><path d="M32 0 C122.91 0.51, 212.93 1.36, 302.54 0 M32 0 C110.07 -0.52, 189.21 -0.48, 302.54 0 M302.54 0 C324.03 0.56, 335.2 12.08, 334.54 32 M302.54 0 C323.64 -0.33, 333.58 12.92, 334.54 32 M334.54 32 C334.16 85.71, 334.21 139.05, 334.54 222.8 M334.54 32 C335.58 97.38, 335.13 163.98, 334.54 222.8 M334.54 222.8 C334.64 243.12, 323.85 255.46, 302.54 254.8 M334.54 222.8 C336.73 245.97, 324.04 256.68, 302.54 254.8 M302.54 254.8 C226.78 254.54, 149.58 256.88, 32 254.8 M302.54 254.8 C246.53 254.91, 189.88 254.65, 32 254.8 M32 254.8 C9.4 255.24, -1.35 245.45, 0 222.8 M32 254.8 C11.82 253.62, 2.17 244.57, 0 222.8 M0 222.8 C0.62 148.65, -1.14 77.44, 0 32 M0 222.8 C1.99 183.84, 2.05 143.31, 0 32 M0 32 C0.24 11.98, 9.42 -1.91, 32 0 M0 32 C0.14 9.26, 12.34 1.53, 32 0" stroke="#1e1e1e" stroke-width="1" fill="none"></path></g><g transform="translate(1258.0320542345307 1333.1546311555726) rotate(0 69.7799072265625 31.787672019441516)"><text x="0" y="44.55360110244919" font-family="Virgil, Segoe UI Emoji" font-size="50.86027523110638px" fill="#343a40" text-anchor="start" style="white-space: pre;" direction="ltr" dominant-baseline="alphabetic">FORM</text></g><g stroke-linecap="round"><g transform="translate(2022.649334126494 1644.6417306342923) rotate(0 -251.94767456173122 -142.89562393908454)"><path d="M-0.92 -0.16 C-84.67 -47.75, -419.67 -237.5, -503.48 -285.1 M0.79 -1.29 C-82.98 -49.26, -420 -239.67, -504.21 -286.87" stroke="#343a40" stroke-width="2" fill="none"></path></g><g transform="translate(2022.649334126494 1644.6417306342923) rotate(0 -251.94767456173122 -142.89562393908454)"><path d="M-479.55 -282.79 C-485.15 -283.17, -489.04 -284.57, -504.21 -286.87 M-479.55 -282.79 C-487.47 -284.82, -494.24 -284.57, -504.21 -286.87" stroke="#343a40" stroke-width="2" fill="none"></path></g><g transform="translate(2022.649334126494 1644.6417306342923) rotate(0 -251.94767456173122 -142.89562393908454)"><path d="M-487.94 -267.89 C-491.78 -271.41, -493.87 -276.02, -504.21 -286.87 M-487.94 -267.89 C-493.44 -274.36, -497.69 -278.6, -504.21 -286.87" stroke="#343a40" stroke-width="2" fill="none"></path></g></g><mask></mask><g transform="translate(290.5097686302106 1257.1078259737) rotate(0 389.45813466978325 33.94861251531324)"><text x="0" y="23.791187650731526" font-family="Virgil, Segoe UI Emoji" font-size="27.158890012250602px" fill="#343a40" text-anchor="start" style="white-space: pre;" direction="ltr" dominant-baseline="alphabetic">Ce composant permet de mettre en place les design </text><text x="0" y="57.73980016604477" font-family="Virgil, Segoe UI Emoji" font-size="27.158890012250602px" fill="#343a40" text-anchor="start" style="white-space: pre;" direction="ltr" dominant-baseline="alphabetic">template des formulaires, leur validités et fonctionnement</text></g><g transform="translate(10 1591.1561864578907) rotate(0 524.8180325449575 33.94861251531324)"><text x="0" y="23.791187650731523" font-family="Virgil, Segoe UI Emoji" font-size="27.158890012250595px" fill="#343a40" text-anchor="start" style="white-space: pre;" direction="ltr" dominant-baseline="alphabetic">Ce composant va gérer tout l'ascpect de la sécurité de l'application, avec le</text><text x="0" y="57.739800166044766" font-family="Virgil, Segoe UI Emoji" font-size="27.158890012250595px" fill="#343a40" text-anchor="start" style="white-space: pre;" direction="ltr" dominant-baseline="alphabetic">système de connexion, et l'accès en fonction des roles</text></g><g transform="translate(105.43559978391932 2009.8123259055287) rotate(0 483.83861098448233 34.03099138240759)"><text x="0" y="23.848918760791236" font-family="Virgil, Segoe UI Emoji" font-size="27.224793105926068px" fill="#343a40" text-anchor="start" style="white-space: pre;" direction="ltr" dominant-baseline="alphabetic">Ce composant permet de gérer les types et interraction avec la BDD</text><text x="0" y="57.87991014319882" font-family="Virgil, Segoe UI Emoji" font-size="27.224793105926068px" fill="#343a40" text-anchor="start" style="white-space: pre;" direction="ltr" dominant-baseline="alphabetic">ce qui permettra de controller ce qui est soumis et va rentrer en base</text></g></svg>