{
  "credentials": {
    "tutor": {
      "delivery": {
        "console": {
          "aws_access_key_id": "",
          "aws_secret_access_key": "",
          "aws_default_region": "ap-northeast-1"
        },
        "terraform": {
          "aws_access_key_id": "",
          "aws_secret_access_key": "",
          "aws_default_region": "ap-northeast-1"
        }
      },
      "runtimes": {
        "staging": {
          "console": {
            "aws_access_key_id": "",
            "aws_secret_access_key": "",
            "aws_default_region": "ap-northeast-1"
          },
          "terraform": {
            "aws_access_key_id": "",
            "aws_secret_access_key": "",
            "aws_default_region": "ap-northeast-1"
          }
        }
      }
    },
    "sato": {
      "delivery": {
        "console": {
          "aws_access_key_id": "",
          "aws_secret_access_key": "",
          "aws_default_region": "ap-northeast-1"
        },
        "terraform": {
          "aws_access_key_id": "",
          "aws_secret_access_key": "",
          "aws_default_region": "ap-northeast-1"
        }
      },
      "runtimes": {
        "staging": {
          "console": {
            "aws_access_key_id": "",
            "aws_secret_access_key": "",
            "aws_default_region": "ap-northeast-1"
          },
          "terraform": {
            "aws_access_key_id": "",
            "aws_secret_access_key": "",
            "aws_default_region": "ap-northeast-1"
          }
        }
      }
    }
  }
}
