school,lat,lon,location
MIT,42.36008200117941,-71.09416346986666,USA
Technion,32.7768471223198,35.02409925267326,ISR
The University of Melbourne,-37.798482774160185,144.96087752683582,AUS
Oxford,51.75516025939597, -1.260103866755462,GBR
CUHK,22.419585307988648, 114.20677132491018,HKG