{
  "EParishes.Core.BuildingBlocks.Domain.dll": {},
  "Domain.dll": {
    "/home/urbanowiczdev/RiderProjects/EParishes.Core/src/Domain/Address.cs": {
      "Domain.Address": {
        "System.String Domain.Address::get_Street()": {
          "Lines": {
            "20": 6
          },
          "Branches": []
        },
        "System.String Domain.Address::get_StreetDetails()": {
          "Lines": {
            "21": 6
          },
          "Branches": []
        },
        "System.String Domain.Address::get_City()": {
          "Lines": {
            "22": 21
          },
          "Branches": []
        },
        "System.String Domain.Address::get_PostalCode()": {
          "Lines": {
            "23": 6
          },
          "Branches": []
        },
        "System.String Domain.Address::get_Country()": {
          "Lines": {
            "24": 6
          },
          "Branches": []
        },
        "System.Object Domain.Address::Clone()": {
          "Lines": {
            "27": 0,
            "28": 0,
            "29": 0
          },
          "Branches": []
        },
        "System.Boolean Domain.Address::Equals(Domain.Address)": {
          "Lines": {
            "32": 3,
            "33": 3,
            "34": 3,
            "35": 3
          },
          "Branches": [
            {
              "Line": 33,
              "Offset": 18,
              "EndOffset": 20,
              "Path": 0,
              "Ordinal": 0,
              "Hits": 3
            },
            {
              "Line": 33,
              "Offset": 37,
              "EndOffset": 39,
              "Path": 0,
              "Ordinal": 2,
              "Hits": 3
            },
            {
              "Line": 33,
              "Offset": 56,
              "EndOffset": 58,
              "Path": 0,
              "Ordinal": 4,
              "Hits": 3
            },
            {
              "Line": 33,
              "Offset": 75,
              "EndOffset": 77,
              "Path": 0,
              "Ordinal": 6,
              "Hits": 3
            },
            {
              "Line": 33,
              "Offset": 18,
              "EndOffset": 96,
              "Path": 1,
              "Ordinal": 1,
              "Hits": 0
            },
            {
              "Line": 33,
              "Offset": 37,
              "EndOffset": 96,
              "Path": 1,
              "Ordinal": 3,
              "Hits": 0
            },
            {
              "Line": 33,
              "Offset": 56,
              "EndOffset": 96,
              "Path": 1,
              "Ordinal": 5,
              "Hits": 0
            },
            {
              "Line": 33,
              "Offset": 75,
              "EndOffset": 96,
              "Path": 1,
              "Ordinal": 7,
              "Hits": 0
            }
          ]
        },
        "System.Void Domain.Address::UpdateCity(System.String)": {
          "Lines": {
            "38": 0,
            "39": 0,
            "40": 0
          },
          "Branches": []
        },
        "System.Void Domain.Address::.ctor()": {
          "Lines": {
            "7": 0,
            "8": 0,
            "9": 0
          },
          "Branches": []
        },
        "System.Void Domain.Address::.ctor(System.String,System.String,System.String,System.String,System.String)": {
          "Lines": {
            "11": 15,
            "12": 15,
            "13": 15,
            "14": 15,
            "15": 15,
            "16": 15,
            "17": 15,
            "18": 15
          },
          "Branches": []
        }
      }
    },
    "/home/urbanowiczdev/RiderProjects/EParishes.Core/src/Domain/User/User.cs": {
      "Domain.User.User": {
        "System.String Domain.User.User::get_FirstName()": {
          "Lines": {
            "19": 0
          },
          "Branches": []
        },
        "System.String Domain.User.User::get_LastName()": {
          "Lines": {
            "20": 0
          },
          "Branches": []
        },
        "System.Collections.Generic.List`1<System.Guid> Domain.User.User::get_Roles()": {
          "Lines": {
            "21": 0
          },
          "Branches": []
        },
        "System.Void Domain.User.User::AddRole(System.Guid)": {
          "Lines": {
            "24": 0,
            "25": 0,
            "26": 0
          },
          "Branches": []
        },
        "System.Void Domain.User.User::.ctor(System.String,System.String)": {
          "Lines": {
            "9": 0,
            "10": 0,
            "11": 0,
            "12": 0,
            "13": 0
          },
          "Branches": [
            {
              "Line": 11,
              "Offset": 22,
              "EndOffset": 24,
              "Path": 0,
              "Ordinal": 0,
              "Hits": 0
            },
            {
              "Line": 11,
              "Offset": 22,
              "EndOffset": 36,
              "Path": 1,
              "Ordinal": 1,
              "Hits": 0
            },
            {
              "Line": 12,
              "Offset": 44,
              "EndOffset": 46,
              "Path": 0,
              "Ordinal": 2,
              "Hits": 0
            },
            {
              "Line": 12,
              "Offset": 44,
              "EndOffset": 58,
              "Path": 1,
              "Ordinal": 3,
              "Hits": 0
            }
          ]
        },
        "System.Void Domain.User.User::.ctor()": {
          "Lines": {
            "15": 0,
            "16": 0,
            "17": 0
          },
          "Branches": []
        }
      }
    },
    "/home/urbanowiczdev/RiderProjects/EParishes.Core/src/Domain/Services/MembershipService.cs": {
      "Domain.Services.MembershipService/<AssignUserAsParishAdmin>d__2": {
        "System.Void Domain.Services.MembershipService/<AssignUserAsParishAdmin>d__2::MoveNext()": {
          "Lines": {
            "15": 0,
            "16": 0,
            "17": 0,
            "18": 0,
            "19": 0
          },
          "Branches": [
            {
              "Line": 15,
              "Offset": 14,
              "EndOffset": 25,
              "Path": 0,
              "Ordinal": 0,
              "Hits": 0
            },
            {
              "Line": 15,
              "Offset": 14,
              "EndOffset": 294,
              "Path": 1,
              "Ordinal": 1,
              "Hits": 0
            }
          ]
        }
      },
      "Domain.Services.MembershipService/<AddRoleToUser>d__3": {
        "System.Void Domain.Services.MembershipService/<AddRoleToUser>d__3::MoveNext()": {
          "Lines": {
            "22": 0,
            "25": 0
          },
          "Branches": []
        }
      }
    },
    "/home/urbanowiczdev/RiderProjects/EParishes.Core/src/Domain/SeedWork/DomainEvent.cs": {
      "Domain.SeedWork.DomainEvent": {
        "System.DateTime Domain.SeedWork.DomainEvent::get_OccuredOn()": {
          "Lines": {
            "13": 0
          },
          "Branches": []
        },
        "System.Void Domain.SeedWork.DomainEvent::.ctor()": {
          "Lines": {
            "8": 0,
            "9": 0,
            "10": 0,
            "11": 0
          },
          "Branches": []
        }
      }
    },
    "/home/urbanowiczdev/RiderProjects/EParishes.Core/src/Domain/SeedWork/Entity.cs": {
      "Domain.SeedWork.Entity": {
        "System.Guid Domain.SeedWork.Entity::get_Id()": {
          "Lines": {
            "15": 29
          },
          "Branches": []
        },
        "System.DateTime Domain.SeedWork.Entity::get_CreatedAt()": {
          "Lines": {
            "17": 0
          },
          "Branches": []
        },
        "System.DateTime Domain.SeedWork.Entity::get_UpdatedAt()": {
          "Lines": {
            "18": 0
          },
          "Branches": []
        },
        "System.Collections.Generic.IReadOnlyCollection`1<Domain.SeedWork.IDomainEvent> Domain.SeedWork.Entity::get_DomainEvents()": {
          "Lines": {
            "20": 0
          },
          "Branches": [
            {
              "Line": 20,
              "Offset": 7,
              "EndOffset": 9,
              "Path": 0,
              "Ordinal": 0,
              "Hits": 0
            },
            {
              "Line": 20,
              "Offset": 7,
              "EndOffset": 13,
              "Path": 1,
              "Ordinal": 1,
              "Hits": 0
            }
          ]
        },
        "System.Void Domain.SeedWork.Entity::AddDomainEvent(Domain.SeedWork.IDomainEvent)": {
          "Lines": {
            "23": 0,
            "24": 0,
            "25": 0,
            "26": 0
          },
          "Branches": [
            {
              "Line": 24,
              "Offset": 7,
              "EndOffset": 9,
              "Path": 0,
              "Ordinal": 0,
              "Hits": 0
            },
            {
              "Line": 24,
              "Offset": 7,
              "EndOffset": 20,
              "Path": 1,
              "Ordinal": 1,
              "Hits": 0
            }
          ]
        },
        "System.Void Domain.SeedWork.Entity::ClearDomainEvents()": {
          "Lines": {
            "29": 0,
            "30": 0,
            "31": 0
          },
          "Branches": [
            {
              "Line": 30,
              "Offset": 8,
              "EndOffset": 10,
              "Path": 0,
              "Ordinal": 0,
              "Hits": 0
            },
            {
              "Line": 30,
              "Offset": 8,
              "EndOffset": 13,
              "Path": 1,
              "Ordinal": 1,
              "Hits": 0
            }
          ]
        },
        "System.Void Domain.SeedWork.Entity::.ctor()": {
          "Lines": {
            "10": 16,
            "11": 16,
            "12": 16,
            "13": 16
          },
          "Branches": []
        }
      }
    },
    "/home/urbanowiczdev/RiderProjects/EParishes.Core/src/Domain/Role/Role.cs": {
      "Domain.Role.Role": {
        "Domain.Role.RoleType Domain.Role.Role::get_RoleType()": {
          "Lines": {
            "17": 0
          },
          "Branches": []
        },
        "System.String Domain.Role.Role::get_RoleName()": {
          "Lines": {
            "18": 0
          },
          "Branches": []
        },
        "System.Void Domain.Role.Role::.ctor()": {
          "Lines": {
            "7": 0,
            "8": 0,
            "9": 0
          },
          "Branches": []
        },
        "System.Void Domain.Role.Role::.ctor(Domain.Role.RoleType,System.String)": {
          "Lines": {
            "11": 0,
            "12": 0,
            "13": 0,
            "14": 0,
            "15": 0
          },
          "Branches": []
        }
      }
    },
    "/home/urbanowiczdev/RiderProjects/EParishes.Core/src/Domain/Parish/Parish.cs": {
      "Domain.Parish.Parish": {
        "System.String Domain.Parish.Parish::get_Invocation()": {
          "Lines": {
            "24": 5
          },
          "Branches": []
        },
        "System.Collections.ObjectModel.Collection`1<System.Guid> Domain.Parish.Parish::get_Churches()": {
          "Lines": {
            "25": 0
          },
          "Branches": []
        },
        "Domain.Address Domain.Parish.Parish::get_Address()": {
          "Lines": {
            "26": 7
          },
          "Branches": []
        },
        "System.Void Domain.Parish.Parish::UpdateInvocation(System.String)": {
          "Lines": {
            "29": 1,
            "30": 1,
            "31": 1,
            "32": 0,
            "33": 0
          },
          "Branches": [
            {
              "Line": 30,
              "Offset": 16,
              "EndOffset": 18,
              "Path": 0,
              "Ordinal": 0,
              "Hits": 1
            },
            {
              "Line": 30,
              "Offset": 16,
              "EndOffset": 29,
              "Path": 1,
              "Ordinal": 1,
              "Hits": 0
            }
          ]
        },
        "System.Void Domain.Parish.Parish::UpdateAddress(Domain.Address)": {
          "Lines": {
            "36": 1,
            "37": 1,
            "38": 1
          },
          "Branches": []
        },
        "System.Void Domain.Parish.Parish::AddChurch(System.Guid)": {
          "Lines": {
            "41": 2,
            "42": 2,
            "43": 1,
            "44": 1,
            "45": 1
          },
          "Branches": [
            {
              "Line": 42,
              "Offset": 15,
              "EndOffset": 17,
              "Path": 0,
              "Ordinal": 0,
              "Hits": 1
            },
            {
              "Line": 42,
              "Offset": 15,
              "EndOffset": 28,
              "Path": 1,
              "Ordinal": 1,
              "Hits": 1
            }
          ]
        },
        "System.String Domain.Parish.Parish::ParishInvocationLengthErrorMessage()": {
          "Lines": {
            "48": 2,
            "49": 2,
            "50": 2
          },
          "Branches": []
        },
        "System.Void Domain.Parish.Parish::.ctor()": {
          "Lines": {
            "12": 0,
            "13": 0,
            "14": 0
          },
          "Branches": []
        },
        "System.Void Domain.Parish.Parish::.ctor(System.String,Domain.Address)": {
          "Lines": {
            "16": 5,
            "17": 5,
            "18": 5,
            "19": 1,
            "20": 4,
            "21": 4,
            "22": 4
          },
          "Branches": [
            {
              "Line": 18,
              "Offset": 34,
              "EndOffset": 36,
              "Path": 0,
              "Ordinal": 0,
              "Hits": 1
            },
            {
              "Line": 18,
              "Offset": 34,
              "EndOffset": 47,
              "Path": 1,
              "Ordinal": 1,
              "Hits": 4
            }
          ]
        },
        "System.Void Domain.Parish.Parish::.cctor()": {
          "Lines": {
            "10": 1
          },
          "Branches": []
        }
      }
    },
    "/home/urbanowiczdev/RiderProjects/EParishes.Core/src/Domain/Parish/Events/ManagedParishCreatedDomainEvent.cs": {
      "Domain.Parish.Events.ManagedParishCreatedDomainEvent": {
        "System.String Domain.Parish.Events.ManagedParishCreatedDomainEvent::get_UserId()": {
          "Lines": {
            "8": 0
          },
          "Branches": []
        },
        "System.Guid Domain.Parish.Events.ManagedParishCreatedDomainEvent::get_ParishId()": {
          "Lines": {
            "9": 0
          },
          "Branches": []
        }
      }
    },
    "/home/urbanowiczdev/RiderProjects/EParishes.Core/src/Domain/Membership/Membership.cs": {
      "Domain.Membership.Membership": {
        "System.Guid Domain.Membership.Membership::get_ParishId()": {
          "Lines": {
            "16": 0
          },
          "Branches": []
        },
        "System.String Domain.Membership.Membership::get_UserId()": {
          "Lines": {
            "17": 0
          },
          "Branches": []
        },
        "System.Guid Domain.Membership.Membership::get_RoleId()": {
          "Lines": {
            "18": 0
          },
          "Branches": []
        },
        "System.Boolean Domain.Membership.Membership::get_IsActive()": {
          "Lines": {
            "19": 0
          },
          "Branches": []
        },
        "System.Void Domain.Membership.Membership::Deactivate()": {
          "Lines": {
            "22": 0,
            "23": 0,
            "24": 0
          },
          "Branches": []
        },
        "System.Void Domain.Membership.Membership::Activate()": {
          "Lines": {
            "27": 0,
            "28": 0,
            "29": 0
          },
          "Branches": []
        },
        "System.Void Domain.Membership.Membership::.ctor(System.Guid,System.String,System.Guid,System.Boolean)": {
          "Lines": {
            "8": 0,
            "9": 0,
            "10": 0,
            "11": 0,
            "12": 0,
            "13": 0,
            "14": 0
          },
          "Branches": []
        }
      }
    },
    "/home/urbanowiczdev/RiderProjects/EParishes.Core/src/Domain/Membership/MembershipRole.cs": {
      "Domain.Membership.MembershipRole": {
        "Domain.Membership.RoleInParish Domain.Membership.MembershipRole::get_name()": {
          "Lines": {
            "16": 0
          },
          "Branches": []
        },
        "System.Void Domain.Membership.MembershipRole::.ctor()": {
          "Lines": {
            "7": 0,
            "8": 0,
            "9": 0
          },
          "Branches": []
        },
        "System.Void Domain.Membership.MembershipRole::.ctor(Domain.Membership.RoleInParish)": {
          "Lines": {
            "11": 0,
            "12": 0,
            "13": 0,
            "14": 0
          },
          "Branches": []
        }
      }
    },
    "/home/urbanowiczdev/RiderProjects/EParishes.Core/src/Domain/Exceptions/DomainAuthorizationException.cs": {
      "Domain.Exceptions.DomainAuthorizationException": {
        "System.Void Domain.Exceptions.DomainAuthorizationException::.ctor()": {
          "Lines": {
            "8": 0,
            "9": 0,
            "10": 0
          },
          "Branches": []
        },
        "System.Void Domain.Exceptions.DomainAuthorizationException::.ctor(System.Runtime.Serialization.SerializationInfo,System.Runtime.Serialization.StreamingContext)": {
          "Lines": {
            "12": 0,
            "13": 0,
            "14": 0
          },
          "Branches": []
        },
        "System.Void Domain.Exceptions.DomainAuthorizationException::.ctor(System.String)": {
          "Lines": {
            "16": 0,
            "17": 0,
            "18": 0
          },
          "Branches": []
        },
        "System.Void Domain.Exceptions.DomainAuthorizationException::.ctor(System.String,System.Exception)": {
          "Lines": {
            "20": 0,
            "21": 0,
            "22": 0
          },
          "Branches": []
        }
      }
    },
    "/home/urbanowiczdev/RiderProjects/EParishes.Core/src/Domain/Exceptions/DomainException.cs": {
      "Domain.Exceptions.DomainException": {
        "System.Void Domain.Exceptions.DomainException::.ctor()": {
          "Lines": {
            "8": 0,
            "9": 0,
            "10": 0
          },
          "Branches": []
        },
        "System.Void Domain.Exceptions.DomainException::.ctor(System.Runtime.Serialization.SerializationInfo,System.Runtime.Serialization.StreamingContext)": {
          "Lines": {
            "12": 0,
            "13": 0,
            "14": 0
          },
          "Branches": []
        },
        "System.Void Domain.Exceptions.DomainException::.ctor(System.String)": {
          "Lines": {
            "16": 4,
            "17": 4,
            "18": 4
          },
          "Branches": []
        },
        "System.Void Domain.Exceptions.DomainException::.ctor(System.String,System.Exception)": {
          "Lines": {
            "20": 0,
            "21": 0,
            "22": 0
          },
          "Branches": []
        }
      }
    },
    "/home/urbanowiczdev/RiderProjects/EParishes.Core/src/Domain/Exceptions/DomainValidationException.cs": {
      "Domain.Exceptions.DomainValidationException": {
        "System.Void Domain.Exceptions.DomainValidationException::.ctor()": {
          "Lines": {
            "8": 0,
            "9": 0,
            "10": 0
          },
          "Branches": []
        },
        "System.Void Domain.Exceptions.DomainValidationException::.ctor(System.Runtime.Serialization.SerializationInfo,System.Runtime.Serialization.StreamingContext)": {
          "Lines": {
            "12": 0,
            "13": 0,
            "14": 0
          },
          "Branches": []
        },
        "System.Void Domain.Exceptions.DomainValidationException::.ctor(System.String)": {
          "Lines": {
            "16": 4,
            "17": 4,
            "18": 4
          },
          "Branches": []
        },
        "System.Void Domain.Exceptions.DomainValidationException::.ctor(System.String,System.Exception)": {
          "Lines": {
            "20": 0,
            "21": 0,
            "22": 0
          },
          "Branches": []
        }
      }
    },
    "/home/urbanowiczdev/RiderProjects/EParishes.Core/src/Domain/ChurchAggregate/Church.cs": {
      "Domain.ChurchAggregate.Church": {
        "NetTopologySuite.Geometries.Point Domain.ChurchAggregate.Church::get_Location()": {
          "Lines": {
            "28": 1
          },
          "Branches": []
        },
        "System.String Domain.ChurchAggregate.Church::get_Invocation()": {
          "Lines": {
            "29": 1
          },
          "Branches": []
        },
        "System.Collections.ObjectModel.Collection`1<Domain.ChurchAggregate.Mass> Domain.ChurchAggregate.Church::get_Masses()": {
          "Lines": {
            "30": 9
          },
          "Branches": []
        },
        "Domain.Address Domain.ChurchAggregate.Church::get_Address()": {
          "Lines": {
            "31": 1
          },
          "Branches": []
        },
        "System.Guid Domain.ChurchAggregate.Church::get_ParishId()": {
          "Lines": {
            "32": 0
          },
          "Branches": []
        },
        "System.Void Domain.ChurchAggregate.Church::AddMass(Domain.ChurchAggregate.Mass)": {
          "Lines": {
            "35": 4,
            "36": 7,
            "38": 4,
            "39": 2,
            "40": 2
          },
          "Branches": [
            {
              "Line": 36,
              "Offset": 39,
              "EndOffset": 41,
              "Path": 0,
              "Ordinal": 0,
              "Hits": 1
            },
            {
              "Line": 36,
              "Offset": 39,
              "EndOffset": 52,
              "Path": 1,
              "Ordinal": 1,
              "Hits": 3
            },
            {
              "Line": 38,
              "Offset": 69,
              "EndOffset": 71,
              "Path": 0,
              "Ordinal": 2,
              "Hits": 1
            },
            {
              "Line": 38,
              "Offset": 69,
              "EndOffset": 77,
              "Path": 1,
              "Ordinal": 3,
              "Hits": 2
            }
          ]
        },
        "System.Void Domain.ChurchAggregate.Church::UpdateMassTime(System.Guid,NodaTime.LocalTime)": {
          "Lines": {
            "43": 0,
            "44": 0,
            "45": 0,
            "47": 0,
            "48": 0,
            "49": 0,
            "50": 0
          },
          "Branches": [
            {
              "Line": 44,
              "Offset": 39,
              "EndOffset": 41,
              "Path": 0,
              "Ordinal": 0,
              "Hits": 0
            },
            {
              "Line": 44,
              "Offset": 39,
              "EndOffset": 52,
              "Path": 1,
              "Ordinal": 1,
              "Hits": 0
            },
            {
              "Line": 49,
              "Offset": 96,
              "EndOffset": 98,
              "Path": 0,
              "Ordinal": 2,
              "Hits": 0
            },
            {
              "Line": 49,
              "Offset": 96,
              "EndOffset": 104,
              "Path": 1,
              "Ordinal": 3,
              "Hits": 0
            }
          ]
        },
        "System.Boolean Domain.ChurchAggregate.Church::IsTimeOffsetSatisfied(Domain.ChurchAggregate.Mass)": {
          "Lines": {
            "53": 3,
            "54": 10,
            "55": 1,
            "56": 1,
            "58": 2,
            "59": 3
          },
          "Branches": [
            {
              "Line": 54,
              "Offset": 64,
              "EndOffset": 16,
              "Path": 1,
              "Ordinal": 3,
              "Hits": 1
            },
            {
              "Line": 55,
              "Offset": 52,
              "EndOffset": 54,
              "Path": 0,
              "Ordinal": 0,
              "Hits": 1
            },
            {
              "Line": 55,
              "Offset": 52,
              "EndOffset": 58,
              "Path": 1,
              "Ordinal": 1,
              "Hits": 3
            },
            {
              "Line": 54,
              "Offset": 64,
              "EndOffset": 66,
              "Path": 0,
              "Ordinal": 2,
              "Hits": 2
            }
          ]
        },
        "System.Void Domain.ChurchAggregate.Church::CreateNotSatisfiedTimeOffsetResult()": {
          "Lines": {
            "62": 1,
            "63": 1
          },
          "Branches": []
        },
        "System.Void Domain.ChurchAggregate.Church::.ctor()": {
          "Lines": {
            "13": 0,
            "14": 0,
            "15": 0
          },
          "Branches": []
        },
        "System.Void Domain.ChurchAggregate.Church::.ctor(System.Guid,System.String,NetTopologySuite.Geometries.Point,System.Guid,Domain.Address)": {
          "Lines": {
            "17": 5,
            "18": 5,
            "19": 0,
            "20": 6,
            "21": 0,
            "22": 4,
            "23": 4,
            "24": 4,
            "25": 4,
            "26": 4
          },
          "Branches": [
            {
              "Line": 19,
              "Offset": 21,
              "EndOffset": 23,
              "Path": 0,
              "Ordinal": 0,
              "Hits": 0
            },
            {
              "Line": 19,
              "Offset": 21,
              "EndOffset": 34,
              "Path": 1,
              "Ordinal": 1,
              "Hits": 5
            },
            {
              "Line": 20,
              "Offset": 45,
              "EndOffset": 47,
              "Path": 0,
              "Ordinal": 2,
              "Hits": 1
            },
            {
              "Line": 20,
              "Offset": 45,
              "EndOffset": 58,
              "Path": 1,
              "Ordinal": 3,
              "Hits": 4
            },
            {
              "Line": 21,
              "Offset": 72,
              "EndOffset": 74,
              "Path": 0,
              "Ordinal": 4,
              "Hits": 0
            },
            {
              "Line": 21,
              "Offset": 72,
              "EndOffset": 85,
              "Path": 1,
              "Ordinal": 5,
              "Hits": 4
            }
          ]
        }
      }
    },
    "/home/urbanowiczdev/RiderProjects/EParishes.Core/src/Domain/ChurchAggregate/Intention.cs": {
      "Domain.ChurchAggregate.Intention": {
        "System.String Domain.ChurchAggregate.Intention::get_Title()": {
          "Lines": {
            "18": 0
          },
          "Branches": []
        },
        "NodaTime.LocalDate Domain.ChurchAggregate.Intention::get_Date()": {
          "Lines": {
            "19": 0
          },
          "Branches": []
        },
        "System.Void Domain.ChurchAggregate.Intention::.ctor()": {
          "Lines": {
            "8": 0,
            "9": 0,
            "10": 0
          },
          "Branches": []
        },
        "System.Void Domain.ChurchAggregate.Intention::.ctor(System.String,NodaTime.LocalDate)": {
          "Lines": {
            "12": 0,
            "13": 0,
            "14": 0,
            "15": 0,
            "16": 0
          },
          "Branches": []
        }
      }
    },
    "/home/urbanowiczdev/RiderProjects/EParishes.Core/src/Domain/ChurchAggregate/Mass.cs": {
      "Domain.ChurchAggregate.Mass": {
        "NodaTime.LocalTime Domain.ChurchAggregate.Mass::get_Time()": {
          "Lines": {
            "46": 8
          },
          "Branches": []
        },
        "System.String Domain.ChurchAggregate.Mass::get_Title()": {
          "Lines": {
            "47": 2
          },
          "Branches": []
        },
        "System.String Domain.ChurchAggregate.Mass::get_Description()": {
          "Lines": {
            "48": 2
          },
          "Branches": []
        },
        "NodaTime.LocalDate Domain.ChurchAggregate.Mass::get_StartDate()": {
          "Lines": {
            "49": 12
          },
          "Branches": []
        },
        "NodaTime.LocalDate Domain.ChurchAggregate.Mass::get_EndDate()": {
          "Lines": {
            "50": 11
          },
          "Branches": []
        },
        "System.Collections.Generic.List`1<Domain.ChurchAggregate.Intention> Domain.ChurchAggregate.Mass::get_Intentions()": {
          "Lines": {
            "51": 0
          },
          "Branches": []
        },
        "Domain.ChurchAggregate.Mass/MassType Domain.ChurchAggregate.Mass::get_Type()": {
          "Lines": {
            "56": 3,
            "57": 4,
            "59": 2,
            "60": 1,
            "62": 1,
            "63": 3
          },
          "Branches": [
            {
              "Line": 57,
              "Offset": 23,
              "EndOffset": 25,
              "Path": 0,
              "Ordinal": 0,
              "Hits": 1
            },
            {
              "Line": 57,
              "Offset": 23,
              "EndOffset": 29,
              "Path": 1,
              "Ordinal": 1,
              "Hits": 2
            },
            {
              "Line": 59,
              "Offset": 48,
              "EndOffset": 50,
              "Path": 0,
              "Ordinal": 2,
              "Hits": 1
            },
            {
              "Line": 59,
              "Offset": 48,
              "EndOffset": 74,
              "Path": 1,
              "Ordinal": 3,
              "Hits": 1
            },
            {
              "Line": 59,
              "Offset": 77,
              "EndOffset": 79,
              "Path": 0,
              "Ordinal": 4,
              "Hits": 1
            },
            {
              "Line": 59,
              "Offset": 77,
              "EndOffset": 83,
              "Path": 1,
              "Ordinal": 5,
              "Hits": 1
            }
          ]
        },
        "System.Void Domain.ChurchAggregate.Mass::UpdatePeriod(NodaTime.LocalDate,NodaTime.LocalDate)": {
          "Lines": {
            "67": 0,
            "68": 0,
            "70": 0,
            "71": 0,
            "72": 0
          },
          "Branches": [
            {
              "Line": 68,
              "Offset": 10,
              "EndOffset": 12,
              "Path": 0,
              "Ordinal": 0,
              "Hits": 0
            },
            {
              "Line": 68,
              "Offset": 10,
              "EndOffset": 23,
              "Path": 1,
              "Ordinal": 1,
              "Hits": 0
            }
          ]
        },
        "System.Void Domain.ChurchAggregate.Mass::UpdateTime(NodaTime.LocalTime)": {
          "Lines": {
            "75": 0,
            "76": 0,
            "77": 0
          },
          "Branches": []
        },
        "System.Void Domain.ChurchAggregate.Mass::AddIntention(Domain.ChurchAggregate.Intention)": {
          "Lines": {
            "80": 0,
            "81": 0,
            "82": 0,
            "84": 0,
            "85": 0,
            "87": 0,
            "88": 0
          },
          "Branches": [
            {
              "Line": 81,
              "Offset": 36,
              "EndOffset": 38,
              "Path": 0,
              "Ordinal": 0,
              "Hits": 0
            },
            {
              "Line": 81,
              "Offset": 36,
              "EndOffset": 65,
              "Path": 1,
              "Ordinal": 1,
              "Hits": 0
            },
            {
              "Line": 81,
              "Offset": 68,
              "EndOffset": 70,
              "Path": 0,
              "Ordinal": 2,
              "Hits": 0
            },
            {
              "Line": 81,
              "Offset": 68,
              "EndOffset": 81,
              "Path": 1,
              "Ordinal": 3,
              "Hits": 0
            },
            {
              "Line": 84,
              "Offset": 88,
              "EndOffset": 90,
              "Path": 0,
              "Ordinal": 4,
              "Hits": 0
            },
            {
              "Line": 84,
              "Offset": 88,
              "EndOffset": 94,
              "Path": 1,
              "Ordinal": 5,
              "Hits": 0
            },
            {
              "Line": 84,
              "Offset": 116,
              "EndOffset": 118,
              "Path": 0,
              "Ordinal": 6,
              "Hits": 0
            },
            {
              "Line": 84,
              "Offset": 116,
              "EndOffset": 129,
              "Path": 1,
              "Ordinal": 7,
              "Hits": 0
            },
            {
              "Line": 87,
              "Offset": 136,
              "EndOffset": 138,
              "Path": 0,
              "Ordinal": 8,
              "Hits": 0
            },
            {
              "Line": 87,
              "Offset": 136,
              "EndOffset": 141,
              "Path": 1,
              "Ordinal": 9,
              "Hits": 0
            }
          ]
        },
        "System.Void Domain.ChurchAggregate.Mass::.ctor()": {
          "Lines": {
            "18": 0,
            "19": 0,
            "20": 0
          },
          "Branches": []
        },
        "System.Void Domain.ChurchAggregate.Mass::.ctor(System.Guid,NodaTime.LocalTime,NodaTime.LocalDate,NodaTime.LocalDate,System.String,System.String)": {
          "Lines": {
            "22": 2,
            "23": 2,
            "24": 2,
            "25": 2,
            "26": 2,
            "27": 2,
            "28": 2,
            "29": 2,
            "30": 2,
            "31": 2
          },
          "Branches": []
        },
        "System.Void Domain.ChurchAggregate.Mass::.ctor(System.Guid,NodaTime.LocalTime,System.String,System.String)": {
          "Lines": {
            "34": 4,
            "35": 4,
            "36": 0,
            "38": 4,
            "39": 4,
            "40": 4,
            "41": 4,
            "42": 4,
            "43": 4,
            "44": 4
          },
          "Branches": [
            {
              "Line": 36,
              "Offset": 21,
              "EndOffset": 23,
              "Path": 0,
              "Ordinal": 0,
              "Hits": 0
            },
            {
              "Line": 36,
              "Offset": 21,
              "EndOffset": 34,
              "Path": 1,
              "Ordinal": 1,
              "Hits": 4
            }
          ]
        }
      }
    }
  }
}