{
  "appId": "2788570841378800",
  "clientSecret": "ca9fe34eca33f24e952e78c7cca71f47",
  "state": "fb",
  "authorizationUrl": "https://www.facebook.com/v3.3/dialog/oauth?",
  "accessTokenUrl": "https://graph.facebook.com/v3.3/oauth/access_token?",
  "userDataUrl": "https://graph.facebook.com/me?fields=id,name,email"
}