<svg width="24" height="24" viewBox="0 0 24 24" fill="none" xmlns="http://www.w3.org/2000/svg">
<g clip-path="url(#clip0_5728_4893)">
<path d="M23.9997 11.9998C23.9997 18.6268 18.6268 23.9997 11.9998 23.9997C5.37288 23.9997 0 18.6268 0 11.9998C0 5.37288 5.37288 0 11.9998 0C18.6282 0 23.9997 5.37288 23.9997 11.9998Z" fill="#8B8B8B"/>
<path d="M5.92047 12.4029L5.97223 12.3215L9.09387 7.4381C9.13949 7.36661 9.24675 7.374 9.28126 7.45166C9.80277 8.62042 10.2528 10.074 10.042 10.9789C9.95195 11.3512 9.70538 11.8555 9.42797 12.3215C9.39223 12.3893 9.35278 12.4559 9.31085 12.52C9.29112 12.5496 9.25784 12.5669 9.22208 12.5669H6.01169C5.92539 12.5669 5.87484 12.4732 5.92047 12.4029Z" fill="white"/>
<path d="M19.8345 13.3103V14.0833C19.8345 14.1277 19.8074 14.1672 19.7679 14.1844C19.5263 14.288 18.699 14.6677 18.3551 15.1461C17.4772 16.3678 16.8066 18.1148 15.3074 18.1148H9.05302C6.83634 18.1148 5.04004 16.3124 5.04004 14.0883V14.0168C5.04004 13.9576 5.08811 13.9095 5.14729 13.9095H8.63387C8.70289 13.9095 8.75344 13.9736 8.74729 14.0414C8.72262 14.2682 8.76455 14.5 8.8718 14.7109C9.07892 15.1313 9.50796 15.3939 9.97151 15.3939H11.6975V14.0463H9.99124C9.90371 14.0463 9.85195 13.9452 9.90249 13.8737C9.92097 13.8454 9.94195 13.8158 9.96412 13.7825C10.1256 13.5532 10.3562 13.1969 10.5855 12.7913C10.7421 12.5176 10.8937 12.2254 11.0158 11.932C11.0404 11.879 11.0601 11.8247 11.0799 11.7717C11.1132 11.678 11.1477 11.5905 11.1723 11.5029C11.197 11.4289 11.2167 11.3513 11.2364 11.2785C11.2944 11.0295 11.319 10.7657 11.319 10.492C11.319 10.3847 11.3141 10.2725 11.3043 10.1653C11.2993 10.0481 11.2845 9.931 11.2697 9.81389C11.2599 9.71033 11.2414 9.60799 11.2217 9.50074C11.197 9.34417 11.1625 9.18884 11.123 9.03224L11.1095 8.97308C11.0799 8.8658 11.0552 8.76349 11.0207 8.65624C10.9233 8.31964 10.8111 7.99171 10.6928 7.68473C10.6496 7.56267 10.6003 7.44555 10.551 7.32843C10.4782 7.15213 10.4043 6.99186 10.3365 6.84021C10.3019 6.77116 10.2723 6.70828 10.2428 6.64418C10.2095 6.57144 10.175 6.49869 10.1404 6.42967C10.1158 6.37665 10.0874 6.32734 10.0677 6.27802L9.85687 5.88843C9.82728 5.83541 9.8766 5.77254 9.93453 5.78857L11.2537 6.14609H11.2574C11.2599 6.14609 11.2611 6.14734 11.2623 6.14734L11.4362 6.19541L11.6273 6.24967L11.6975 6.26938V5.48528C11.6975 5.10678 12.0008 4.7998 12.3756 4.7998C12.563 4.7998 12.7332 4.87624 12.8552 5.00075C12.9773 5.12529 13.0537 5.29542 13.0537 5.48528V6.64912L13.1943 6.68855C13.2053 6.69227 13.2164 6.69719 13.2263 6.70459C13.2608 6.73048 13.3101 6.76869 13.373 6.81556C13.4223 6.85499 13.4753 6.90309 13.5394 6.95241C13.6664 7.05472 13.8181 7.18664 13.9845 7.3383C14.0289 7.3765 14.072 7.41596 14.1115 7.45542C14.326 7.65514 14.5664 7.88938 14.7958 8.14829C14.8599 8.22103 14.9227 8.295 14.9868 8.37266C15.0509 8.45157 15.1188 8.52923 15.1779 8.60692C15.2556 8.71048 15.3394 8.81773 15.4122 8.92993C15.4467 8.98295 15.4862 9.03719 15.5194 9.0902C15.6131 9.23197 15.6957 9.3787 15.7747 9.52541C15.8079 9.59321 15.8425 9.66718 15.872 9.73992C15.9596 9.93595 16.0286 10.1357 16.073 10.3354C16.0866 10.3786 16.0964 10.4254 16.1014 10.4673V10.4772C16.1161 10.5363 16.1211 10.5992 16.126 10.6633C16.1457 10.868 16.1359 11.0726 16.0915 11.2785C16.073 11.3661 16.0483 11.4487 16.0188 11.5362C15.9892 11.6201 15.9596 11.7076 15.9214 11.7902C15.8474 11.9615 15.7598 12.1329 15.6563 12.2932C15.623 12.3524 15.5835 12.4153 15.5441 12.4744C15.5009 12.5373 15.4566 12.5965 15.4171 12.6544C15.3629 12.7284 15.3049 12.8061 15.2458 12.8751C15.1927 12.9479 15.1385 13.0206 15.0793 13.0847C14.9967 13.1821 14.9178 13.2746 14.8352 13.3633C14.7859 13.4213 14.7329 13.4805 14.6786 13.5335C14.6256 13.5926 14.5714 13.6456 14.522 13.695C14.4395 13.7776 14.3704 13.8417 14.3125 13.8947L14.1769 14.0192C14.1571 14.0365 14.1312 14.0463 14.1041 14.0463H13.0537V15.3939H14.3753C14.6712 15.3939 14.9523 15.2891 15.1792 15.0967C15.2568 15.0289 15.5959 14.7355 15.9966 14.2929C16.0101 14.2781 16.0274 14.267 16.0471 14.2621L19.6976 13.2068C19.7655 13.187 19.8345 13.2388 19.8345 13.3103Z" fill="white"/>
</g>
<defs>
<clipPath id="clip0_5728_4893">
<rect width="24" height="24" fill="white"/>
</clipPath>
</defs>
</svg>
