<svg viewBox="0 0 24 24" focusable="false" xmlns="http://www.w3.org/2000/svg">
    <rect width="24" height="24" rx="12" fill="url(#paint0_linear_11644_11800)"></rect>
    <path
        d="M5.02327 16.8822L11.2813 13.6214C11.437 13.5403 11.626 13.5592 11.7625 13.6696L15.8641 16.9846C16.1885 17.2468 16.0015 17.7711 15.5845 17.7689L5.22482 17.7146C4.76451 17.7122 4.61504 17.0949 5.02327 16.8822Z"
        fill="white" stroke="#FF337D" stroke-width="0.42043"></path>
    <path
        d="M10.6266 11.8741L6.77049 13.8088C6.37962 14.005 5.97229 13.5741 6.19004 13.1948L11.3963 4.12802C11.6439 3.69672 12.3048 3.9411 12.2123 4.42977L10.8623 11.5618C10.8367 11.697 10.7496 11.8124 10.6266 11.8741Z"
        fill="white" stroke="#48F0D1" stroke-width="0.42043"></path>
    <path
        d="M12.732 11.7006L13.5305 7.42364C13.6056 7.02133 14.1405 6.92923 14.3458 7.28325L19.6004 16.3423C19.8446 16.7634 19.3272 17.2116 18.9453 16.9099L12.8922 12.1278C12.7636 12.0262 12.7019 11.8617 12.732 11.7006Z"
        fill="white" stroke="#1A9FFF" stroke-width="0.42043"></path>
    <defs>
        <linearGradient id="paint0_linear_11644_11800" x1="3.07432" y1="3.74026" x2="20.6149" y2="20.0445"
            gradientUnits="userSpaceOnUse">
            <stop stop-color="#36424A"></stop>
            <stop offset="1" stop-color="#1B2228"></stop>
        </linearGradient>
    </defs>
</svg>