<svg width="512" height="512" fill="none" xmlns="http://www.w3.org/2000/svg">
    <circle cx="256" cy="256" r="256" fill="#09ffff" />
    <path
        d="M423.603 272.24c-.933 17.733-7.373 32.573-19.32 44.52-11.947 11.947-29.587 20.907-52.92 26.88-23.147 5.973-52.453 8.96-87.92 8.96-27.067 0-51.333-1.493-72.8-4.48-21.467-2.8-39.76-7.653-54.88-14.56-15.12-7.093-26.693-16.707-34.72-28.84-8.027-12.133-12.04-27.44-12.04-45.92s4.013-33.88 12.04-46.2c8.027-12.507 19.6-22.4 34.72-29.68 15.12-7.467 33.413-12.787 54.88-15.96 21.467-3.173 45.733-4.76 72.8-4.76 35.467 0 64.867 3.267 88.2 9.8 23.333 6.347 40.973 15.773 52.92 28.28 11.947 12.507 18.387 27.72 19.32 45.64h-72.8c-2.24-5.973-6.347-11.2-12.32-15.68-5.973-4.667-14.933-8.307-26.88-10.92-11.947-2.613-28.093-3.92-48.44-3.92-23.893 0-43.307 1.493-58.24 4.48-14.933 2.8-25.853 7.373-32.76 13.72-6.907 6.347-10.36 14.747-10.36 25.2 0 9.52 3.453 17.267 10.36 23.24 6.907 5.973 17.827 10.36 32.76 13.16 14.933 2.8 34.347 4.2 58.24 4.2 20.347 0 36.4-1.213 48.16-3.64 11.947-2.427 20.907-5.693 26.88-9.8 5.973-4.293 10.08-8.867 12.32-13.72h72.8z"
        fill="#000" />
</svg>