<svg width="24" height="24" viewBox="0 0 24 24" fill="none" xmlns="http://www.w3.org/2000/svg">
<rect width="24" height="24" rx="12" fill="#171A45"/>
<path fill-rule="evenodd" clip-rule="evenodd" d="M22 12L16.4805 6V10.3941L11 14.7937L16.4805 14.7977V18L22 12Z" fill="#4E529A"/>
<path fill-rule="evenodd" clip-rule="evenodd" d="M2 12L7.51955 18V13.6413L13 9.20631L7.51955 9.20224V6L2 12Z" fill="#8C8DFC"/>
</svg>
