{
	"INFO_MESSAGES": [],
	"CHAIN_SPECIFIC_DATA": [

		{
			"chainId": 11155111,
			"WNFTStorageContracts": [
				{ "contractAddress": "0x69e8B95d034fdd102dE3006F3EbE3B619945242B", "assetType": "1155" },
				{ "contractAddress": "0x50BddB7911CE4248822a60968A32CDF1D683e7AD", "assetType": "721" },
				{ "contractAddress": "0x19d8593Aa3B5c2883d9bCDa1DcEaC1b4672a26f1", "assetType": "1155" },
				{ "contractAddress": "0x79142ecCB626e07C76b831f032BF5BEe5d8213e9", "assetType": "721" }
			],
			"subscriptionAgent": "0x207555776aecbf40873Dd0d0284aed392d9BD245",
			"externalLinks": [
				{ "name": "Opensea", "urlTemplate": "https://testnets.opensea.io/assets/sepolia/${contractAddress}/${tokenId}" },
				{ "name": "Etherscan", "urlTemplate": "https://etherscan.io/nft/${contractAddress}/${tokenId}" }
			],
			"ownerSocials": [
				{ "name": "Chat blockscan", "urlTemplate": "https://chat.blockscan.com/index?a=${userAddress}" },
				{ "name": "Ethermail", "urlTemplate": "https://ethermail.io/webmail/compose" },
				{ "name": "Mirror", "urlTemplate": "https://mirror.xyz/${userAddress}" },
				{ "name": "Debank", "urlTemplate": "https://debank.com/profile/${userAddress}" },
				{ "name": "Zapper", "urlTemplate": "https://zapper.xyz/account/${userAddress}" },
				{ "name": "De.fi", "urlTemplate": "https://de.fi/account/${userAddress}" },
				{ "name": "Gitcoin", "urlTemplate": "https://explorer.gitcoin.co/#/contributors/${userAddress}" }
			],
			"INFO_MESSAGES": [],
			"supportedERC20Tokens": [
				"0x5dB9f4C9239345308614604e69258C0bba9b437f",
				"0x0a3D9D939B2cb3607ac794a5d4C65968Ee352bd8",
				"0xE3cfED0fbCDB7AaE09816718f0f52F10140Fc61F",
				"0xFa8Dea648abBb942D427F95cb9A588DA3a6c798b",
				"0x7b79995e5f793a07bc00c21412e50ecae098e7f9"
			],
			"orderManager": "0xB1B2Ce4Dc22787ED9883572178Fc19170dC184cc"
		},

		{
			"chainId": 1,
			"WNFTStorageContracts": [
				{ "contractAddress": "0x27772e884e9d238F5478c07D44C515bcae585b1d", "assetType": "721" },
				{ "contractAddress": "0x3Ad9D520A9bF85f86C829B291870d77AF5B30697", "assetType": "1155" },
				{ "contractAddress": "0x474168af6C9c75987ba5a486220389Ed6D36BF99", "assetType": "721" },
				{ "contractAddress": "0x255fFe0378c7C884a1b3dd03C560198934b9e54c", "assetType": "1155" },
				{ "contractAddress": "0x05e9B409707Ad82Ed4657fF8B7174d2340e8ef23", "assetType": "721" },
				{ "contractAddress": "0x8e2c972D0027ff87f92b4C27c1D9E3571E00b444", "assetType": "1155" }
			],
			"supportedERC20Tokens": [
				"0x6B175474E89094C44Da98b954EedeAC495271d0F",
				"0x7728cd70b3dD86210e2bd321437F448231B81733",
				"0xA0b86991c6218b36c1d19D4a2e9Eb0cE3606eB48",
				"0xdAC17F958D2ee523a2206206994597C13D831ec7"
			],
			"subscriptionAgent": "0x7C20A3E0f58304D33074759D220DE11b9DF8014f",
			"externalLinks": [
				{ "name": "Opensea", "urlTemplate": "https://opensea.io/assets/ethereum/${contractAddress}/${tokenId}" },
				{ "name": "Blur", "urlTemplate": "https://blur.io/asset/${contractAddress}/${tokenId}" },
				{ "name": "Zerion", "urlTemplate": "https://app.zerion.io/nfts/ethereum/${contractAddress}:${tokenId}" },
				{ "name": "Rarible", "urlTemplate": "https://rarible.com/token/${contractAddress}:${tokenId}" },
				{ "name": "Element", "urlTemplate": "https://element.market/assets/ethereum/${contractAddress}/${tokenId}" },
				{ "name": "Bend", "urlTemplate": "https://www.benddao.xyz/en/asset/${contractAddress}/${tokenId}" },
				{ "name": "Double", "urlTemplate": "https://double.one/assets/eth/${contractAddress}/${tokenId}/721" },
				{ "name": "Arcade", "urlTemplate": "https://app.arcade.xyz/terms/asset/${contractAddress}/${tokenId}" },
				{ "name": "Pwn", "urlTemplate": "https://app.pwn.xyz/#/asset/mainnet/${contractAddress}/${tokenId}" },
				{ "name": "Cyan", "urlTemplate": "https://usecyan.com/account" },
				{ "name": "Nama", "urlTemplate": "https://app.nama.finance/" }
			],
			"ownerSocials": [
				{ "name": "Chat blockscan", "urlTemplate": "https://chat.blockscan.com/index?a=${userAddress}" },
				{ "name": "Ethermail", "urlTemplate": "https://ethermail.io/webmail/compose" },
				{ "name": "Mirror", "urlTemplate": "https://mirror.xyz/${userAddress}" },
				{ "name": "Debank", "urlTemplate": "https://debank.com/profile/${userAddress}" },
				{ "name": "Zapper", "urlTemplate": "https://zapper.xyz/account/${userAddress}" },
				{ "name": "De.fi", "urlTemplate": "https://de.fi/account/${userAddress}" },
				{ "name": "Gitcoin", "urlTemplate": "https://explorer.gitcoin.co/#/contributors/${userAddress}" }
			],
			"orderManager": "0x45066C6188E8A29F6089ceFBA5b221AE17c20E76"
		},

		{
			"chainId": 56,
			"WNFTStorageContracts": [
				{ "contractAddress": "0x7650e19DBCb267ccDbAb3c7aA15680f4817D7732", "assetType": "721" },
				{ "contractAddress": "0x842C1F3b0882Fe99A796d567693dE61602CB6Edf", "assetType": "1155" },
				{ "contractAddress": "0x724501883ff1E06dDa51f0C4F4683fcd09346Ab0", "assetType": "721" },
				{ "contractAddress": "0xE29a21752090453296E986Db23723F023103cb1f", "assetType": "1155" },
				{ "contractAddress": "0xC8095B46819Ee26a792BD1576D85153A0E40f1df", "assetType": "721" },
				{ "contractAddress": "0x8f09277e70B7db4EEFDfc62803B573f3B77d325D", "assetType": "1155" },
				{ "contractAddress": "0xB42397AD9E82b82c2dB56bF56Ac23B0A69990605", "assetType": "721" },
				{ "contractAddress": "0x2C3512376B23bAB9bfC4850ED8E8a8Fd78CC55f2", "assetType": "1155" },
				{ "contractAddress": "0x5A609bC283ca360fC56ceAb0dfb40b2b33B77677", "assetType": "721" },
				{ "contractAddress": "0x3205e612446E7cd64e7f4989fba48Da01b50bF51", "assetType": "1155" },
				{ "contractAddress": "0x391a5753cAa32f1a636DE4CAed2d999D2dE16B7b", "assetType": "721" }
			],
			"supportedERC20Tokens": [
				"0x1AF3F329e8BE154074D8769D1FFa4eE058B1DBc3",
				"0x55d398326f99059fF775485246999027B3197955",
				"0x7728cd70b3dD86210e2bd321437F448231B81733",
				"0x8AC76a51cc950d9822D68b83fE1Ad97B32Cd580d"
			],
			"subscriptionAgent": "0x7C20A3E0f58304D33074759D220DE11b9DF8014f",
			"externalLinks": [
				{ "name": "Element", "urlTemplate": "https://element.market/assets/bsc/${contractAddress}/${tokenId}" },
				{ "name": "Double", "urlTemplate": "https://double.one/assets/bsc/${contractAddress}/${tokenId}/721" },
				{ "name": "Pwn", "urlTemplate": "https://app.pwn.xyz/#/asset/bsc/${contractAddress}/${tokenId}" },
				{ "name": "Alphaquark", "urlTemplate": "https://bsc.lending.alphaquark.io/assets/${contractAddress}/${tokenId}" },
				{ "name": "Omnihub", "urlTemplate": "https://omnihub.xyz/" }
			],
			"ownerSocials": [
				{ "name": "Chat blockscan", "urlTemplate": "https://chat.blockscan.com/index?a=${userAddress}" },
				{ "name": "Ethermail", "urlTemplate": "https://ethermail.io/webmail/compose" },
				{ "name": "Mirror", "urlTemplate": "https://mirror.xyz/${userAddress}" },
				{ "name": "Debank", "urlTemplate": "https://debank.com/profile/${userAddress}" },
				{ "name": "Zapper", "urlTemplate": "https://zapper.xyz/account/${userAddress}" },
				{ "name": "De.fi", "urlTemplate": "https://de.fi/account/${userAddress}" },
				{ "name": "Gitcoin", "urlTemplate": "https://explorer.gitcoin.co/#/contributors/${userAddress}" }
			],
			"orderManager": "0x107AbdeeFe39edEB646f333cB3E47eE0f5810A2F"
		},

		{
			"chainId": 137,
			"WNFTStorageContracts": [
				{ "contractAddress": "0xd3FDE1C83B144d07878CDa57b66B35176A785e61", "assetType": "721" },
				{ "contractAddress": "0x4A80d07a1e8C15069c397cF34c407A627dcb8487", "assetType": "1155" },
				{ "contractAddress": "0xAB8bc8B418864A1Df86985BE2D7E24EcAA4d831D", "assetType": "721" },
				{ "contractAddress": "0x6D85Ea1Eac4999F3CAc5856f4f40971637A47183", "assetType": "1155" },
				{ "contractAddress": "0x6afE0D5B403FE4F9B37d143FE8fa30bC561a6619", "assetType": "721" },
				{ "contractAddress": "0x3d8391d65252FE4B2B6AD4c85918115d7fd26667", "assetType": "1155" },
				{ "contractAddress": "0x347d5125A7B5B8c14400bFC8d8230014b9cD3033", "assetType": "721" },
				{ "contractAddress": "0x0bfEde1F408164884e3cc90A30587E55F3147BA9", "assetType": "1155" },
				{ "contractAddress": "0x7C153974B0a89afcF7C4CbA03f1950388F7b141e", "assetType": "721" },
				{ "contractAddress": "0xD3617aCE7705da19A056fE3e5B65EB066a2cD559", "assetType": "1155" },
				{ "contractAddress": "0x1Ed8192facc23B771B21934346745ecBCFbEE0e6", "assetType": "721" },
				{ "contractAddress": "0xB67DD6D1b9490570b52c6e40FdFeBC5a0453E48a", "assetType": "1155" }
			],
			"supportedERC20Tokens": [
				"0x8f3Cf7ad23Cd3CaDbD9735AFf958023239c6A063",
				"0x432cdbC749FD96AA35e1dC27765b23fDCc8F5cf1",
				"0x7ceB23fD6bC0adD59E62ac25578270cFf1b9f619",
				"0x2791Bca1f2de4661ED88A30C99A7a9449Aa84174",
				"0xc2132D05D31c914a87C6611C10748AEb04B58e8F"
			],
			"subscriptionAgent": "0x7C20A3E0f58304D33074759D220DE11b9DF8014f",
			"externalLinks": [
				{ "name": "Opensea", "urlTemplate": "https://opensea.io/assets/matic/${contractAddress}/${tokenId}" },
				{ "name": "Rarible", "urlTemplate": "https://rarible.com/token/polygon/${contractAddress}:${tokenId}" },
				{ "name": "Element", "urlTemplate": "https://element.market/assets/polygon/${contractAddress}/${tokenId}" },
				{ "name": "Double", "urlTemplate": "https://double.one/assets/polygon/${contractAddress}/${tokenId}/721" },
				{ "name": "Pwn", "urlTemplate": "https://app.pwn.xyz/#/asset/polygon/${contractAddress}/${tokenId}" },
				{ "name": "Omnihub", "urlTemplate": "https://omnihub.xyz/" },
				{ "name": "Cyan", "urlTemplate": "https://usecyan.com/account" },
				{ "name": "Nama", "urlTemplate": "https://app.nama.finance/" }
			],
			"ownerSocials": [
				{ "name": "Chat blockscan", "urlTemplate": "https://chat.blockscan.com/index?a=${userAddress}" },
				{ "name": "Ethermail", "urlTemplate": "https://ethermail.io/webmail/compose" },
				{ "name": "Mirror", "urlTemplate": "https://mirror.xyz/${userAddress}" },
				{ "name": "Debank", "urlTemplate": "https://debank.com/profile/${userAddress}" },
				{ "name": "Zapper", "urlTemplate": "https://zapper.xyz/account/${userAddress}" },
				{ "name": "De.fi", "urlTemplate": "https://de.fi/account/${userAddress}" },
				{ "name": "Gitcoin", "urlTemplate": "https://explorer.gitcoin.co/#/contributors/${userAddress}" }
			],
			"orderManager": "0xe0eB6DC4414E5B7B2ACa6CF734beD4857381C866"
		},

		{
			"chainId": 66,
			"WNFTStorageContracts": [
				{ "contractAddress": "0xb9c9CBe8a55e67C2d8a14A3472E8f2a3f09f8dC6", "assetType": "721" },
				{ "contractAddress": "0xD7C46FbBD3e6E4Af1E3ced59d74A506E33181b7D", "assetType": "1155" }
			],
			"ownerSocials": [
				{ "name": "Chat blockscan", "urlTemplate": "https://chat.blockscan.com/index?a=${userAddress}" },
				{ "name": "Ethermail", "urlTemplate": "https://ethermail.io/webmail/compose" },
				{ "name": "Mirror", "urlTemplate": "https://mirror.xyz/${userAddress}" },
				{ "name": "Debank", "urlTemplate": "https://debank.com/profile/${userAddress}" },
				{ "name": "Zapper", "urlTemplate": "https://zapper.xyz/account/${userAddress}" },
				{ "name": "De.fi", "urlTemplate": "https://de.fi/account/${userAddress}" },
				{ "name": "Gitcoin", "urlTemplate": "https://explorer.gitcoin.co/#/contributors/${userAddress}" }
			]
		},

		{
			"chainId": 1313161554,
			"WNFTStorageContracts": [
				{ "contractAddress": "0xd142359762b3DfD45CC66B0e7C47A75Fe4c34464", "assetType": "721" },
				{ "contractAddress": "0x16902a523A598fA92C39Af0E21F943Bb8B6Cb3df", "assetType": "1155" }
			],
			"ownerSocials": [
				{ "name": "Chat blockscan", "urlTemplate": "https://chat.blockscan.com/index?a=${userAddress}" },
				{ "name": "Ethermail", "urlTemplate": "https://ethermail.io/webmail/compose" },
				{ "name": "Mirror", "urlTemplate": "https://mirror.xyz/${userAddress}" },
				{ "name": "Debank", "urlTemplate": "https://debank.com/profile/${userAddress}" },
				{ "name": "Zapper", "urlTemplate": "https://zapper.xyz/account/${userAddress}" },
				{ "name": "De.fi", "urlTemplate": "https://de.fi/account/${userAddress}" },
				{ "name": "Gitcoin", "urlTemplate": "https://explorer.gitcoin.co/#/contributors/${userAddress}" }
			]
		},

		{
			"chainId": 42161,
			"WNFTStorageContracts": [
				{ "contractAddress": "0x16902a523A598fA92C39Af0E21F943Bb8B6Cb3df", "assetType": "721" },
				{ "contractAddress": "0x016B602ae895F9FBC3ed09CDff192F94112C9cFC", "assetType": "1155" },
				{ "contractAddress": "0xF81356B101A52cf62BBe1E34353a139934dE4c17", "assetType": "721" },
				{ "contractAddress": "0xE29a21752090453296E986Db23723F023103cb1f", "assetType": "1155" },
				{ "contractAddress": "0x255fFe0378c7C884a1b3dd03C560198934b9e54c", "assetType": "721" },
				{ "contractAddress": "0x474168af6C9c75987ba5a486220389Ed6D36BF99", "assetType": "1155" },
				{ "contractAddress": "0x50B80032A0727DC9831b50d378B0be0EB325797E", "assetType": "721" },
				{ "contractAddress": "0xaDCb269E335F96A75d84032aAbc7370B2C199EDc", "assetType": "1155"}
			],
			"supportedERC20Tokens": [
				"0x120e49d7ab1EDc0bFBF509Fa8566ca5b5dCAAd40",
				"0xaf88d065e77c8cC2239327C5EDb3A432268e5831",
				"0xFd086bC7CD5C481DCC9C85ebE478A1C0b69FCbb9"
			],
			"externalLinks": [
				{ "name": "Opensea", "urlTemplate": "https://opensea.io/assets/arbitrum/${contractAddress}/${tokenId}" },
				{ "name": "Element", "urlTemplate": "https://element.market/assets/arbitrum/${contractAddress}/${tokenId}" },
				{ "name": "Pwn", "urlTemplate": "https://app.pwn.xyz/#/asset/arbitrum/${contractAddress}/${tokenId}" },
				{ "name": "Omnihub", "urlTemplate": "https://omnihub.xyz/" }
			],
			"ownerSocials": [
				{ "name": "Chat blockscan", "urlTemplate": "https://chat.blockscan.com/index?a=${userAddress}" },
				{ "name": "Ethermail", "urlTemplate": "https://ethermail.io/webmail/compose" },
				{ "name": "Mirror", "urlTemplate": "https://mirror.xyz/${userAddress}" },
				{ "name": "Debank", "urlTemplate": "https://debank.com/profile/${userAddress}" },
				{ "name": "Zapper", "urlTemplate": "https://zapper.xyz/account/${userAddress}" },
				{ "name": "De.fi", "urlTemplate": "https://de.fi/account/${userAddress}" },
				{ "name": "Gitcoin", "urlTemplate": "https://explorer.gitcoin.co/#/contributors/${userAddress}" }
			],
			"orderManager": "0xF99796325c62984092B81778E4B4526daA7DE752"
		},

		{
			"chainId": 324,
			"WNFTStorageContracts": [
				{ "contractAddress": "0xc0BFBE64aADB889ED5DFF39aff22DBc5556dDd23", "assetType": "721" },
				{ "contractAddress": "0x9167a11e5ae97bA8e869Bb77955B8674D1c39482", "assetType": "1155" }
			],
			"ownerSocials": [
				{ "name": "Chat blockscan", "urlTemplate": "https://chat.blockscan.com/index?a=${userAddress}" },
				{ "name": "Ethermail", "urlTemplate": "https://ethermail.io/webmail/compose" },
				{ "name": "Mirror", "urlTemplate": "https://mirror.xyz/${userAddress}" },
				{ "name": "Debank", "urlTemplate": "https://debank.com/profile/${userAddress}" },
				{ "name": "Zapper", "urlTemplate": "https://zapper.xyz/account/${userAddress}" },
				{ "name": "De.fi", "urlTemplate": "https://de.fi/account/${userAddress}" },
				{ "name": "Gitcoin", "urlTemplate": "https://explorer.gitcoin.co/#/contributors/${userAddress}" }
			]
		},

		{
			"chainId": 81457,
			"WNFTStorageContracts": [
				{ "contractAddress": "0x765886A9f388ca58092Bba5b6191b1e57e0950Bf", "assetType": "721" },
				{ "contractAddress": "0xbd2D353821CdEdC7C74632669Ea592aff61150d7", "assetType": "1155" },
				{ "contractAddress": "0xDa4A800f6eB5e84B1A32AcbAf8918d76bbE2Fc00", "assetType": "721" },
				{ "contractAddress": "0x6a746E5e80E4c556D2cC1364cb769f385882809D", "assetType": "1155" },
				{ "contractAddress": "0x30bcC8f7B161fD5a7B16B70da85d7eD9dd135f54", "assetType": "721" },
				{ "contractAddress": "0x868c952E43BB7DEd328EeD35fe1C458e1DAC9c95", "assetType": "1155" }
			],
			"supportedERC20Tokens": [
				"0x4300000000000000000000000000000000000003",
				"0x4300000000000000000000000000000000000004"
			],
			"pointsContract": [
				"0xd3807CE2F215DC42ca4bfA616B16C20b0B195128",
				"0x263FADaCA09467A69dF90366979D9De79a575fA8",
				"0x2333615f43f898cD4368513fa59b0fDcF945f492"
			],
			"pointsTypeNames": [
				"PHASE2_POINTS"
			],
			"externalLinks": [
				{ "name": "Opensea", "urlTemplate": "https://opensea.io/assets/blast/${contractAddress}/${tokenId}" },
				{ "name": "Element", "urlTemplate": "https://element.market/assets/blast/${contractAddress}/${tokenId}" }
			],
			"ownerSocials": [
				{ "name": "Chat blockscan", "urlTemplate": "https://chat.blockscan.com/index?a=${userAddress}" },
				{ "name": "Ethermail", "urlTemplate": "https://ethermail.io/webmail/compose" },
				{ "name": "Mirror", "urlTemplate": "https://mirror.xyz/${userAddress}" },
				{ "name": "Debank", "urlTemplate": "https://debank.com/profile/${userAddress}" },
				{ "name": "Zapper", "urlTemplate": "https://zapper.xyz/account/${userAddress}" },
				{ "name": "De.fi", "urlTemplate": "https://de.fi/account/${userAddress}" },
				{ "name": "Gitcoin", "urlTemplate": "https://explorer.gitcoin.co/#/contributors/${userAddress}" }
			],
			"orderManager": "0x76B44f32C043153E05c20F7C31CFCf8eEEE9f7a1"
		},

		{
			"chainId": 10,
			"WNFTStorageContracts": [
				{ "contractAddress": "0x765886A9f388ca58092Bba5b6191b1e57e0950Bf", "assetType": "721" },
				{ "contractAddress": "0xbd2D353821CdEdC7C74632669Ea592aff61150d7", "assetType": "1155" }
			],
			"supportedERC20Tokens": [
			],
			"externalLinks": [
				{ "name": "Opensea", "urlTemplate": "https://opensea.io/assets/optimism/${contractAddress}/${tokenId}" },
				{ "name": "Element", "urlTemplate": "https://element.market/assets/optimism/${contractAddress}/${tokenId}" },
				{ "name": "Pwn", "urlTemplate": "https://app.pwn.xyz/#/collection/Optimism/${contractAddress}/assets" },
				{ "name": "Zerion", "urlTemplate": "https://app.zerion.io/nfts/optimism/${contractAddress}:${tokenId}" }
			],
			"ownerSocials": [
				{ "name": "Chat blockscan", "urlTemplate": "https://chat.blockscan.com/index?a=${userAddress}" },
				{ "name": "Ethermail", "urlTemplate": "https://ethermail.io/webmail/compose" },
				{ "name": "Mirror", "urlTemplate": "https://mirror.xyz/${userAddress}" },
				{ "name": "Debank", "urlTemplate": "https://debank.com/profile/${userAddress}" },
				{ "name": "Zapper", "urlTemplate": "https://zapper.xyz/account/${userAddress}" },
				{ "name": "De.fi", "urlTemplate": "https://de.fi/account/${userAddress}" },
				{ "name": "Gitcoin", "urlTemplate": "https://explorer.gitcoin.co/#/contributors/${userAddress}" }
			],
			"orderManager": "0x17105c8faee79e7fD81e8719a0190B86E2527546"
		},

		{
			"chainId": 534352,
			"wrapperContract": "",
			"WNFTStorageContracts": [
			],
			"supportedERC20Tokens": [
			],
			"ownerSocials": [
				{ "name": "Chat blockscan", "urlTemplate": "https://chat.blockscan.com/index?a=${userAddress}" },
				{ "name": "Ethermail", "urlTemplate": "https://ethermail.io/webmail/compose" },
				{ "name": "Mirror", "urlTemplate": "https://mirror.xyz/${userAddress}" },
				{ "name": "Debank", "urlTemplate": "https://debank.com/profile/${userAddress}" },
				{ "name": "Zapper", "urlTemplate": "https://zapper.xyz/account/${userAddress}" },
				{ "name": "De.fi", "urlTemplate": "https://de.fi/account/${userAddress}" },
				{ "name": "Gitcoin", "urlTemplate": "https://explorer.gitcoin.co/#/contributors/${userAddress}" }
			]
		}

	],

	"navigationLinks": [
		{
			"name": "Wrapper",
			"description" : "",
			"url": "",
			"active": true,
			"local": false,
			"newTab": false,
			"children": [
				{
					"name": "Dashboard",
					"description": "View all of your NFTs",
					"url": "/dashboard",
					"active": false,
					"local": false,
					"newTab": false,
					"children": []
				},
				{
					"name": "Wrap wNFT",
					"description" : "Create new wNFT",
					"url": "/wrap",
					"active": false,
					"local": false,
					"newTab": false,
					"children": []
				}
			]
		},
		{
			"name": "Mint",
			"description" : "",
			"url": "/mintnew",
			"active": false,
			"local": false,
			"newTab": false,
			"children": [],
			"showInChains": [ 5, 11155111, 1, 137, 56, 42161, 168587773, 81457, 534352 ]
		},
		{
			"name": "SAFT",
			"description" : "",
			"url": "/saft",
			"active": false,
			"local": false,
			"newTab": false,
			"children": [],
			"showInChains": [ 5, 11155111, 1, 137, 56, 42161, 81457 ]
		},
		{
			"name": "Farming",
			"description" : "",
			"url": "https://appv0.envelop.is/farming/",
			"active": false,
			"local": false,
			"newTab": true,
			"children": [],
			"showInChains": [ 1, 56, 137 ],
			"auxStyle": { "color": "#999" }
		},
		{
			"name": "Showcases",
			"description" : "",
			"url": "/launchpad_admin",
			"active": false,
			"local": false,
			"newTab": false,
			"children": [],
			"showInChains": [ 11155111, 137, 81457, 42161, 56 ]
		}
	],
	"defaultChain": 1
}
