<svg xmlns="http://www.w3.org/2000/svg" width="18" height="39" viewBox="0 0 18 39" fill="none">
<path d="M11.2572 1.94346C10.5705 1.25264 9.84272 0.603459 9.07775 0C8.31808 0.610085 7.59586 1.2656 6.91513 1.96248C7.68323 2.53917 8.41127 3.16714 9.09427 3.84135C9.77151 3.16111 10.4941 2.5268 11.2572 1.94346Z" fill="url(#paint0_linear)"/>
<path d="M7.36592 5.80355C6.68876 5.1261 5.96017 4.50088 5.1866 3.93437C4.59542 4.68705 4.04759 5.47595 3.54693 6.29726C4.33192 6.87571 5.06175 7.52579 5.72699 8.23795C6.21847 7.38739 6.76651 6.57417 7.36592 5.80355Z" fill="url(#paint1_linear)"/>
<path d="M7.47383 10.4799C7.94676 9.54415 8.49532 8.65376 9.1114 7.81697C9.73477 8.64845 10.291 9.534 10.772 10.4654C10.0975 11.5322 9.54612 12.6859 9.13784 13.906C8.71904 12.6899 8.15764 11.5411 7.47383 10.4799Z" fill="url(#paint2_linear)"/>
<path d="M4.6499 10.3685C4.00285 9.58867 3.27094 8.88292 2.46849 8.26573C2.03058 9.16101 1.64584 10.0875 1.31841 11.041C2.1827 11.8082 2.92276 12.7145 3.50424 13.7251C3.79503 12.5656 4.1798 11.4438 4.6499 10.3685Z" fill="url(#paint3_linear)"/>
<path d="M3.55047 24.419C2.97762 25.4349 2.24536 26.3475 1.38801 27.122C1.72368 28.0723 2.11646 28.9953 2.56218 29.8868C3.35909 29.2627 4.08491 28.5506 4.72531 27.765C4.24579 26.6938 3.85128 25.5755 3.55047 24.419Z" fill="url(#paint4_linear)"/>
<path d="M6.45151 25.0471C5.80688 23.1447 5.45707 21.1043 5.45707 18.9816C5.45707 16.9164 5.78814 14.9293 6.39964 13.0713C7.29344 14.8921 7.79582 16.9432 7.79582 19.1126C7.79582 21.2398 7.31285 23.2531 6.45151 25.0471Z" fill="url(#paint5_linear)"/>
<path d="M5.82084 29.886C5.16167 30.604 4.43745 31.2604 3.65763 31.8457C4.16531 32.6624 4.71991 33.4465 5.31761 34.1941C6.08616 33.6208 6.80934 32.9893 7.48073 32.3058C6.87463 31.5404 6.3196 30.732 5.82084 29.886Z" fill="url(#paint6_linear)"/>
<path d="M9.20878 30.2772C8.58541 29.4457 8.02917 28.5602 7.54821 27.6288C8.22263 26.5619 8.77405 25.4083 9.18233 24.1882C9.60113 25.4043 10.1625 26.5531 10.8463 27.6142C10.3734 28.55 9.82485 29.4404 9.20878 30.2772Z" fill="url(#paint7_linear)"/>
<path d="M9.2259 34.2528C8.54866 34.9331 7.82604 35.5674 7.06302 36.1507C7.74964 36.8415 8.47746 37.4907 9.24242 38.0942C10.0021 37.4841 10.7243 36.8286 11.405 36.1317C10.6369 35.555 9.9089 34.927 9.2259 34.2528Z" fill="url(#paint8_linear)"/>
<path d="M13.1336 34.1598C12.36 33.5933 11.6314 32.9681 10.9543 32.2906C11.5537 31.52 12.1017 30.7068 12.5932 29.8562C13.2584 30.5684 13.9883 31.2185 14.7732 31.7969C14.2726 32.6182 13.7248 33.4071 13.1336 34.1598Z" fill="url(#paint9_linear)"/>
<path d="M14.6625 6.2485C14.1549 5.43174 13.6003 4.64766 13.0026 3.90012C12.234 4.47333 11.5108 5.1049 10.8394 5.78833C11.4455 6.55376 12.0006 7.36214 12.4993 8.20823C13.1585 7.49016 13.8827 6.83374 14.6625 6.2485Z" fill="url(#paint10_linear)"/>
<path d="M13.5949 10.3291C14.2353 9.54353 14.9611 8.83145 15.758 8.20737C16.2037 9.09884 16.5965 10.0219 16.9322 10.9722C16.0748 11.7467 15.3425 12.6593 14.7697 13.6752C14.4689 12.5187 14.0744 11.4004 13.5949 10.3291Z" fill="url(#paint11_linear)"/>
<path d="M11.8687 13.0471C11.0073 14.8411 10.5244 16.8544 10.5244 18.9816C10.5244 21.151 11.0267 23.2021 11.9205 25.0229C12.532 23.1649 12.8631 21.1777 12.8631 19.1126C12.8631 16.9899 12.5133 14.9495 11.8687 13.0471Z" fill="url(#paint12_linear)"/>
<path d="M13.6703 27.7257C14.3173 28.5055 15.0492 29.2113 15.8517 29.8284C16.2896 28.9332 16.6743 28.0067 17.0018 27.0532C16.1375 26.286 15.3974 25.3797 14.8159 24.3691C14.5251 25.5286 14.1404 26.6504 13.6703 27.7257Z" fill="url(#paint13_linear)"/>
<path d="M17.6131 13.2508C18.075 15.1279 18.3202 17.0914 18.3202 19.1126C18.3202 21.0601 18.0926 22.9539 17.6628 24.7685C16.2945 23.2357 15.4617 21.2067 15.4617 18.9816C15.4617 16.7835 16.2744 14.7769 17.6131 13.2508Z" fill="url(#paint14_linear)"/>
<path d="M0.707075 24.8434C2.04582 23.3173 2.85847 21.3107 2.85847 19.1126C2.85847 16.8875 2.02567 14.8585 0.657346 13.3257C0.22757 15.1403 0 17.0341 0 18.9816C0 21.0028 0.245144 22.9663 0.707075 24.8434Z" fill="url(#paint15_linear)"/>

<defs>
<linearGradient id="paint0_linear" x1="-9.16009" y1="19.0471" x2="20.5978" y2="33.3582" gradientUnits="userSpaceOnUse">
<stop stop-color="#F26522"/>
<stop offset="1" stop-color="#F96DB1"/>
</linearGradient>
<linearGradient id="paint1_linear" x1="-9.16009" y1="19.0471" x2="20.5978" y2="33.3582" gradientUnits="userSpaceOnUse">
<stop stop-color="#F26522"/>
<stop offset="1" stop-color="#F96DB1"/>
</linearGradient>
<linearGradient id="paint2_linear" x1="-9.16009" y1="19.0471" x2="20.5978" y2="33.3582" gradientUnits="userSpaceOnUse">
<stop stop-color="#F26522"/>
<stop offset="1" stop-color="#F96DB1"/>
</linearGradient>
<linearGradient id="paint3_linear" x1="-9.16009" y1="19.0471" x2="20.5978" y2="33.3582" gradientUnits="userSpaceOnUse">
<stop stop-color="#F26522"/>
<stop offset="1" stop-color="#F96DB1"/>
</linearGradient>
<linearGradient id="paint4_linear" x1="-9.16009" y1="19.0471" x2="20.5978" y2="33.3582" gradientUnits="userSpaceOnUse">
<stop stop-color="#F26522"/>
<stop offset="1" stop-color="#F96DB1"/>
</linearGradient>
<linearGradient id="paint5_linear" x1="-9.16009" y1="19.0471" x2="20.5978" y2="33.3582" gradientUnits="userSpaceOnUse">
<stop stop-color="#F26522"/>
<stop offset="1" stop-color="#F96DB1"/>
</linearGradient>
<linearGradient id="paint6_linear" x1="-9.16009" y1="19.0471" x2="20.5978" y2="33.3582" gradientUnits="userSpaceOnUse">
<stop stop-color="#F26522"/>
<stop offset="1" stop-color="#F96DB1"/>
</linearGradient>
<linearGradient id="paint7_linear" x1="-9.16009" y1="19.0471" x2="20.5978" y2="33.3582" gradientUnits="userSpaceOnUse">
<stop stop-color="#F26522"/>
<stop offset="1" stop-color="#F96DB1"/>
</linearGradient>
<linearGradient id="paint8_linear" x1="-9.16009" y1="19.0471" x2="20.5978" y2="33.3582" gradientUnits="userSpaceOnUse">
<stop stop-color="#F26522"/>
<stop offset="1" stop-color="#F96DB1"/>
</linearGradient>
<linearGradient id="paint9_linear" x1="-9.16009" y1="19.0471" x2="20.5978" y2="33.3582" gradientUnits="userSpaceOnUse">
<stop stop-color="#F26522"/>
<stop offset="1" stop-color="#F96DB1"/>
</linearGradient>
<linearGradient id="paint10_linear" x1="-9.16009" y1="19.0471" x2="20.5978" y2="33.3582" gradientUnits="userSpaceOnUse">
<stop stop-color="#F26522"/>
<stop offset="1" stop-color="#F96DB1"/>
</linearGradient>
<linearGradient id="paint11_linear" x1="-9.16009" y1="19.0471" x2="20.5978" y2="33.3582" gradientUnits="userSpaceOnUse">
<stop stop-color="#F26522"/>
<stop offset="1" stop-color="#F96DB1"/>
</linearGradient>
<linearGradient id="paint12_linear" x1="-9.16009" y1="19.0471" x2="20.5978" y2="33.3582" gradientUnits="userSpaceOnUse">
<stop stop-color="#F26522"/>
<stop offset="1" stop-color="#F96DB1"/>
</linearGradient>
<linearGradient id="paint13_linear" x1="-9.16009" y1="19.0471" x2="20.5978" y2="33.3582" gradientUnits="userSpaceOnUse">
<stop stop-color="#F26522"/>
<stop offset="1" stop-color="#F96DB1"/>
</linearGradient>
<linearGradient id="paint14_linear" x1="-9.16009" y1="19.0471" x2="20.5978" y2="33.3582" gradientUnits="userSpaceOnUse">
<stop stop-color="#F26522"/>
<stop offset="1" stop-color="#F96DB1"/>
</linearGradient>
<linearGradient id="paint15_linear" x1="-9.16009" y1="19.0471" x2="20.5978" y2="33.3582" gradientUnits="userSpaceOnUse">
<stop stop-color="#F26522"/>
<stop offset="1" stop-color="#F96DB1"/>
</linearGradient>
</defs>
</svg>