<svg width="283" height="711" viewBox="0 0 283 711" fill="none" xmlns="http://www.w3.org/2000/svg">
<mask id="mask0_3673_7903" style="mask-type:alpha" maskUnits="userSpaceOnUse" x="0" y="0" width="283" height="711">
<rect width="283" height="711" fill="#D9D9D9"/>
</mask>
<g mask="url(#mask0_3673_7903)">
<g opacity="0.4">
<mask id="mask1_3673_7903" style="mask-type:alpha" maskUnits="userSpaceOnUse" x="-80" y="-23" width="479" height="760">
<rect x="-80" y="-23" width="479" height="760" fill="#C4C4C4"/>
</mask>
<g mask="url(#mask1_3673_7903)">
<g opacity="0.3">
<path d="M214.897 697.347C212.004 696.566 209.033 695.65 206.198 694.655C164.391 680.047 128.1 644.521 106.639 597.023C88.8743 557.991 80.7105 511.896 81.467 456.143C81.7085 441.156 82.5517 425.642 83.2795 410.556C86.0885 357.425 89.0661 302.386 66.018 254.804C59.7366 241.85 51.5598 229.533 43.6962 217.76C31.5876 199.557 19.0586 180.781 13.3327 159.358C6.64216 134.688 10.0142 107.217 22.6293 82.1239C34.9066 57.8588 54.4492 38.1962 77.6683 26.6491C121.008 5.24692 177.586 8.09778 228.9 34.3477C234.876 37.3382 240.843 40.7861 246.517 44.0402C265.676 54.8378 285.527 66.052 307.095 67.0434C326.404 67.8854 345.054 60.5062 362.974 53.275C371.488 49.8261 380.38 46.2496 389.256 43.5879C417.614 35.1504 448.96 35.6769 479.85 45.1576C509.776 54.3783 537.061 71.2745 558.887 93.937C600.292 136.933 623.734 200.132 623.201 267.436C623.005 287.376 620.786 307.574 618.769 327.023C616.702 346.229 614.57 366.106 614.325 385.803C614.056 418.823 620.019 464.554 650.347 494.91C653.97 498.529 658 501.915 661.923 505.271C670.512 512.643 679.5 520.238 684.858 530.645C693.291 546.708 691.846 568.724 681.085 586.504C672.569 600.638 658.84 612.792 638.996 623.755C613.634 637.712 584.625 646.433 555.186 649.064C525.641 651.666 495.452 648.12 467.978 638.756C461.879 636.651 455.838 634.333 450.011 632.072C439.4 627.946 428.467 623.733 417.209 621.156C397.293 616.588 379.22 618.838 366.471 627.349C357.509 633.319 350.913 642.456 344.51 651.3C341.556 655.444 338.466 659.666 335.112 663.587C307.749 696.078 259.361 709.339 214.897 697.347ZM188.256 20.9722C149.47 10.5109 110.534 12.9928 78.7358 28.6605C30.1012 52.6561 2.29629 109.846 15.5784 158.7C21.2837 179.772 33.7056 198.52 45.6576 216.451C53.5995 228.36 61.7763 240.676 68.136 253.767C91.3902 301.863 88.462 357.146 85.5665 410.598C84.7604 425.548 83.9173 441.062 83.6757 456.049C82.8986 511.452 91.0418 557.196 108.65 595.956C129.934 642.832 165.747 678 206.939 692.328C209.774 693.322 212.638 694.21 215.531 694.99C259.245 706.78 306.632 693.824 333.393 661.86C336.611 658.017 339.701 653.795 342.655 649.651C349.223 640.621 355.848 631.378 365.218 625.172C378.539 616.241 397.099 613.893 417.658 618.634C429.023 621.24 440.063 625.482 450.674 629.608C456.501 631.869 462.542 634.188 468.641 636.292C523.832 654.97 587.155 649.414 637.986 621.53C657.422 610.801 670.986 598.832 679.28 585.098C689.547 567.874 691.082 546.802 682.934 531.39C677.674 521.469 668.901 513.932 660.498 506.725C656.574 503.368 652.573 499.876 648.843 496.227C617.959 465.377 611.819 419.024 612.202 385.576C612.34 365.85 614.609 345.894 616.704 326.581C618.829 307.161 621.019 287.07 621.186 267.237C621.653 200.605 598.525 137.95 557.461 95.391C512.833 48.9981 445.58 29.0203 390.08 45.6487C381.34 48.2321 372.555 51.8375 364.071 55.1793C345.907 62.4599 327.093 70.0244 307.218 69.1451C285.086 68.1162 265.021 56.8443 245.677 45.8817C239.895 42.5987 234.006 39.2869 228.031 36.2964C214.959 29.7832 201.649 24.5845 188.256 20.9722Z" fill="url(#paint0_linear_3673_7903)"/>
<path d="M214.017 681.828C210.91 680.99 207.725 680.015 204.675 678.963C163.891 664.401 128.527 629.699 107.684 583.747C90.3605 545.638 82.4728 500.652 83.5262 446.357C83.8379 431.964 84.5863 417.228 85.3266 402.95C88.1109 351.191 91.0063 297.738 69.586 250.941C63.861 238.481 56.5908 226.639 49.5555 215.204C38.6749 197.562 27.2957 179.211 22.1467 158.633C9.90721 110.176 37.774 54.0363 85.4279 30.6954C127.622 10.1333 182.75 12.8228 232.815 38.1614C238.576 41.0941 244.494 44.2989 250.197 47.4458C268.906 57.7776 288.308 68.5259 309.291 69.1297C328.201 69.749 346.55 62.6334 364.277 55.6946C373.14 52.2252 382.354 48.7355 391.551 46.1605C419.522 38.3079 450.324 39.1474 480.378 48.7471C509.603 58.0086 536.245 74.7315 557.457 97.1135C597.742 139.577 620.528 201.795 619.883 267.805C619.617 287.152 617.464 306.679 615.484 325.563C613.352 345.44 611.125 366.097 611.057 386.416C611.076 418.364 617.221 462.995 646.782 494.063C649.848 497.188 652.943 500.206 656.038 503.224C665.06 511.977 673.66 520.157 678.631 531.149C685.828 547.108 683.172 567.649 671.912 584.72C663.033 598.066 649.671 609.285 629.698 619.869C581.789 645.439 524.619 651.621 471.476 637.287C468.476 636.478 465.398 635.533 462.427 634.616C454.692 632.185 446.994 629.19 439.482 626.359C429.777 622.708 419.78 618.862 409.923 616.203C395.458 612.302 375.188 609.478 359.951 618.696C351.191 623.917 344.903 632.333 338.81 640.456C336.107 644.093 333.239 647.916 330.108 651.437C315.79 667.913 295.888 679.091 272.734 683.991C253.478 687.645 233.089 686.972 214.017 681.828ZM193.856 25.3554C155.821 15.0964 117.614 17.4303 86.4171 32.5709C39.579 55.4424 12.2437 110.461 24.2853 157.946C29.4136 178.173 40.1376 195.544 51.4097 213.866C58.5521 225.329 65.7935 237.279 71.5968 249.875C93.2521 297.08 90.3773 350.883 87.5353 402.857C86.795 417.135 85.9394 431.841 85.7349 446.264C84.6609 500.208 92.5279 544.843 109.666 582.787C130.303 628.225 165.218 662.461 205.466 676.878C249.914 692.774 300.499 681.599 328.282 649.681C331.277 646.237 334.116 642.522 336.819 638.885C343.078 630.576 349.53 621.975 358.591 616.491C374.508 606.881 395.45 609.772 410.236 613.76C420.307 616.476 430.304 620.322 440.009 623.974C447.521 626.804 455.219 629.8 462.847 632.202C518.005 649.722 578.282 644.378 628.474 617.586C648.175 607.158 661.372 596.125 669.921 583.149C680.794 566.663 683.355 546.901 676.55 531.622C671.814 521.038 663.428 512.916 654.456 504.406C651.361 501.388 648.159 498.341 645.093 495.216C614.975 463.653 608.761 418.429 608.72 386.13C608.71 365.675 610.937 345.019 613.205 325.063C615.293 306.208 617.417 286.788 617.654 267.548C618.29 201.996 595.788 140.429 555.875 98.2954C511.996 52.1048 447.781 32.3716 392.083 48.0274C382.993 50.6313 373.886 54.15 365.052 57.5123C347.082 64.5003 328.597 71.6942 309.229 71.0664C287.682 70.4252 268.066 59.6191 249.171 49.1224C243.575 46.0044 237.657 42.7996 231.896 39.8669C219.439 33.6343 206.606 28.7943 193.856 25.3554Z" fill="url(#paint1_linear_3673_7903)"/>
<path d="M213.781 666.482C210.245 665.528 206.631 664.438 203.182 663.163C163.313 648.618 128.983 614.77 108.787 570.256C91.9334 532.963 84.4003 489.221 85.6722 436.25C86.0252 422.557 86.679 408.6 87.4605 395.023C90.2202 344.636 92.984 292.527 73.1625 246.62C67.9939 234.655 61.6303 223.287 55.3656 212.405C45.1938 194.264 35.5412 177.183 30.8621 157.422C25.4121 134.121 29.0439 108.673 41.004 85.5861C52.7128 63.0062 71.18 44.777 93.0889 34.2553C133.894 14.5826 187.65 17.2466 236.66 41.3815C242.236 44.1492 247.754 47.1313 253.165 50.0844C271.61 60.1152 290.67 70.4266 311.31 70.5934C329.743 70.854 347.762 64.109 365.266 57.5699C374.587 54.109 384.179 50.4917 393.698 48.0033C449.351 33.3695 512.965 53.6298 555.908 99.4532C595.257 141.55 617.281 202.758 616.418 267.445C616.16 286.334 614.015 305.404 612.043 323.83C609.767 344.243 607.503 365.464 607.641 386.299C608.07 429.962 620.555 467.685 643.07 492.487C645.023 494.623 647.084 496.787 649.037 498.922C658.598 509.085 667.603 518.752 672.121 531.002C677.924 546.585 674.127 566.243 662.348 582.255C653.135 594.707 640.032 604.961 619.874 615.381C594.772 628.373 566.9 636.712 539.399 639.406C510.117 642.309 482.129 639.126 456.213 629.952C450.435 627.935 444.472 625.752 438.616 623.598C426.476 619.174 414.043 614.557 401.866 610.698C380.483 603.896 363.938 603.456 352.689 609.384C344.238 613.884 338.482 621.179 332.368 628.951C329.887 632.189 327.271 635.505 324.362 638.627C298.767 667.113 255.245 677.665 213.781 666.482ZM199.564 29.7672C162.064 19.6528 124.508 21.7027 94.1276 36.3739C49.1149 58.0142 22.2985 111.105 33.0213 157.085C37.5726 176.467 47.1181 193.519 57.2405 211.417C63.4763 222.406 69.8399 233.774 75.0869 245.875C95.1432 292.19 92.293 344.621 89.4755 395.222C88.694 408.799 88.0402 422.756 87.6873 436.449C86.4235 488.963 93.9073 532.461 110.74 569.403C130.623 613.373 164.61 646.785 203.944 661.186C247.692 677.122 295.557 667.511 323.229 637.287C326.002 634.243 328.618 630.927 331.07 627.797C337.019 620.209 343.162 612.33 351.993 607.702C363.786 601.461 380.924 601.832 402.814 608.885C414.991 612.744 427.531 617.391 439.564 621.785C445.313 623.91 451.276 626.093 457.053 628.111C507.493 646.082 566.476 640.849 618.963 613.641C638.849 603.378 651.651 593.388 660.699 581.121C672.091 565.694 675.687 546.786 670.168 531.854C665.856 520.12 656.93 510.588 647.554 500.591C645.6 498.455 643.54 496.291 641.586 494.155C618.808 469.053 606.009 430.785 605.589 386.664C605.372 365.694 607.744 344.502 609.942 323.953C611.914 305.526 614.03 286.564 614.259 267.781C615.22 203.581 593.403 142.888 554.396 101.228C512.145 55.8216 449.253 35.8707 394.358 50.2495C384.946 52.7667 375.382 56.2769 366.169 59.7667C348.529 66.3841 330.266 73.1783 311.484 72.9382C290.307 72.6269 270.926 62.2288 252.374 52.1691C246.963 49.216 241.445 46.2339 235.948 43.6022C223.997 37.6212 211.778 33.0617 199.564 29.7672Z" fill="url(#paint2_linear_3673_7903)"/>
<path d="M213.116 651.021C209.259 649.98 205.459 648.726 201.689 647.364C162.841 632.864 129.303 599.919 109.861 556.872C93.605 520.775 86.3481 478.142 87.8674 426.386C88.2534 413.851 88.9691 400.945 89.5695 388.468C92.284 339.103 95.1384 287.937 76.7594 242.649C72.2254 231.315 66.7107 220.636 61.4598 210.257C52.3594 192.405 43.8854 175.642 39.8122 156.619C35.0751 134.084 38.7977 109.58 50.3623 87.5358C61.7332 65.784 79.7555 48.354 100.956 38.3306C140.48 19.5761 192.756 22.1859 240.79 45.2529C246.073 47.8269 251.512 50.6729 256.63 53.4322C274.627 62.9972 293.344 72.8715 313.585 72.8157C331.432 72.6886 349.229 66.3432 366.296 60.1459C375.967 56.6646 386.017 53.0557 395.965 50.683C450.95 37.2479 513.27 57.6189 554.721 102.58C593.057 144.173 614.425 204.4 613.208 267.843C612.851 286.246 610.85 304.78 608.887 322.749C606.573 343.727 604.165 365.483 604.587 386.969C605.313 429.104 617.807 466.37 639.719 491.698L640.325 492.436C651.902 505.785 661.788 517.299 665.894 531.505C670.383 546.849 665.56 565.196 653.067 580.441C641.098 595.022 624.023 604.665 610.47 611.465C561.885 635.704 509.231 642.185 463.803 629.932C459.303 628.718 454.968 627.319 450.661 625.813C441.863 622.635 432.637 619.342 423.839 616.165C414.183 612.756 404.128 609.125 394.716 605.667C372.521 597.613 356.672 595.866 346.198 600.624C337.978 604.267 332.502 610.948 326.725 617.893C324.36 620.702 322.074 623.647 319.416 626.262C294.348 652.363 252.758 661.713 213.116 651.021ZM205.301 34.0722C168.444 24.1311 131.51 26.0041 101.867 40.07C57.9993 60.8702 32.1552 110.776 41.7859 156.117C45.7026 174.868 54.3125 191.553 63.2275 209.24C68.4784 219.619 73.9931 230.298 78.6054 241.768C97.0834 287.543 94.3073 338.844 91.5351 388.424C90.8276 400.872 90.1119 413.778 89.7258 426.313C88.2931 477.747 95.3933 520.108 111.6 555.962C130.836 598.494 163.896 631.08 202.208 645.436C244.397 661.181 290.895 652.811 317.883 624.7C320.433 622.056 322.798 619.246 325.056 616.408C330.697 609.542 336.531 602.383 345.267 598.534C356.227 593.677 372.562 595.326 395.293 603.525C404.705 606.983 414.789 610.507 424.415 614.023C433.32 617.229 442.44 620.493 451.238 623.67C498.97 641.026 556.689 635.796 609.51 609.483C622.898 602.868 639.73 593.275 651.398 578.957C663.396 564.268 668.018 546.671 663.842 531.871C659.864 518.044 650.056 506.666 638.636 493.589L638.03 492.851C615.853 467.222 603.125 429.548 602.436 386.848C602.014 365.363 604.451 343.499 606.793 322.415C608.757 304.445 610.758 285.911 611.164 267.751C612.237 204.844 591.182 145.162 553.218 103.898C512.187 59.5098 450.753 39.2628 396.632 52.4717C386.792 54.8733 376.849 58.5111 367.207 61.8853C349.897 68.132 331.964 74.5555 313.796 74.5959C292.961 74.7215 274.058 64.6823 255.848 55.0595C250.729 52.3002 245.29 49.4542 240.007 46.8802C228.583 41.5011 216.979 37.2221 205.301 34.0722Z" fill="url(#paint3_linear_3673_7903)"/>
<path d="M212.636 635.724C208.458 634.597 204.23 633.227 200.167 631.671C162.234 617.189 129.73 585.097 110.935 543.488C95.0913 508.421 88.2466 466.819 89.9556 416.493C90.3252 404.873 90.9958 392.989 91.6868 381.456C94.3562 333.112 97.2148 283.212 80.3852 238.572C76.4282 228.082 72.0551 218.285 67.7315 208.731C59.7313 191.062 52.1721 174.315 48.6552 155.787C40.1453 110.978 66.0514 62.1229 108.773 42.1627C147.016 24.3265 197.948 26.8037 244.762 48.8524C249.86 51.2614 255.007 53.9136 260.047 56.5369C277.701 65.6649 296.076 75.1023 315.839 74.6877C333.179 74.3089 350.54 68.3054 367.277 62.4788C377.435 58.8988 387.942 55.2984 398.347 52.9341C452.422 40.7472 513.176 61.3852 553.242 105.514C590.564 146.603 611.17 205.82 609.812 268.076C609.464 286.022 607.471 304.098 605.516 321.61C603.136 343.26 600.691 365.58 601.241 387.445C602.342 428.187 614.658 464.831 636.076 490.716C648.036 505.202 656.613 517.742 659.589 531.873C662.686 546.841 656.75 564.199 643.845 578.413C631.793 591.593 615.513 600.416 601.124 607.336C552.526 630.767 501.059 637.108 457.852 625.569C453.459 624.384 449.231 623.014 445.032 621.537C437.919 618.929 430.564 616.37 423.422 613.869C411.331 609.689 398.841 605.286 387.352 600.579C371.614 594.151 351.953 587.354 339.629 591.728C331.639 594.514 326.472 600.474 321.005 606.698C318.862 609.107 316.691 611.624 314.363 613.869C300.939 627.024 282.858 635.705 262.267 638.769C246.101 641.188 229.136 640.174 212.636 635.724ZM211.115 38.5132C174.901 28.7455 138.59 30.4417 109.684 43.9021C67.7493 63.5 42.3458 111.341 50.7073 155.421C54.1747 173.706 61.6556 190.317 69.5486 207.957C73.8723 217.511 78.3237 227.445 82.2807 237.934C99.2381 282.953 96.4289 333.097 93.7019 381.654C93.0396 393.081 92.3692 404.965 91.9995 416.585C90.3482 466.696 97.1723 507.948 112.859 542.743C131.448 583.836 163.581 615.599 201.007 629.83C242.175 645.53 286.196 638.674 313.044 612.364C315.372 610.119 317.407 607.681 319.55 605.271C324.881 599.126 330.514 592.717 338.911 589.696C351.858 585.145 371.041 591.583 388.114 598.601C399.603 603.309 412.122 607.604 424.184 611.892C431.326 614.393 438.789 616.98 445.794 619.559C490.955 636.221 547.273 631.073 600.349 605.518C614.602 598.677 630.746 589.932 642.497 577.015C655.043 563.279 660.835 546.457 657.781 532.189C654.932 518.437 646.512 506.17 634.737 491.848C613.055 465.663 600.611 428.64 599.519 387.44C598.89 365.439 601.364 343.011 603.744 321.362C605.671 303.957 607.663 285.881 608.09 268.071C609.41 206.38 589.011 147.678 551.953 106.889C512.228 63.1979 452.195 42.8693 398.878 54.8011C388.61 57.0871 378.209 60.7164 368.052 64.2964C351.071 70.1724 333.575 76.2541 316.021 76.5751C295.665 77.0594 277.104 67.4571 259.264 58.1642C254.331 55.5698 249.184 52.9176 244.087 50.5086C233.141 45.4882 222.151 41.4897 211.115 38.5132Z" fill="url(#paint4_linear_3673_7903)"/>
<path d="M212.185 620.321C207.685 619.107 203.136 617.65 198.673 615.872C161.762 601.435 130.186 570.167 112.009 530.105C96.6064 495.961 90.1161 455.603 92.0725 406.493C92.504 395.924 93.1004 385.169 93.7175 374.765C96.4487 327.472 99.1839 278.457 83.9326 234.358C80.7587 225.229 77.4118 216.743 74.2503 208.421C67.1731 190.311 60.5081 173.232 57.5557 154.74C54.1663 133.603 58.1775 111.016 69.0583 91.0848C79.8608 71.0181 96.8077 55.0216 116.619 45.8875C154.203 28.7928 202.313 31.0832 248.764 52.3446C253.676 54.5887 258.638 57.076 263.385 59.5055C280.697 68.1965 298.594 77.2751 318.122 76.4524C334.848 75.7932 351.772 70.1315 368.073 64.6467C378.795 61.1041 389.895 57.4339 400.729 55.1852C454 44.2753 513.325 65.1022 551.899 108.369C588.207 148.955 608.158 207.191 606.582 268.124C606.134 285.583 604.15 303.202 602.31 320.286C599.815 342.364 597.304 365.356 598.06 387.736C599.457 426.95 611.782 463.136 632.491 489.519C644.991 505.415 651.586 518.914 653.206 532.105C655.017 546.726 648.133 562.909 634.408 576.328C622.439 587.922 606.789 596.11 591.535 603.256C562.25 616.844 507.187 636.118 452.223 621.293C447.937 620.137 443.602 618.738 439.324 617.125C432.319 614.546 424.963 611.987 417.9 609.622C405.059 605.24 391.79 600.742 379.909 595.354C362.288 587.384 344.094 579.834 332.845 582.775C325.193 584.732 320.335 589.972 315.177 595.474C313.257 597.484 311.308 599.601 309.202 601.446C285.209 623.126 248.292 630.059 212.185 620.321ZM216.131 42.5086C180.667 32.9432 145.863 34.5865 117.287 47.6763C77.3136 65.9648 52.4292 111.878 59.3358 154.531C62.3459 172.808 68.9037 189.859 75.9026 207.833C79.1712 216.183 82.5182 224.669 85.6921 233.798C101.1 278.17 98.3072 327.399 95.5183 374.906C94.9012 385.31 94.3049 396.065 93.8733 406.634C92.0035 455.423 98.4442 495.537 113.69 529.409C131.632 569.064 162.73 599.972 199.242 614.187C238.773 629.56 281.291 624.022 307.64 599.991C309.639 598.117 311.559 596.107 313.479 594.097C318.637 588.594 323.825 582.985 332.07 580.957C343.913 577.947 362.428 585.583 380.371 593.64C392.251 599.028 405.413 603.497 418.254 607.88C425.424 610.273 432.78 612.832 439.786 615.411C498.179 637.135 559.357 616.064 590.595 601.624C605.684 594.663 621.198 586.553 633.003 575.144C646.398 562.096 652.973 546.635 651.261 532.5C649.661 519.659 643.223 506.432 630.987 490.837C609.907 464.124 597.561 427.588 596.037 387.995C595.202 365.479 597.713 342.486 600.237 320.302C602.184 303.247 604.033 285.706 604.558 268.382C606.126 207.907 586.275 150.158 550.338 109.901C512.27 66.886 453.667 46.3685 401.017 57.1015C390.32 59.2719 379.219 62.9421 368.604 66.5136C352.06 72.0478 335.03 77.6806 318.061 78.3892C298.075 79.2034 279.964 70.0669 262.466 61.211C257.719 58.7815 252.757 56.2942 247.952 54.079C237.407 49.2813 226.738 45.3696 216.131 42.5086Z" fill="url(#paint5_linear_3673_7903)"/>
<path d="M212.027 605.111C207.099 603.781 202.15 602.102 197.258 600.208C161.262 585.788 130.691 555.481 113.298 516.779C98.4142 483.694 92.2289 444.338 94.375 396.658C94.8108 387.354 95.3043 377.835 95.9256 368.696C98.6981 322.104 101.417 274.004 87.7728 230.338C85.7859 224.057 83.8485 218.019 81.9606 212.224C75.1181 191.535 69.2482 173.636 66.6131 153.966C60.9714 111.31 85.3864 67.5677 124.622 49.8845C160.846 33.5721 207.691 35.8659 253.058 56.0306C257.785 58.1098 262.454 60.4033 267.016 62.6678C283.986 70.9219 301.541 79.5636 320.562 78.4893C336.567 77.5206 353.025 72.3078 368.889 67.1648C380.204 63.5524 391.898 59.8125 403.296 57.6012C455.686 47.8323 513.552 68.9551 550.77 111.281C586.065 151.365 605.224 208.698 603.536 268.336C603.097 285.338 601.121 302.5 599.289 319.127C596.757 341.769 594.131 365.19 595.2 388.114C596.894 425.799 609.012 461.47 629.363 488.331C640.878 503.616 646.785 517.963 647.31 532.238C648.066 551.63 633.987 566.792 625.458 574.143C613.183 584.736 597.492 592.223 582.353 598.941C527.871 623.313 475.085 628.149 433.753 612.634C426.747 610.055 419.391 607.497 412.221 605.103C398.816 600.683 384.904 596.012 372.631 589.944L370.39 588.88C352.942 580.267 336.4 572.128 326.255 573.529C318.862 574.522 314.314 579.04 309.464 583.822C307.766 585.432 306.04 587.15 304.235 588.731C280.411 608.503 246.206 614.329 212.027 605.111ZM222.053 46.9784C187.124 37.5575 152.943 39.024 125.105 51.5083C86.5486 68.8004 62.6857 111.772 68.2078 153.592C70.7646 173.125 76.6633 190.918 83.3987 211.578C85.2866 217.373 87.3311 223.44 89.318 229.721C103.119 273.659 100.342 321.973 97.6481 368.701C97.1339 377.869 96.5333 387.359 96.1263 396.556C93.9307 443.993 100.095 482.999 114.929 515.84C132.117 554.027 162.395 584.14 197.884 598.309C236.18 613.579 276.278 609.342 302.78 587.305C304.556 585.831 306.283 584.113 307.98 582.503C312.83 577.721 317.816 572.861 325.801 571.798C336.433 570.299 353.296 578.524 371.036 587.331L373.278 588.395C385.472 594.327 399.277 598.969 412.653 603.496C419.824 605.89 427.316 608.37 434.292 611.056C475.196 626.455 527.418 621.582 581.385 597.416C596.28 590.748 611.943 583.367 623.945 572.931C632.174 565.843 645.787 551.131 645.15 532.575C644.646 518.65 638.868 504.682 627.616 489.698C607.138 462.458 594.862 426.515 593.07 388.344C592.029 365.312 594.684 341.784 597.245 319.035C599.077 302.409 601.053 285.247 601.571 268.381C603.279 209.092 584.19 152.353 549.267 112.599C512.497 70.7389 455.245 49.8966 403.478 59.4886C392.216 61.6217 380.522 65.3616 369.314 69.0029C353.342 74.117 336.856 79.4369 320.529 80.3189C301.051 81.3847 283.252 72.7923 265.99 64.3445C261.428 62.0799 256.759 59.7865 252.139 57.7362C242.101 53.1901 232.017 49.666 222.053 46.9784Z" fill="url(#paint6_linear_3673_7903)"/>
<path d="M211.255 589.621C206.112 588.234 200.842 586.467 195.765 584.408C160.791 570.034 131.147 540.552 114.401 503.288C99.9582 471.127 94.1275 433.016 96.521 386.551C96.9034 378.726 97.4217 370.823 97.8825 363.134C100.618 317.107 103.543 269.522 91.3204 226.124C83.7272 199.257 77.6962 176.834 75.4067 152.891C73.472 133.181 77.879 112.538 87.8617 94.6629C98.2605 76.0959 113.695 61.8747 132.361 53.5807C167.304 38.1865 212.698 40.319 256.952 59.4942C261.387 61.3796 265.87 63.5081 270.139 65.5788C287.567 73.8413 303.981 81.6006 322.631 80.1965C337.993 79.0544 353.8 74.1257 369.091 69.4027C381 65.7205 393.423 61.8326 405.464 59.7947C456.972 51.1668 513.408 72.4786 549.213 114.079C583.358 153.737 601.89 209.982 600.063 268.434C599.525 284.949 597.635 301.79 595.811 317.959C593.135 341.137 590.471 365.122 591.776 388.454C593.766 424.611 605.815 459.688 625.642 487.212C636.436 502.188 641.518 517.462 640.791 532.548C639.935 550.242 626.853 563.834 616.021 572.058C604.315 580.965 590.177 587.378 572.793 594.754C537.208 609.975 486.508 624.566 439.686 611.937C435.722 610.868 431.923 609.613 428.045 608.222C420.961 605.507 413.441 603.134 406.27 600.741C392.222 596.147 377.746 591.438 365.189 584.719C361.884 582.909 358.657 581.234 355.566 579.481C340.747 571.348 327.927 564.328 319.607 564.497C312.553 564.662 308.342 568.352 303.694 572.384C302.219 573.595 300.715 574.913 299.104 576.202C275.671 593.666 243.291 598.261 211.255 589.621ZM228.003 51.3413C193.611 42.0649 159.973 43.2184 132.844 55.2045C95.8123 71.5289 72.8351 111.637 76.9437 152.731C79.262 176.567 84.988 197.989 92.8367 225.614C105.109 269.255 102.262 316.976 99.469 363.217C99.0083 370.906 98.4899 378.809 98.1075 386.635C95.6934 432.748 101.582 470.646 115.868 502.535C132.408 539.284 161.759 568.572 196.333 582.723C232.564 597.551 271.402 594.583 297.591 574.99C299.174 573.808 300.678 572.49 302.046 571.25C306.693 567.218 311.37 563.079 319.096 562.98C327.873 562.82 340.908 569.897 356.02 578.225C359.11 579.978 362.337 581.652 365.642 583.463C378.013 590.017 392.461 594.833 406.538 599.319C413.815 601.742 421.336 604.115 428.42 606.83C477.772 625.427 533.684 609.829 571.902 593.365C589.695 585.754 603.182 579.625 614.752 570.796C625.312 562.729 638.036 549.615 638.825 532.592C639.545 517.964 634.59 503.069 623.953 488.365C603.969 460.569 591.792 425.112 589.782 388.606C588.428 365.03 591.198 341.074 593.796 317.76C595.62 301.591 597.481 284.858 598.019 268.342C599.838 210.348 581.54 154.511 547.631 115.261C512.139 74.2045 456.346 53.0662 405.431 61.6243C393.527 63.584 381.239 67.3937 369.33 71.0758C353.903 75.877 338.096 80.8058 322.491 81.9972C303.383 83.3928 285.927 75.2374 269.114 67.2555C264.844 65.1847 260.332 63.1633 255.927 61.1708C246.659 57.1773 237.325 53.8555 228.003 51.3413Z" fill="url(#paint7_linear_3673_7903)"/>
<path d="M213.932 575.405C207.397 573.643 200.869 571.422 194.271 568.609C160.183 554.359 131.496 525.594 115.475 489.905C101.445 458.774 95.9189 421.664 98.6092 376.658C98.93 370.77 99.2796 364.775 99.7076 358.915C102.55 312.917 105.553 265.468 94.8103 222.125C88.8409 197.764 85.6782 177.493 84.1138 152.137C81.6619 111.72 104.643 72.8766 140.014 57.598C173.675 43.1221 217.726 45.122 260.761 63.2788C264.98 65.1064 269.2 66.9339 273.284 68.8397C290.369 76.6653 306.548 84.0165 324.72 82.2536C339.225 80.8804 354.352 76.3427 368.993 71.9038C381.738 68.1025 394.862 64.1738 407.545 62.3093C432.562 58.6007 458.935 61.8074 483.792 71.4994C508.542 81.1624 530.705 97.0218 547.705 117.119C580.836 156.274 598.714 211.538 596.639 268.774C596.08 284.939 594.198 301.322 592.354 317.141C589.67 340.776 586.862 365.297 588.373 389.145C590.659 423.773 602.501 458.335 621.942 486.444C632.171 501.383 636.458 517.476 634.321 533.101C632.024 550.176 617.965 562.7 606.498 570.293C595.138 577.915 581.989 583.216 566.722 589.554L563.117 590.995C507.151 614.047 459.755 618.499 422.115 604.21C415.031 601.495 407.403 599.093 400.097 596.778C385.484 592.147 370.258 587.236 357.524 579.894C338.794 569.212 321.519 559.957 312.28 555.856C307.368 553.612 303.981 556.375 300.099 559.695C298.052 561.326 295.975 563.063 293.614 564.15C276.317 580.167 246.396 584.162 213.932 575.405ZM234.033 55.8399C200.069 46.6791 167.053 47.6557 140.525 59.1147C105.806 74.1092 83.2402 112.26 85.6508 151.977C87.2441 177.226 90.2996 197.468 96.2978 221.722C107.09 265.308 104.137 313 101.265 359.105C100.944 364.994 100.488 370.96 100.167 376.849C97.5343 421.64 103.039 458.4 116.913 489.258C132.806 524.569 161.23 553.032 194.782 567.138C233.812 583.525 272.089 581.784 292.266 562.753L292.538 562.596C294.734 561.695 296.811 559.957 298.723 558.404C302.711 555.114 306.836 551.745 312.684 554.356C322.001 558.593 339.012 567.548 358.006 578.531C370.661 585.736 385.781 590.618 400.286 595.22C407.593 597.535 415.192 600.044 422.411 602.681C459.652 616.747 506.591 612.287 562.148 589.47L565.754 588.029C580.885 581.769 594.033 576.468 605.257 568.925C616.317 561.566 630.075 549.306 632.306 532.902C634.464 517.628 630.197 501.884 620.203 487.354C600.606 458.973 588.636 424.031 586.3 389.16C584.711 365.177 587.519 340.656 590.232 316.913C592.076 301.095 593.929 284.819 594.459 268.761C596.797 211.826 579.155 156.97 546.288 118.115C512.181 77.8924 457.818 56.5652 407.706 63.8464C395.13 65.7398 382.035 69.5614 369.397 73.3916C354.727 77.9377 339.493 82.4464 324.745 83.869C306.116 85.6234 289.03 77.7978 272.423 70.331C268.339 68.4252 264.119 66.5976 259.899 64.77C251.353 61.086 242.711 58.1807 234.033 55.8399Z" fill="url(#paint8_linear_3673_7903)"/>
<path d="M214.388 560.476C207.317 558.569 199.961 556.01 192.642 552.887C159.576 538.683 131.787 510.85 116.442 476.492C102.96 446.313 97.7102 410.312 100.59 366.737C100.784 363.457 101.006 360.069 101.199 356.789C104.322 310.177 107.498 262.086 98.2218 217.989C93.3074 194.832 93.1696 176.985 92.8876 159.674C92.8585 156.794 92.8005 154.02 92.7714 151.14C92.2034 118.24 108.863 77.6916 147.617 61.3722C179.889 47.7857 222.568 49.7602 264.519 66.8203C268.446 68.4541 272.452 70.2239 276.272 71.8287C293.015 79.2173 308.852 86.1315 326.653 84.0388C340.408 82.4633 354.748 78.2879 368.601 74.2111C382.076 70.2619 396.144 66.243 409.606 64.4736C460.051 58.0869 512.37 79.3223 546.041 119.887C578.158 158.539 595.273 212.793 593.058 268.842C592.4 284.521 590.605 300.583 588.769 315.944C585.94 340.115 583.017 365.065 584.87 389.349C587.346 422.419 599.118 456.388 618.142 485.189C630.799 504.345 630.323 521.911 627.724 533.275C624.771 546.381 614.359 558.166 596.983 568.071C587.057 573.782 576.026 578.046 563.207 582.976C560.009 584.182 556.783 585.495 553.449 586.779C501.649 607.163 461.02 612.52 426.948 603.33C423.306 602.348 419.72 601.151 416.164 599.847C408.973 597.103 401.345 594.701 393.903 592.464C378.648 587.66 362.856 582.711 349.731 574.69C341.452 569.584 333.816 564.652 327.086 560.194C317.909 554.157 310.594 549.311 305.496 546.902C300.23 546.401 297.189 547.879 293.905 549.406C292.195 550.209 290.349 551.09 288.132 551.641C272.512 565.697 244.816 568.683 214.388 560.476ZM240.198 60.2604C206.662 51.2151 174.162 51.986 148.264 62.8107C110.298 78.7679 93.8105 118.673 94.4155 151.009C94.4447 153.889 94.5026 156.663 94.5318 159.543C94.7066 176.825 94.9805 194.594 99.8453 217.508C109.2 261.74 105.966 310.046 102.95 356.687C102.757 359.967 102.535 363.354 102.342 366.634C99.5192 409.996 104.612 445.725 118.045 475.66C133.262 509.639 160.68 537.143 193.454 551.153C231.568 567.523 268.342 567.1 287.406 550.066L287.571 549.881L287.814 549.832C289.924 549.252 291.741 548.478 293.451 547.675C296.843 546.177 300.291 544.464 306.093 545.11L306.308 545.168C311.513 547.606 318.934 552.48 328.297 558.683C335.027 563.14 342.634 568.18 350.942 573.178C363.882 581.035 379.566 585.954 394.715 590.73C402.128 593.074 409.756 595.476 416.976 598.113C452.881 611.589 496.045 607.49 552.996 585.048C556.329 583.764 559.556 582.451 562.753 581.245C575.436 576.393 586.467 572.129 596.257 566.497C613.254 556.719 623.308 545.412 626.253 532.763C628.765 521.721 629.233 504.612 616.89 486C597.816 456.956 585.916 422.608 583.362 389.402C581.538 365.01 584.383 339.925 587.24 315.647C589.076 300.286 590.842 284.331 591.5 268.652C593.707 213.06 576.72 159.185 544.867 120.834C511.538 80.7065 459.833 59.7516 409.874 66.0397C396.548 67.7308 382.587 71.7786 369.113 75.7278C355.152 79.7757 340.812 83.9511 326.921 85.6048C308.663 87.6891 291.919 80.3005 275.683 73.1636C271.891 71.4516 267.857 69.7889 263.93 68.1551C256.125 65.1308 248.126 62.3988 240.198 60.2604Z" fill="url(#paint9_linear_3673_7903)"/>
<path d="M215.887 545.943C207.958 543.804 199.667 540.879 191.256 537.116C159.212 522.958 132.35 495.95 117.623 463.137C104.582 433.882 99.6872 399.125 102.815 356.765C103.662 345.504 104.947 333.9 106.116 322.726C110.282 285.472 114.551 246.982 101.926 214.047L101.848 213.911L101.877 213.804C102.065 203.284 101.372 193.905 100.74 185.577C99.7048 172.773 98.9084 161.642 101.643 150.201C95.772 117.364 119.372 80.0662 155.435 65.2041C186.426 52.5359 227.654 54.349 268.628 70.3414C272.263 71.7813 275.975 73.3573 279.61 74.7972C296.011 81.7488 311.613 88.255 329.015 85.9395C341.777 84.2111 355.329 80.3979 368.26 76.7616C382.678 72.7222 397.611 68.477 412.037 66.9678C461.601 61.722 512.49 83.1464 544.776 122.878C575.772 160.998 592.232 214.271 589.905 269.026C589.227 284.355 587.44 299.959 585.662 315.106C582.718 339.705 579.787 365.112 581.845 389.912C584.54 421.318 596.213 454.8 614.714 484.264C627.119 503.926 625.234 522.032 621.527 533.671C617.395 546.46 606.385 557.049 587.839 566.18C579.367 570.329 569.861 573.625 559.84 577.127C554.775 578.863 549.575 580.678 544.181 582.785C501.505 598.736 455.373 603.184 410.856 595.658C386.358 591.463 362.057 582.266 342.61 569.552C329.415 560.937 317.785 552.055 309.18 545.598C305.17 542.563 301.667 539.78 298.956 537.899C293.97 536.784 291.266 537.434 288.291 538.24C286.697 538.614 285.102 538.989 283.186 539.276C268.571 551.305 243.958 553.514 215.887 545.943ZM103.442 213.537C116.195 246.851 111.897 285.448 107.702 322.809C106.426 333.955 105.17 345.451 104.43 356.741C101.389 398.78 106.206 433.4 119.119 462.277C133.689 494.817 160.18 521.496 191.932 535.46C229.502 552.143 264.129 552.865 282.275 537.537L282.44 537.351L282.683 537.302C284.677 537.15 286.272 536.776 287.76 536.373C290.949 535.625 293.924 534.819 299.339 536.049L299.553 536.107C302.265 537.987 305.875 540.8 309.992 543.863C318.461 550.399 330.09 559.281 343.314 567.788C362.284 580.144 386.984 589.564 410.947 593.614C455.221 601.189 501.002 596.762 543.435 580.86C548.936 578.782 554.136 576.967 559.094 575.202C569.115 571.7 578.621 568.404 586.957 564.333C605.095 555.437 615.911 545.141 619.821 532.752C623.441 521.434 625.29 503.893 613.226 484.667C594.569 454.931 582.739 421.176 580.102 389.557C577.936 364.728 581.032 339.136 583.869 314.508C585.619 299.468 587.513 283.892 588.191 268.564C590.538 214.159 574.206 161.265 543.474 123.446C511.551 84.5016 461.169 63.3289 412.198 68.5049C398.015 69.9648 383.082 74.21 368.771 78.2783C355.704 81.9928 342.152 85.806 329.283 87.5056C311.502 89.9485 294.994 82.968 279.099 76.268C275.493 74.721 271.859 73.2811 268.117 71.8122C227.571 55.9354 186.694 54.102 156.082 66.6426C120.67 81.2206 97.4863 117.826 103.287 150.069L103.366 150.205L103.308 150.42C100.524 161.619 101.349 172.642 102.385 185.446C102.938 193.638 103.738 203.046 103.442 213.537Z" fill="url(#paint10_linear_3673_7903)"/>
<path d="M386.003 587.231C367.253 582.174 349.389 574.253 335.031 564.406C313.973 549.993 297.649 534.215 292.065 528.917C287.28 527.052 284.886 526.981 282.113 527.037C280.741 527.012 279.476 527.015 277.704 526.767C260.291 540.225 226.604 538.148 189.627 521.395C158.497 507.254 132.67 481.099 118.59 449.725C105.99 421.393 101.478 387.774 104.795 346.844C105.664 335.933 106.969 324.68 108.266 313.884C112.564 278.275 116.965 241.429 105.337 209.912L105.259 209.776L105.317 209.562C106.16 200.023 106.23 191.654 106.282 184.199C106.434 171.256 106.552 160.142 110.301 149.204C105.233 118.077 128.285 82.8153 163.038 68.9787C203.592 52.8003 248.992 65.1604 272.386 73.8832C275.835 75.1583 279.256 76.5404 282.462 77.8648C298.657 84.3012 313.888 90.4775 330.918 87.8322C342.687 85.9508 355.21 82.5492 367.139 79.2173C382.665 74.9024 398.678 70.4888 413.962 69.2108C462.537 65.0771 511.967 86.7974 542.976 125.725C572.958 163.342 588.655 215.604 586.081 269.144C585.382 284.122 583.575 299.376 581.804 314.066C578.852 339.123 575.67 365.036 578.099 390.166C581.779 428.157 597.812 461.666 610.671 483.059C623.608 504.589 618.711 524.065 614.686 533.895C609.483 546.395 597.847 555.895 577.944 564.086C570.841 566.995 563.209 569.303 554.956 571.788C548.326 573.792 541.424 575.952 534.056 578.561C491.989 593.527 447.152 597.864 404.477 591.18C398.625 590.291 392.217 588.907 386.003 587.231ZM289.097 526.278C290.169 526.567 291.426 527.021 292.897 527.533L293.004 527.562L293.082 527.698C298.452 532.938 314.776 548.716 335.942 563.158C354.845 576.184 380.16 585.885 405.309 589.796C447.77 596.422 492.257 592.105 534.081 577.188C541.448 574.579 548.35 572.42 554.98 570.416C563.127 567.902 570.894 565.516 577.862 562.685C597.356 554.729 608.72 545.385 613.701 533.284C617.639 523.776 622.393 504.835 609.769 483.85C596.832 462.321 580.613 428.647 576.913 390.305C574.512 365.069 577.616 339.019 580.597 313.855C582.367 299.166 584.175 283.912 584.845 269.04C587.332 215.822 571.763 163.938 542.044 126.623C511.271 88.1033 462.347 66.6347 414.259 70.6696C399.082 71.9766 383.069 76.3902 367.679 80.6269C355.642 83.9298 343.091 87.4386 331.215 89.2911C313.806 92.064 298.36 85.8299 281.951 79.3356C278.638 77.9824 275.217 76.6002 271.875 75.3541C248.588 66.6601 203.724 54.4445 163.578 70.3883C129.476 83.9409 106.704 118.589 111.838 149.044L111.887 149.287L111.829 149.501C108.002 160.304 107.921 170.853 107.791 184.146C107.738 191.601 107.669 199.97 106.825 209.509C118.502 241.269 114.072 278.222 109.852 313.967C108.555 324.763 107.279 335.909 106.382 346.927C103.122 387.643 107.585 421.019 120.028 449.079C133.844 480.152 159.515 506.035 190.244 519.953C226.9 536.619 260.13 538.688 276.949 525.3L277.221 525.143L277.543 525.23C279.315 525.478 280.687 525.504 282.059 525.529C284.268 525.435 286.205 525.498 289.097 526.278Z" fill="url(#paint11_linear_3673_7903)"/>
<path d="M378.495 582.678C359.531 577.563 341.724 569.428 327.589 559.181C308.352 545.26 293.235 529.692 285.446 519.778C280.571 516.969 278.457 516.284 275.836 515.348C274.872 515.087 273.829 514.691 272.679 514.266C256.35 525.833 224.81 522.612 188.376 505.546C158.269 491.451 133.34 466.227 119.936 436.185C107.748 408.883 103.649 376.294 107.185 336.687C108.102 326.019 109.506 315.252 110.853 304.7C115.365 269.148 119.68 235.612 109.157 205.542L109.079 205.406L109.136 205.191C110.355 197.247 111.129 190.102 111.809 183.736C113.27 169.768 114.41 158.7 119.473 148.001C115.102 118.556 137.792 85.4942 171.156 72.547C209.778 57.5709 253.929 69.0196 276.66 77.2188C279.816 78.3 282.837 79.4595 285.858 80.6189C301.711 86.6184 316.736 92.2795 333.474 89.4404C344.084 87.5913 355.391 84.4364 366.29 81.5161C382.897 77.0327 400.154 72.2654 416.616 71.3052C464.202 68.2837 512.203 90.1928 542.041 128.345C570.931 165.322 585.944 216.711 583.23 269.064C582.51 283.692 580.682 298.596 578.891 312.935C575.824 338.421 572.633 364.792 575.298 390.329C578.391 418.97 589.17 449.798 607.572 481.764C616.969 498.087 617.384 517.042 608.818 533.921C600.648 549.757 582.291 557.33 569.159 561.716C563.337 563.707 557.065 565.233 550.385 566.993C542.354 569.079 534.08 571.213 525.118 574.196C483.661 588.178 440.088 592.512 399.255 586.669C392.324 585.948 385.352 584.527 378.495 582.678ZM272.304 512.671L272.733 512.787C274.097 513.27 275.139 513.666 276.211 513.955C279.075 514.842 281.16 515.635 286.221 518.608L286.406 518.773C294.088 528.658 309.126 544.09 328.363 558.011C347.308 571.738 373.237 581.719 399.358 585.433C439.977 591.218 483.17 587.011 524.52 573.001C533.511 569.911 541.893 567.805 549.788 565.798C556.439 564.145 562.632 562.483 568.454 560.492C581.343 556.155 599.429 548.738 607.24 533.38C611.174 525.594 619.076 505.204 606.077 482.624C587.625 450.416 576.632 419.529 573.625 390.567C570.882 364.894 574.101 338.416 577.197 312.823C578.988 298.484 580.709 283.551 581.507 269.059C584.135 217.028 569.25 166.018 540.623 129.342C511.156 91.5192 463.555 69.8327 416.427 72.8627C400.071 73.8518 382.95 78.541 366.344 83.0243C355.416 86.0517 344.138 89.0996 333.42 90.9197C316.41 93.9153 301.171 88.1963 284.997 82.1102C281.976 80.9508 278.848 79.7624 275.799 78.7101C253.146 70.6469 209.424 59.3138 171.21 74.0552C138.389 86.6895 116.166 119.302 120.495 148.047L120.545 148.29L120.487 148.504C115.482 158.989 114.341 170.057 112.909 183.918C112.258 190.177 111.484 197.322 110.265 205.266C120.838 235.58 116.305 270.781 111.953 304.882C110.635 315.327 109.203 326.201 108.314 336.762C104.729 376.126 108.914 408.393 120.917 435.53C134.086 465.165 158.858 490.116 188.644 504.125C224.892 521.025 255.946 524.346 271.711 512.741L272.304 512.671Z" fill="url(#paint12_linear_3673_7903)"/>
<path d="M371.093 578.154C351.915 572.981 334.059 564.603 320.117 554.063C304.078 541.924 292.675 527.932 284.378 517.767C282.219 515.116 280.323 512.766 278.662 510.824C274.784 506.446 272.814 505.226 270.123 503.695C269.217 503.221 268.339 502.64 267.169 501.864C251.816 511.512 222.529 507.174 186.64 489.796C157.447 475.717 133.553 451.348 120.874 422.879C109.127 396.501 105.275 365.128 109.137 326.873C110.182 316.584 111.636 306.06 112.974 295.965C117.59 262.165 122.066 230.166 112.589 201.757L112.511 201.621L112.568 201.406C113.882 195.671 114.867 190.306 115.892 185.642C119.031 169.713 121.337 158.155 128.123 147.461C124.555 119.727 146.804 88.7295 178.722 76.8859C215.519 63.1409 258.285 73.7566 280.517 81.2469C283.245 82.2125 285.973 83.1781 288.701 84.1437C304.319 89.7351 319.109 94.9881 335.505 91.712C344.851 89.8665 354.399 87.271 364.432 84.577C382.39 79.7688 400.999 74.6765 418.775 73.956C465.265 72.0177 511.943 94.1446 540.475 131.6C568.244 168.045 582.631 218.346 579.748 269.619C579.007 283.897 577.159 298.45 575.454 312.468C572.272 338.382 568.965 365.181 571.972 391.156C575.148 418.21 585.601 447.687 603.95 481.132C617.188 505.385 607.227 526.597 602.32 534.581C593.058 549.778 574.668 556.193 559.714 560.088C554.765 561.396 549.66 562.431 544.204 563.488C535.588 565.185 525.834 567.266 515.549 570.466C474.458 583.513 432.287 587.765 393.539 582.714C385.994 581.713 378.486 580.148 371.093 578.154ZM267.28 500.171L267.679 500.393C268.957 501.198 269.942 501.808 270.927 502.418C273.589 504.056 275.802 505.227 279.729 509.848C281.39 511.79 283.286 514.14 285.553 516.819C293.742 526.956 305.067 540.812 320.999 552.922C340.092 567.379 366.499 577.719 393.7 581.264C432.233 586.257 474.269 582.083 515.116 569.086C525.43 565.778 535.262 563.834 543.907 562.029C549.363 560.972 554.497 559.83 559.417 558.629C574.128 554.783 592.139 548.496 601.178 533.698C605.92 525.9 615.631 505.194 602.784 481.621C584.357 448.041 573.825 418.428 570.707 391.159C567.622 365.049 570.957 338.142 574.168 312.121C575.873 298.103 577.722 283.55 578.462 269.272C581.23 218.427 567 168.399 539.387 132.226C511.119 95.0713 464.919 73.3032 418.916 75.1429C401.246 75.8923 382.773 80.9063 364.816 85.7145C354.782 88.4085 345.234 91.004 335.782 92.8207C319.035 96.1172 304.138 90.8352 288.199 85.1571C285.471 84.1915 282.743 83.2259 280.015 82.2603C257.997 74.8279 215.552 64.2989 179.163 77.8092C147.731 89.5541 125.977 119.996 129.581 147.165L129.631 147.408L129.466 147.594C122.738 158.074 120.432 169.631 117.293 185.56C116.375 190.253 115.312 195.482 113.998 201.218C123.495 229.977 119.127 262.005 114.375 295.883C113.037 305.978 111.476 316.473 110.538 326.791C106.763 364.725 110.537 395.962 122.127 422.068C134.649 450.264 158.386 474.362 187.258 488.354C223.069 505.596 252.005 509.954 266.793 500.269L267.28 500.171Z" fill="url(#paint13_linear_3673_7903)"/>
<path d="M363.77 573.766C344.378 568.535 326.472 559.914 312.646 548.946C293.512 533.788 281.032 515.255 273.56 504.163L272.015 501.792C267.399 495.032 265.894 493.362 262.008 489.442C247.875 497.12 220.599 491.716 185.225 474.132C157.054 460.099 133.951 436.633 122.056 409.525C110.857 384.098 107.281 353.834 111.332 317.009C112.398 307.07 113.98 296.926 115.367 287.074C120.222 254.947 124.694 224.67 116.215 197.679L116.165 197.436L116.223 197.221C117.022 194.679 117.657 192.322 118.398 189.995C124.132 170.399 127.864 157.388 137.023 146.415C134.26 120.391 155.932 91.5359 186.568 80.6106C219.644 68.7347 258.05 76.3359 284.519 84.7389C286.954 85.5107 289.283 86.2536 291.689 87.1325C307.101 92.2087 321.763 97.0826 337.76 93.5838C345.704 91.82 353.628 89.7058 362.067 87.3859C381.648 82.0964 401.823 76.7371 421.021 76.2852C466.523 75.459 511.799 97.6675 539.025 134.426C565.673 170.339 579.297 219.63 576.41 269.637C575.62 283.672 573.78 297.768 572.026 311.543C568.728 337.885 565.306 365.113 568.684 391.418C572.833 424.25 587.741 455.962 600.258 479.906C613.921 505.997 600.304 528.407 595.859 534.676C585.311 549.526 565.944 554.874 550.306 557.895C546.173 558.733 541.776 559.271 537.215 559.994C527.877 561.382 517.246 562.881 505.989 566.279C465.236 578.497 424.251 582.61 387.725 578.273C379.693 577.371 371.592 575.875 363.77 573.766ZM262.226 487.777L262.939 488.544C266.904 492.601 268.515 494.299 273.102 501.167L274.648 503.537C282.54 515.202 294.443 532.89 313.47 548.019C332.711 563.205 359.732 573.825 387.906 577.173C424.325 581.481 464.988 577.282 505.605 565.141C516.97 561.772 527.63 560.166 537.075 558.807C541.636 558.084 546.033 557.546 550.166 556.708C565.561 553.736 584.549 548.516 594.874 534.066C599.262 528.011 612.413 506.05 599.141 480.639C586.546 456.559 571.559 424.711 567.332 391.743C563.983 365.331 567.434 337.996 570.761 311.547C572.486 297.879 574.248 283.647 575.116 269.748C578.053 219.983 564.557 171.072 537.958 135.402C510.86 99.0228 466.119 76.9587 421.075 77.7934C402.013 78.1672 381.838 83.5264 362.364 88.8448C353.925 91.1647 345.894 93.2499 337.949 95.0138C321.574 98.6401 306.805 93.7373 291.178 88.6034C288.85 87.8605 286.443 86.9816 284.008 86.2098C257.754 77.8646 219.562 70.3211 186.865 82.0695C156.715 92.8962 135.401 121.273 138.309 146.762L138.359 147.005L138.223 147.083C129.092 157.949 125.389 170.853 119.655 190.449C119.05 192.698 118.308 195.026 117.645 197.49C126.173 224.724 121.566 255.079 116.818 287.235C115.323 297.058 113.849 307.231 112.782 317.17C108.789 353.781 112.208 383.773 123.436 409.093C135.311 435.85 158.121 459.123 185.999 472.962C221.374 490.546 248.328 495.863 261.926 488.041L262.226 487.777Z" fill="url(#paint14_linear_3673_7903)"/>
<path d="M356.69 569.328C337.083 564.04 319.128 555.175 305.282 543.857C284.886 526.981 272.761 506.705 265.338 492.868C263.986 490.205 262.919 488.194 261.929 486.318C260.215 482.868 258.913 480.449 256.741 476.99C240.436 484.198 208.16 470.896 183.839 458.361C156.69 444.374 134.514 421.732 123.237 396.17C112.607 372.046 109.324 341.975 113.556 307.038C114.779 297.371 116.274 287.548 117.818 277.968C122.669 247.564 127.38 218.96 119.87 193.494L119.82 193.251L119.878 193.037C128.22 170.583 134.02 156.291 145.924 145.368C143.944 120.705 164.68 94.4702 194.308 84.3068C225.529 73.7691 262.736 80.7022 288.492 88.3384C290.527 88.8875 292.427 89.5148 294.434 90.171C309.718 94.868 324.145 99.3338 339.907 95.4269C346.071 93.8724 352.264 92.2107 358.944 90.4503C380.285 84.6013 402.355 78.6042 423.375 78.6435C467.808 78.7934 511.627 101.298 537.76 137.417C563.395 172.827 576.256 221.108 573.229 269.929C572.311 283.584 570.635 297.495 568.861 310.919C565.447 337.69 561.911 365.347 565.552 391.952C569.87 422.876 583.916 453.092 596.858 478.874C607.694 500.526 600.283 522.082 589.69 534.966C577.857 549.469 557.513 553.749 541.191 555.896C537.602 556.422 533.856 556.675 529.838 557.085C519.945 557.979 508.757 558.983 496.721 562.286C455.469 573.795 416.936 577.765 382.174 574.133C373.47 573.165 364.833 571.525 356.69 569.328ZM257.173 475.384L257.515 475.821C259.98 479.473 261.332 482.135 263.124 485.721C264.006 487.568 265.074 489.579 266.426 492.242C273.77 505.943 285.817 526.083 306.027 542.794C325.388 558.817 353.13 569.747 382.198 572.761C416.854 576.363 455.143 572.443 496.259 561.012C508.431 557.631 519.726 556.656 529.62 555.762C533.609 555.459 537.276 555.07 540.944 554.68C557.022 552.582 576.987 548.43 588.627 534.22C598.919 521.599 606.186 500.578 595.663 479.471C582.672 453.446 568.518 423.201 564.258 392.063C560.567 365.214 564.133 337.451 567.546 310.68C569.321 297.255 571.104 283.373 571.885 269.796C574.963 221.218 562.15 173.18 536.672 138.043C510.774 102.332 467.355 80.05 423.379 79.9086C402.495 79.7911 380.532 85.817 359.299 91.695C352.619 93.4553 346.426 95.117 340.261 96.6716C324.15 100.599 309.479 96.1824 294.117 91.3494C292.11 90.6932 290.181 90.173 288.174 89.5168C262.633 81.9384 225.641 75.0631 194.769 85.5803C165.521 95.6162 145.114 121.48 147.239 145.608L147.259 145.958L146.987 146.115C135.141 156.823 129.477 171.037 121.192 193.276C128.645 218.956 124.012 247.696 119.054 278.072C117.539 287.544 115.937 297.339 114.821 307.034C110.646 341.758 113.88 371.585 124.461 395.466C135.688 420.785 157.572 443.234 184.535 457.056C219.472 474.982 244.523 481.394 256.823 475.404L257.173 475.384Z" fill="url(#paint15_linear_3673_7903)"/>
<path d="M349.475 564.969C329.653 559.623 311.542 550.486 297.81 538.74C276.896 520.804 265.067 498.999 258.662 483.943C256.906 479.793 255.912 476.652 254.968 473.755C253.975 470.614 253.109 467.853 251.473 464.539C239.857 468.415 217.217 461.159 182.317 442.669C155.654 428.583 135.069 407.289 124.311 382.786C114.122 359.586 111.193 330.76 115.644 297.145C116.917 287.721 118.568 278.17 120.133 268.941C125.058 240.395 129.794 213.406 123.36 189.494L123.31 189.251L123.368 189.037C133.202 167.445 141.116 153.838 154.66 144.507C153.454 121.661 173.751 97.4911 201.989 88.217C225.056 80.6504 254.858 81.7944 290.536 91.4176C291.072 91.562 291.714 91.7354 292.25 91.8799C293.75 92.2845 295.357 92.718 296.857 93.1226C312.014 97.4404 326.449 101.449 341.947 97.241C346.03 96.1593 350.279 94.8922 354.605 93.7612C378.006 87.089 402.244 80.2977 425.407 80.915C469.338 82.0783 510.712 104.268 536.096 140.185C560.638 174.956 572.845 222.255 569.648 269.997C568.71 283.302 566.985 296.97 565.296 310.073C561.768 337.272 558.116 365.357 562.128 392.292C566.577 421.873 580.269 450.845 592.461 476.424L593.137 477.755C603.899 500.536 594.535 522.944 583.2 535.169C569.916 549.511 548.732 552.644 531.783 553.703C528.524 553.858 525.157 553.984 521.683 554.081C511.369 554.402 499.79 554.726 487.189 557.991C445.332 568.762 409.144 572.56 376.388 569.585C367.141 568.93 358.153 567.31 349.475 564.969ZM252.12 462.99L252.326 463.505C254.119 467.091 255.063 469.988 256.106 473.372C257.078 476.162 258.043 479.41 259.828 483.453C266.126 498.481 277.905 520.042 298.634 537.813C318.222 554.701 346.578 565.911 376.433 568.563C408.946 571.588 445.027 567.761 486.777 556.961C499.485 553.724 511.2 553.322 521.621 553.03C525.095 552.933 528.462 552.807 531.721 552.652C548.455 551.536 569.368 548.558 582.351 534.48C593.385 522.519 602.634 500.54 592.156 478.41L591.481 477.079C579.318 451.392 565.518 422.392 561.02 392.568C556.958 365.39 560.639 337.197 564.167 309.998C565.856 296.895 567.659 283.363 568.49 270.029C571.707 222.638 559.551 175.582 535.193 140.976C510.074 105.36 469.099 83.3927 425.518 82.2089C402.462 81.6206 378.332 88.4408 355.067 95.0347C350.819 96.3018 346.599 97.4617 342.408 98.5145C326.532 102.85 312.018 98.7054 296.618 94.4369C295.118 94.0324 293.618 93.6278 292.011 93.1943C255.748 83.1835 225.625 81.9529 202.315 89.5687C174.455 98.7153 154.489 122.515 155.81 144.932L155.83 145.283L155.559 145.439C142.179 154.585 134.323 167.977 124.517 189.462C130.895 213.588 126.159 240.576 121.204 269.23C119.64 278.459 117.881 287.981 116.745 297.327C112.244 330.698 115.123 359.281 125.341 382.375C136.049 406.635 156.478 427.657 182.819 441.655C217.905 460.311 240.496 467.323 251.576 463.303L252.12 462.99Z" fill="url(#paint16_linear_3673_7903)"/>
<path d="M342.394 560.532C322.252 555.099 304.198 545.748 290.367 533.515C266.922 512.599 256.251 487.774 252.043 474.804C250.381 469.875 249.697 466.013 248.876 462.23C248.184 458.826 247.57 455.558 246.263 451.874C233.514 454.41 207.263 441.354 180.745 426.733C155.104 412.694 135.446 392.224 125.307 369.267C115.48 346.853 112.906 319.272 117.683 287.009C119.005 277.829 120.784 268.657 122.505 259.699C127.534 232.904 132.373 207.667 127.014 185.31L126.964 185.067L127.022 184.852C139.382 161.988 149.299 150.76 163.532 143.568C163.13 122.433 182.985 100.327 209.806 92.0492C231.971 85.2734 260.264 86.4701 296.437 95.5372L299.33 96.3175C314.494 100.178 328.802 103.807 344.279 99.2491L349.15 97.8051C373.91 90.3507 401.996 82.0696 427.867 83.3022C470.731 85.4416 510.675 107.821 534.859 143.069C558.623 177.745 569.791 222.926 566.495 270.181C565.508 283.243 563.791 296.453 562.053 309.313C558.438 336.834 554.563 365.318 559.025 392.719C563.161 418.769 574.532 443.552 585.541 467.549C586.992 470.698 588.365 473.711 589.737 476.724C600.561 500.555 589.602 523.337 577.031 535.458C562.268 549.746 540.164 551.597 522.56 551.675C519.573 551.674 516.478 551.643 513.305 551.477C502.707 551.146 490.707 550.897 477.706 553.94C450.811 560.359 410.375 568.411 370.758 565.309C360.946 564.616 351.502 562.988 342.394 560.532ZM247.066 450.597L247.272 451.112C248.736 455.068 249.428 458.472 250.063 462.091C250.805 465.738 251.597 469.628 253.151 474.529C257.388 487.392 267.903 511.944 291.163 532.695C311.006 550.342 339.947 561.94 370.696 564.258C410.206 567.332 450.535 559.25 477.294 552.909C490.431 549.788 502.509 550.174 513.136 550.397C516.338 550.457 519.404 550.594 522.391 550.595C539.752 550.567 561.534 548.629 575.968 534.712C588.267 522.747 598.945 500.579 588.435 477.292C587.062 474.279 585.719 471.159 584.239 468.117C573.23 444.12 561.887 419.23 557.673 393.044C553.24 365.536 557.037 336.915 560.788 309.317C562.526 296.457 564.243 283.246 565.201 270.291C568.547 223.28 557.399 178.449 533.821 143.938C509.901 108.991 470.249 86.8054 427.735 84.6455C402.108 83.3636 374.129 91.6736 349.504 99.0498L344.634 100.494C328.885 105.208 314.363 101.521 299.091 97.6319L296.198 96.8516C260.268 87.7351 232.161 86.7033 210.239 93.4298C183.797 101.58 164.242 123.422 164.76 144.129L164.78 144.48L164.508 144.636C150.412 151.75 140.552 162.764 128.25 185.413C133.581 207.878 128.82 233.251 123.762 260.153C122.041 269.111 120.369 278.311 118.94 287.463C114.249 319.404 116.745 346.85 126.522 369.02C136.583 391.842 156.085 412.039 181.404 425.992C208.03 440.642 234.387 453.726 246.551 450.802L247.066 450.597Z" fill="url(#paint17_linear_3673_7903)"/>
<path d="M335.393 556.23C315.036 550.74 296.825 541.117 283.003 528.426C257.535 504.781 248.264 476.887 245.473 465.908C243.985 460.336 243.502 455.725 243.069 451.357C242.657 447.339 242.265 443.671 241.21 439.48C229.952 439.891 206.532 426.565 179.408 411.206C154.789 397.212 136.058 377.567 126.566 356.048C117.181 334.558 114.99 308.114 119.957 277.281C121.435 268.373 123.264 259.444 125.035 250.73C130.138 225.793 135.002 202.172 130.689 181.475L130.64 181.232L130.805 181.047C144.24 159.737 156.309 148.629 172.56 142.901C173.04 123.612 192.348 103.541 217.78 96.1533C244.564 88.4402 276.122 93.7346 300.488 99.2726L301.452 99.5327C316.732 102.965 331.126 106.273 346.612 101.257C374.199 92.267 403.394 83.7104 430.298 85.7965C471.988 88.8831 510.61 111.48 533.566 146.167C556.209 180.311 566.75 224.404 563.285 270.579C562.277 283.291 560.618 296.287 558.831 308.904C554.993 336.824 551.11 365.766 555.835 393.468C559.884 416.851 569.847 439.186 579.446 460.734C581.828 465.973 584.054 470.939 586.144 475.984C596.168 499.37 585.543 523.047 570.561 536.011C554.047 550.401 529.895 550.896 513.144 549.94C510.322 549.753 507.392 549.537 504.355 549.293C493.579 548.339 481.431 547.361 468.138 550.21C434.958 557.347 399.587 563.663 364.906 561.433C354.831 560.439 344.822 558.773 335.393 556.23ZM241.984 438.31L242.083 438.796C243.188 443.231 243.629 447.142 244.12 451.296C244.553 455.664 245.065 460.168 246.446 465.711C249.158 476.554 258.35 504.312 283.662 527.685C303.732 546.197 333.287 558.075 364.902 560.168C399.446 562.476 434.818 556.16 467.89 548.994C481.32 546.067 493.682 547.103 504.458 548.056C507.495 548.301 510.425 548.517 513.14 548.675C529.677 549.573 553.585 549.128 569.692 534.973C584.401 522.164 594.746 499.102 584.957 476.124C582.867 471.079 580.642 466.112 578.259 460.874C568.582 439.19 558.619 416.854 554.599 393.364C549.796 365.526 553.815 336.506 557.545 308.557C559.196 296.018 560.962 283.051 561.971 270.339C565.485 224.407 555.022 180.45 532.536 146.579C509.736 112.163 471.407 89.7605 430.067 86.6535C403.377 84.6252 374.29 93.2107 346.838 102.123C331.11 107.187 316.58 103.958 301.115 100.361L300.15 100.101C275.891 94.5916 244.577 89.2479 217.9 96.9898C192.74 104.222 173.733 124.029 173.446 143.025L173.467 143.375L173.088 143.503C156.972 149.153 144.961 160.046 131.691 181.171C136.053 202.11 131.188 225.732 126.057 250.775C124.286 259.49 122.457 268.419 120.978 277.327C116.07 307.946 118.182 334.253 127.518 355.5C136.825 376.855 155.506 396.256 179.911 410.192C207.22 425.716 230.825 439.207 241.527 438.302L241.984 438.31Z" fill="url(#paint18_linear_3673_7903)"/>
<path d="M328.391 551.929C307.82 546.38 289.453 536.485 275.561 523.202C249.045 497.895 241.015 468.383 238.826 456.876C237.618 450.691 237.415 445.465 237.184 440.347C237.023 435.823 236.804 431.512 236 426.814C228.269 425.648 214.315 417.289 195.066 405.547C189.635 402.244 183.989 398.883 177.944 395.299C161.299 385.409 138.917 368.227 127.698 342.45C118.754 321.883 116.839 296.548 122.102 267.174C123.63 258.509 125.645 249.745 127.465 241.274C132.642 218.196 137.503 196.297 134.159 177.125L134.109 176.882L134.274 176.697C149.036 156.434 163.112 145.983 181.276 141.69C182.559 124.111 201.426 106.105 225.441 99.7132C249.592 93.2433 277.593 97.2337 304.411 102.629C318.599 105.421 333.216 108.33 348.817 102.886C372.922 94.4502 404.206 84.9634 432.524 87.7755C473.039 91.8092 510.231 114.595 532.202 148.672C553.753 182.176 563.61 225.395 560.034 270.276C559.084 282.774 557.296 295.391 555.596 307.686C551.643 336.035 547.566 365.27 552.77 393.33C556.645 414.369 565.54 434.692 574.15 454.365C577.229 461.285 580.073 467.797 582.674 474.359C592.546 498.738 580.104 523.188 564.323 535.707C550.453 546.674 531.305 550.357 503.959 547.347C501.272 547.082 498.507 546.681 495.528 546.222C484.682 544.676 472.279 542.939 458.693 545.594C427.903 551.537 392.981 558.319 359.207 556.563C348.608 556.233 338.249 554.587 328.391 551.929ZM236.824 425.888L236.845 426.238C237.805 431.208 237.995 435.625 238.099 440.364C238.359 445.375 238.561 450.6 239.662 456.757C241.88 468.156 249.861 497.426 276.084 522.538C296.459 542.052 326.657 554.104 359.058 555.834C392.725 557.561 427.619 550.886 458.301 544.914C471.994 542.288 484.398 544.025 495.38 545.493C498.252 545.923 501.017 546.324 503.811 546.618C530.835 549.541 549.848 545.936 563.416 535.233C578.896 522.978 591.116 498.927 581.45 475.063C578.742 468.472 575.898 461.96 572.927 455.069C564.316 435.396 555.314 415.044 551.389 393.762C546.215 365.594 550.32 336.253 554.195 307.768C555.895 295.473 557.683 282.856 558.633 270.358C562.181 225.584 552.373 182.608 530.979 149.376C509.3 115.493 472.293 92.872 432.099 88.9249C403.996 86.1706 372.877 95.4722 348.879 103.937C333.142 109.459 318.282 106.6 304.016 103.671C277.412 98.3339 249.518 94.3723 225.503 100.764C201.731 107.106 183.136 124.956 182.075 142.135L182.096 142.485L181.902 142.778C163.903 146.886 149.857 157.23 135.259 177.307C138.574 196.586 133.714 218.485 128.508 241.67C126.58 250.112 124.673 258.905 123.145 267.57C117.939 296.73 119.776 321.929 128.671 342.253C139.84 367.786 161.929 384.775 178.496 394.529C184.541 398.112 190.187 401.474 195.618 404.777C214.39 416.16 229.114 425.072 236.581 425.937L236.824 425.888Z" fill="url(#paint19_linear_3673_7903)"/>
<path d="M321.39 547.627C300.604 542.021 282.081 531.854 268.089 518.084C240.848 491.203 233.815 460.121 232.149 447.952C231.192 441.259 231.299 435.313 231.348 429.581C231.36 424.414 231.528 419.518 230.761 414.256C225.977 412.391 217.998 407.022 207.094 399.714C198.638 393.986 188.133 386.902 176.314 379.577C160.341 369.754 139.109 352.997 128.636 329.145C120.133 309.501 118.602 285.303 124.083 257.252C125.797 248.752 127.889 240.124 129.895 231.818C135.147 210.598 140.081 190.558 137.677 173.019L137.628 172.775L137.793 172.59C153.94 153.161 170.022 143.365 190.04 140.722C192.157 124.746 210.146 109.146 233.044 103.487C257.401 97.5327 286.758 102.463 308.199 106.063C322.931 108.543 336.278 110.19 350.778 104.564C384.085 91.8308 411.462 87.0355 434.584 89.9398C473.818 94.8919 509.716 117.788 530.538 151.44C550.889 184.276 560.091 226.514 556.346 270.316C555.375 282.463 553.509 294.944 551.895 306.918C547.856 335.588 543.664 365.251 549.131 393.613C552.932 412.793 560.916 431.377 568.859 449.261C572.399 457.455 575.812 465.269 578.875 473.104C588.672 498.612 574.743 523.466 557.754 535.774C538.911 549.421 514.138 553.08 494.337 545.097C481.484 539.906 465.306 538.53 449.025 541.378C445.407 542.011 441.653 542.722 437.928 543.326C410.171 548.248 381.471 553.261 353.256 552.201C342.386 552.026 331.676 550.402 321.39 547.627ZM138.777 173.2C141.153 190.847 136.189 210.994 130.938 232.214C128.932 240.52 126.761 249.012 125.155 257.541C119.624 285.349 121.213 309.333 129.637 328.84C139.925 352.527 160.972 369.12 176.866 378.807C188.714 386.024 199.19 393.216 207.646 398.944C218.736 406.416 226.685 411.892 231.42 413.514L231.742 413.601L231.791 413.844C232.5 419.321 232.41 424.352 232.37 429.627C232.321 435.359 232.243 441.198 233.2 447.89C234.895 459.953 241.771 490.763 268.827 517.479C289.428 537.858 320.319 550.326 353.536 551.587C381.615 552.726 410.208 547.684 437.965 542.761C441.69 542.157 445.444 541.446 449.062 540.813C465.557 538.024 481.871 539.321 494.939 544.57C514.311 552.437 538.841 548.828 557.412 535.337C574.129 523.185 587.7 498.81 578.108 473.817C575.153 466.011 571.74 458.196 568.092 449.973C560.286 432.011 552.088 413.369 548.315 394.082C542.77 365.584 546.991 335.814 551.059 307.037C552.78 295.092 554.538 282.582 555.51 270.435C559.197 226.847 550.045 184.853 529.771 152.153C509.107 118.773 473.53 95.9631 434.51 91.0689C411.603 88.2224 384.361 92.9394 351.19 105.594C336.476 111.162 322.993 109.594 308.153 107.085C286.82 103.514 257.571 98.6124 233.485 104.411C211.102 109.864 192.948 125.649 191.19 141.147L191.103 141.468L190.753 141.488C170.813 144.268 154.76 153.956 138.777 173.2Z" fill="url(#paint20_linear_3673_7903)"/>
<path d="M314.924 543.47C293.71 537.749 274.601 527.194 260.725 512.995C241.059 492.983 228.22 465.966 225.58 439.056C224.903 431.75 225.183 425.161 225.619 418.844C225.911 413.062 226.223 407.632 225.737 401.755C223.318 400.069 219.922 397.314 215.57 393.842C206.31 386.404 192.463 375.086 174.899 363.914C152.654 349.641 137.467 333.48 129.818 315.79C121.677 296.934 120.5 273.98 126.279 247.388C128.099 238.917 130.348 230.561 132.54 222.42C137.73 203.137 142.632 184.926 141.274 169.048L141.225 168.805L141.39 168.62C158.95 149.916 177.283 140.728 198.854 139.997C201.853 125.868 219.323 112.196 240.804 107.534C261.692 102.941 286.071 106.299 307.577 109.228L312.114 109.877C327.526 111.965 339.768 112.165 352.946 106.757C374.666 97.793 406.814 88.08 436.744 92.5906C474.725 98.3538 509.272 121.575 529.001 154.588C548.261 186.784 556.7 228.012 552.893 270.763C551.872 282.667 550.093 294.827 548.43 306.558C544.168 335.627 539.861 365.719 545.835 394.332C549.504 411.868 556.87 428.907 564.029 445.43C568.089 454.683 571.914 463.528 575.145 472.443C584.379 497.914 570.161 523.839 551.256 536.434C531.399 549.578 505.484 552.355 484.999 543.497C471.219 537.483 455.107 535.435 439.427 537.755C432.735 538.708 425.879 539.846 419.129 541.013C395.563 544.883 371.132 548.979 347.404 548.324C336.484 547.907 325.424 546.302 314.924 543.47ZM142.296 169.094C143.625 185.079 138.723 203.29 133.533 222.573C131.342 230.714 129.093 239.07 127.272 247.541C121.551 273.919 122.65 296.736 130.741 315.35C138.341 332.796 153.313 348.899 175.48 363.036C193.015 374.315 206.998 385.555 216.229 393.101C220.659 396.709 224.162 399.492 226.474 401.15L226.66 401.315L226.709 401.558C227.167 407.541 226.933 413.108 226.612 418.997C226.283 425.342 225.925 431.795 226.631 438.995C229.192 465.768 241.982 492.543 261.463 512.39C282.106 533.47 314.438 546.557 347.907 547.311C371.663 547.858 395.958 543.84 419.525 539.97C426.245 538.911 433.131 537.665 439.823 536.713C455.502 534.392 471.858 536.391 485.823 542.571C505.987 551.341 531.659 548.614 551.243 535.627C569.74 523.266 583.736 497.74 574.737 472.678C571.506 463.763 567.759 455.054 563.699 445.801C556.54 429.277 549.067 412.21 545.427 394.567C539.51 365.739 543.818 335.648 548.001 306.442C549.665 294.711 551.444 282.552 552.572 270.676C556.321 228.14 547.931 187.155 528.779 154.987C509.128 122.11 474.874 99.0832 437.107 93.3778C407.284 88.8961 375.378 98.5598 353.795 107.446C340.481 112.932 328.103 112.811 312.477 110.664L307.94 110.015C286.54 107.116 262.269 103.786 241.517 108.301C220.28 112.913 202.838 126.478 200.247 140.372L200.161 140.694L199.811 140.714C177.967 141.602 159.799 150.605 142.296 169.094Z" fill="url(#paint21_linear_3673_7903)"/>
<path d="M308.03 539.198C286.601 533.418 267.336 522.592 253.282 507.771C233.204 486.728 220.604 458.396 218.932 430.024C218.507 422.211 219.067 415.008 219.676 408.049C220.248 401.654 220.733 395.58 220.527 389.09C214.324 382.246 198.276 364.589 173.328 347.978C151.812 333.557 137.923 318.551 130.921 302.299C123.25 284.259 122.349 262.415 128.396 237.388C130.431 228.975 132.894 220.677 135.3 212.593C140.507 195.383 145.376 179.002 144.929 164.863L144.987 164.649L145.123 164.571C164.233 146.515 184.757 138.148 207.941 139.115C211.714 126.804 228.851 115.225 248.729 111.395C266.526 108.037 287.398 110.334 305.797 112.425C309.37 112.814 312.943 113.203 316.301 113.534C328.284 114.698 341.199 114.964 355.307 108.658C372.428 100.981 406.098 89.0357 439.204 94.9778C476.04 101.581 509.05 124.962 527.844 157.608C545.904 189.136 553.766 229.519 549.819 271.083C548.749 282.744 546.949 294.553 545.236 306.041C540.888 335.432 536.358 365.923 542.703 394.867C546.29 411.001 553.086 426.737 559.813 441.88C564.108 451.541 568.395 461.66 571.746 471.411C580.798 497.982 565.199 524.339 545.116 536.617C524.324 549.393 497.16 551.259 475.942 541.284C465.532 536.408 449.156 531.072 430.217 533.547C421.424 534.623 412.651 536.048 403.392 537.572C383.2 540.859 362.309 544.186 342.047 543.892C330.369 543.73 318.958 542.146 308.03 539.198ZM145.786 165.094C146.204 179.34 141.335 195.722 136.128 212.931C133.722 221.015 131.259 229.313 129.253 237.619C123.235 262.539 124.058 284.247 131.679 302.044C138.682 318.296 152.413 333.03 173.822 347.422C198.849 364.169 215.054 382.098 221.178 388.806L221.256 388.942L221.227 389.049C221.512 395.675 221.027 401.749 220.426 408.251C219.817 415.211 219.179 422.277 219.604 430.09C221.333 458.248 233.748 486.416 253.748 507.322C274.832 529.325 307.75 542.799 341.791 543.134C362.082 543.321 382.867 539.965 403.029 536.785C411.909 535.389 421.168 533.864 429.962 532.789C449.115 530.372 465.705 535.766 476.115 540.642C497.148 550.451 523.961 548.606 544.481 535.986C564.293 523.865 579.561 497.879 570.744 471.716C567.393 461.964 563.313 452.361 558.783 442.292C552.085 427.042 545.288 411.305 541.702 395.171C535.279 366.092 539.808 335.601 544.185 306.102C545.899 294.615 547.591 282.777 548.768 271.144C552.687 229.688 544.874 189.548 526.892 158.155C508.254 125.782 475.43 102.566 438.809 96.0201C405.916 90.1358 372.49 102.032 355.369 109.709C341.318 115.801 328.268 115.613 316.178 114.42C312.819 114.089 309.246 113.7 305.674 113.31C287.381 111.249 266.617 108.981 248.927 112.367C229.078 116.091 212.184 127.621 208.682 139.775L208.596 140.096L208.246 140.117C185.12 138.935 164.76 147.117 145.786 165.094Z" fill="url(#paint22_linear_3673_7903)"/>
<path d="M301.106 535.033C279.463 529.195 260.07 517.989 245.782 502.76C225.291 480.688 213.066 450.963 212.226 421.207C211.945 412.858 212.892 405.07 213.782 397.497C214.634 390.488 215.4 383.8 215.337 376.774C208.858 365.835 193.626 347.708 171.776 332.393C157.555 322.467 140.283 308.502 131.965 289.023C124.785 272.149 124.305 250.878 130.484 227.495C132.762 219.033 135.546 210.821 138.166 202.795C143.176 187.601 148.061 173.292 148.419 160.864L148.476 160.65L148.612 160.571C169.193 143.027 192.125 135.539 216.676 138.254C221.36 127.683 237.706 118.189 256.41 115.305C271.418 112.918 288.239 114.468 304.388 115.951C309.897 116.403 315.057 116.875 320.137 117.212C334.844 118.076 346.049 116.157 357.425 110.608C385.688 96.9745 416.296 92.1314 441.343 97.2783C476.848 104.557 508.642 128.184 526.286 160.405C543.254 191.294 550.383 230.56 546.345 271.18C545.225 282.598 543.483 294.193 541.721 305.438C537.257 335.257 532.534 366.041 539.357 395.343C542.832 410.183 549.245 424.782 555.374 438.73C559.954 449.042 564.632 459.841 568.024 470.293C572.076 482.991 570.866 496.453 564.555 509.228C558.968 520.59 549.475 530.669 538.597 536.927C516.869 549.336 488.564 550.319 466.476 539.306C450.149 531.225 435.161 527.987 420.52 529.438C410.248 530.459 399.315 532.222 388.869 533.885C371.46 536.658 353.456 539.501 335.96 539.608C324.224 539.659 312.356 538.067 301.106 535.033ZM149.305 160.988C148.811 173.494 144.033 187.832 139.024 203.027C136.404 211.053 133.59 219.371 131.341 227.727C126.987 243.902 123.738 267.5 132.753 288.661C140.992 308.003 158.292 321.862 172.3 331.73C194.228 347.181 209.645 365.472 216.124 376.412L216.202 376.548L216.174 376.655C216.207 383.788 215.462 390.826 214.668 397.621C213.807 405.087 212.86 412.875 213.141 421.224C213.931 450.737 226.078 480.325 246.491 502.262C267.958 525.402 301.519 539.051 336.269 538.887C353.658 538.751 371.662 535.908 389.071 533.136C399.517 531.472 410.449 529.71 420.722 528.689C435.47 527.266 450.701 530.455 467.135 538.564C488.931 549.384 516.993 548.45 538.555 536.226C559.059 524.521 576.203 497.547 567.588 470.635C564.195 460.183 559.488 449.491 555.045 439.101C548.837 425.017 542.424 410.418 538.978 395.47C532.184 366.061 536.8 335.249 541.292 305.322C543.055 294.078 544.797 282.483 545.887 271.172C549.868 230.766 542.817 191.636 525.927 160.883C508.333 128.905 476.831 105.471 441.569 98.1438C416.63 93.0258 386.158 97.7906 358.138 111.375C346.654 116.895 335.314 118.892 320.5 117.999C315.526 117.692 310.26 117.19 304.751 116.738C288.601 115.255 271.859 113.842 256.88 116.121C238.176 119.005 222.073 128.45 217.632 138.972L217.546 139.293L217.224 139.207C192.623 136.248 169.828 143.658 149.305 160.988Z" fill="url(#paint23_linear_3673_7903)"/>
<path d="M294.29 530.896C272.433 525.001 252.776 513.494 238.447 497.564C217.544 474.461 205.665 443.451 205.686 412.203C205.656 403.348 206.884 394.946 208.024 386.866C209.07 379.565 210.202 371.942 210.313 364.273C205.787 352.482 192.623 333.075 170.39 316.622C155.435 305.579 140.455 292.921 133.176 275.561C124.524 255.188 128.156 232.727 132.708 217.524C135.258 208.905 138.422 200.566 141.392 192.52C146.253 179.583 150.805 167.367 152.073 156.679L152.102 156.572L152.238 156.493C174.398 139.49 199.736 132.881 225.627 137.451C231.193 128.726 246.991 121.267 264.228 119.137C276.582 117.643 290.452 118.627 303.865 119.602C311.068 120.166 317.843 120.614 324.247 120.733C337.404 120.949 348.324 118.379 359.68 112.48C386.686 98.3923 418.102 93.5373 443.696 99.6363C477.949 107.726 508.313 131.542 524.943 163.26C540.712 193.481 547.186 231.766 543.115 271.228C541.974 282.296 540.183 293.647 538.478 304.678C533.792 334.897 528.982 366.002 536.205 395.527C539.618 409.316 545.541 422.749 551.336 435.802C556.228 446.658 561.22 458.001 564.547 469.125C572.972 497.595 554.255 525.293 532.379 536.973C507.054 550.365 477.607 544.491 457.418 537.092C454.583 536.098 451.806 534.889 448.785 533.73C437.16 529.1 425.135 524.248 411.203 525.202C399.83 526.041 387.818 527.971 376.157 529.882C361.121 532.376 345.52 534.832 330.388 535.117C318.109 535.482 305.862 534.017 294.29 530.896ZM152.795 156.988C151.527 167.677 146.974 179.892 142.113 192.829C139.143 200.875 135.979 209.214 133.429 217.834C128.906 232.93 125.303 255.283 133.798 275.384C141.135 292.53 155.901 305.13 170.856 316.173C193.196 332.655 206.516 352.334 211.013 364.232L211.092 364.369C210.952 372.144 209.82 379.767 208.852 387.205C207.712 395.285 206.485 403.686 206.514 412.542C206.443 443.546 218.352 474.449 239.069 497.387C260.948 521.558 295.201 535.623 330.582 534.825C345.606 534.511 361.207 532.054 376.243 529.56C387.905 527.65 399.917 525.719 411.29 524.88C425.358 523.849 437.997 528.981 449.222 533.388C452.243 534.547 455.02 535.756 457.748 536.722C477.858 543.984 507.062 549.908 532.251 536.594C553.855 525.071 572.35 497.772 564.081 469.574C560.754 458.45 555.734 447.214 550.949 436.387C545.154 423.334 539.124 409.872 535.739 395.975C528.438 366.315 533.306 334.996 537.992 304.776C539.697 293.746 541.459 282.501 542.628 271.327C546.671 231.971 540.275 193.823 524.585 163.738C508.033 132.156 477.747 108.476 443.816 100.473C418.407 94.5388 387.156 99.2085 360.286 113.218C348.794 119.196 337.738 121.844 324.473 121.598C318.07 121.48 311.295 121.031 304.092 120.467C290.786 119.521 276.944 118.43 264.698 119.953C244.63 122.354 230.802 131.033 226.476 138.14L226.311 138.325L226.097 138.267C200.098 133.668 174.897 140.199 152.795 156.988Z" fill="url(#paint24_linear_3673_7903)"/>
<path d="M287.824 526.739C265.646 520.757 245.325 508.727 230.975 492.447C209.738 468.45 198.156 435.911 199.009 403.279C199.206 395.289 200.796 387.675 202.3 380.382C204.223 370.674 206.109 361.531 205.181 351.744C203.972 339.583 192.362 319.101 168.897 300.822C155.013 290.069 140.989 278.128 134.25 262.177C126.118 242.864 130.075 221.755 134.825 207.524C137.783 198.67 141.462 190.126 144.947 181.874C149.524 171.273 153.821 161.287 155.621 152.465L155.65 152.358L155.786 152.28C179.903 135.689 207.025 130.136 234.42 136.376C239.851 130.717 253.531 124.295 271.967 122.833C281.832 122.047 292.908 122.736 303.528 123.418C312.239 123.929 320.493 124.431 328.141 124.196C339.963 123.823 350.083 120.808 361.856 114.216C388.12 99.4687 419.585 94.8568 445.864 101.83C445.971 101.859 446.078 101.888 446.185 101.916C478.971 110.759 507.798 134.736 523.386 166.057C538.326 195.94 543.918 232.378 539.641 271.325C538.451 282.15 536.717 293.287 534.992 303.967C530.112 334.479 525.158 366.12 532.887 395.896C536.21 408.742 541.828 421.173 547.318 433.225C552.445 444.489 557.672 456.24 560.961 467.928C569.07 497.577 549.079 525.736 526.024 537.098C504.816 547.579 477.079 546.877 448.118 534.929C445.204 533.798 442.348 532.453 439.278 531.051C427.69 525.857 415.595 520.411 401.642 521.014C389.548 521.544 376.778 523.73 364.387 525.788C351.267 527.995 337.797 530.221 324.68 530.705C312.314 531.391 299.824 529.976 287.824 526.739ZM156.42 152.911C154.513 161.703 150.216 171.69 145.639 182.29C142.154 190.542 138.504 198.98 135.546 207.834C130.825 221.957 126.818 242.823 134.872 262.001C141.533 277.815 155.586 289.649 169.362 300.374C192.935 318.681 204.702 339.435 205.882 351.703C206.81 361.49 205.002 370.769 202.971 380.448C201.439 387.848 199.985 395.384 199.71 403.238C198.778 435.734 210.311 468.03 231.47 491.891C253.497 516.791 289.193 531.475 324.689 530.248C337.805 529.764 351.275 527.537 364.396 525.331C376.786 523.273 389.556 521.087 401.758 520.586C415.847 519.905 427.941 525.35 439.608 530.68C442.678 532.083 445.563 533.32 448.34 534.529C465.12 541.353 497.411 550.752 525.79 536.69C548.601 525.377 568.369 497.617 560.388 468.348C557.206 456.689 551.951 445.045 546.823 433.781C541.362 421.622 535.744 409.191 532.315 396.316C524.507 366.404 529.568 334.792 534.477 304.173C536.202 293.493 537.936 282.356 539.125 271.531C543.374 232.691 537.754 196.36 522.891 166.613C507.382 135.428 478.633 111.588 446.062 102.802C445.955 102.773 445.847 102.745 445.74 102.716C419.569 95.7716 388.346 100.334 362.218 115.003C350.31 121.673 340.19 124.688 328.26 125.033C320.612 125.268 312.358 124.765 303.647 124.254C293.028 123.573 282.058 122.912 272.193 123.699C253.757 125.161 240.213 131.504 234.997 137.221L234.861 137.299L234.647 137.241C207.387 130.923 180.294 136.37 156.42 152.911Z" fill="url(#paint25_linear_3673_7903)"/>
<path d="M281.008 522.603C258.615 516.563 238.138 504.261 223.504 487.33C201.962 462.331 190.618 428.477 192.44 394.383C192.917 385.779 194.602 377.386 196.307 369.343C198.482 359.129 200.483 349.558 200.05 339.214C199.545 325.29 189.311 303.111 167.404 285.023L166.847 284.528C154.991 274.781 141.651 263.714 135.353 248.687C129.339 234.311 129.959 216.208 137.049 197.553C140.609 188.172 145.046 179.373 149.289 170.865C153.31 162.758 157.187 155.186 159.461 148.445L159.49 148.338L159.626 148.26C185.049 132.367 214.549 127.799 242.835 135.428C243.049 135.486 243.37 135.573 243.585 135.63C249.304 131.888 262.251 127.336 279.999 126.723C287.432 126.43 295.686 126.933 303.726 127.378C313.459 127.935 323.514 128.578 332.357 127.746C345.296 126.64 355.292 121.523 364.353 116.039C389.603 100.788 421.769 96.1354 448.46 104.139C480.051 113.579 507.691 137.695 522.393 168.892C536.163 197.999 541.1 233.456 536.731 271.46C535.492 282.041 533.709 292.936 532.041 303.401C527.046 334.342 521.791 366.246 529.999 396.381C533.231 408.283 538.593 419.956 543.749 431.113C549.111 442.786 554.63 454.73 557.669 466.925C561.111 480.608 558.825 495.503 551.105 508.817C543.993 521.147 532.691 531.542 519.963 537.416C489.376 551.572 456.088 540.755 439.11 532.959C436.147 531.585 433.212 530.104 430.064 528.565C418.513 522.807 406.455 516.797 392.482 517.05C379.909 517.221 366.624 519.613 353.826 521.906C342.486 523.903 330.659 525.998 319.237 526.594C306.17 527.321 293.33 525.926 281.008 522.603ZM159.939 148.804C157.665 155.544 153.895 163.145 149.767 171.224C145.524 179.731 141.087 188.531 137.527 197.912C130.602 216.382 130.011 234.377 135.839 248.588C142.059 263.479 155.428 274.439 167.177 284.157L167.733 284.652C189.748 302.77 200.032 325.192 200.614 339.252C200.941 349.566 198.902 359.702 196.843 369.488C195.137 377.531 193.482 385.817 193.005 394.421C191.24 428.3 202.506 462.018 223.969 486.881C246.459 513.054 282.875 528.047 318.923 526.05C330.346 525.454 342.065 523.33 353.512 521.361C366.311 519.068 379.567 516.784 392.276 516.535C406.356 516.311 418.414 522.321 430.072 528.108C433.221 529.647 436.155 531.127 439.118 532.501C456.125 540.191 489.17 551.057 519.514 536.95C543.396 525.927 564.545 497.735 556.803 467.151C553.736 455.064 548.217 443.119 542.855 431.446C537.728 420.182 532.365 408.509 529.026 396.578C520.712 366.414 525.995 334.403 531.019 303.356C532.687 292.89 534.47 281.995 535.709 271.414C540.049 233.518 535.084 198.168 521.392 169.196C506.768 138.135 479.342 114.077 447.83 104.773C421.324 96.9346 389.323 101.402 364.18 116.682C355.119 122.166 344.987 127.361 331.941 128.438C323.019 129.135 312.936 128.598 303.203 128.041C295.27 127.625 287.016 127.122 279.611 127.308C261.863 127.921 248.916 132.473 243.333 136.137L243.197 136.215L243.09 136.187C242.769 136.1 242.554 136.042 242.233 135.955C214.483 128.471 185.226 132.989 159.939 148.804Z" fill="url(#paint26_linear_3673_7903)"/>
<path d="M274.163 518.573C251.556 512.476 230.951 499.794 216.032 482.212C194.157 456.318 183.188 421.072 185.735 385.565C186.414 376.212 188.378 367.205 190.285 358.412C192.46 348.198 194.721 337.662 194.967 326.928C195.201 312.398 187.715 288.548 165.96 269.466C164.925 268.613 163.998 267.788 162.993 266.827C152.578 257.699 141.872 248.377 136.505 235.439C128.921 217.077 134.948 197.676 139.216 187.796C143.599 177.488 149.396 167.906 154.554 159.416C157.719 154.065 160.796 149.035 163.058 144.474L163.087 144.367L163.223 144.289C190.904 128.545 222.588 125.256 252.428 134.798C260.904 131.914 274.201 130.33 287.787 130.662C292.819 130.755 298.007 131.12 303.545 131.465C314.729 132.184 326.341 133.018 336.408 131.482C347.876 129.864 356.908 124.487 366.579 118.018C391.145 101.893 423.467 97.5123 450.706 106.468C480.995 116.476 507.283 140.917 520.914 171.825C533.514 200.157 537.766 234.74 533.336 271.693C532.047 282.031 530.351 292.604 528.633 302.827C523.445 334.059 518.046 366.499 526.682 396.75C529.901 407.844 534.93 418.623 539.801 429.129C545.349 440.966 551.132 453.212 553.948 465.806C557.167 479.888 554.445 495.126 546.316 508.675C538.797 521.239 526.766 531.782 513.502 537.512C489.685 547.864 459.101 545.359 429.702 530.766C426.66 529.256 423.541 527.61 420.343 525.828C408.829 519.506 396.886 513.067 382.814 512.833C369.978 512.703 356.557 515.173 343.486 517.623C333.547 519.538 323.287 521.367 313.315 522.124C300.104 523.387 286.806 521.983 274.163 518.573ZM163.429 144.804C161.167 149.365 158.118 154.288 154.954 159.639C149.903 168.158 144.106 177.74 139.752 187.941C135.484 197.82 129.622 217.036 137.02 235.233C142.309 248.035 153.015 257.357 163.351 266.349C164.385 267.203 165.391 268.164 166.318 268.988C188.152 288.206 195.716 312.192 195.454 326.829C195.315 337.592 193.054 348.128 190.772 358.313C188.865 367.106 186.9 376.113 186.25 385.36C183.732 420.76 194.73 455.898 216.42 481.627C239.507 508.996 276.537 524.269 313.109 521.609C323.081 520.852 333.37 518.916 343.28 517.108C356.351 514.658 369.801 512.081 382.715 512.347C396.788 512.581 408.837 519.048 420.458 525.4C423.656 527.182 426.669 528.798 429.817 530.337C459.109 544.902 489.479 547.348 513.16 537.075C538.415 526.077 560.288 496.472 553.218 465.954C550.374 453.467 544.591 441.221 539.043 429.384C534.171 418.878 529.036 408.071 525.845 396.869C517.131 366.482 522.53 334.042 527.747 302.703C529.465 292.48 531.161 281.907 532.45 271.569C536.851 234.723 532.57 200.247 520.049 172.051C506.389 141.25 480.286 116.974 450.105 106.995C422.973 98.0684 390.893 102.4 366.463 118.446C356.685 124.886 347.653 130.263 336.049 131.959C326.011 133.388 314.37 132.661 303.079 131.914C297.541 131.569 292.353 131.204 287.429 131.14C273.814 130.915 260.652 132.42 252.176 135.305L251.962 135.247C222.444 125.792 190.975 129.139 163.429 144.804Z" fill="url(#paint27_linear_3673_7903)"/>
<path d="M267.669 514.523C262.74 513.194 257.898 511.543 253.035 509.542C235.563 502.302 220.207 491.036 208.697 477.016C186.623 450.15 175.786 413.561 179.194 376.562C180.075 366.459 182.242 356.702 184.457 347.188C186.855 336.575 189.231 325.61 189.943 314.427C190.839 297.434 184.664 272.558 164.573 253.695C163.119 252.269 161.45 250.785 159.995 249.358C151.229 241.364 142.307 233.097 137.686 222.084C132.505 209.311 133.843 193.241 141.44 177.825C147.22 166.171 155.242 155.58 161.637 147.194C163.429 144.804 165.192 142.522 166.684 140.397L166.82 140.319C196.051 125.222 230.463 122.899 261.242 134.073C270.163 133.377 282.406 133.577 295.469 134.572C297.834 134.751 300.17 135.036 302.643 135.243C314.869 136.358 328.76 137.692 340.216 135.266C350.348 133.059 358.309 127.392 366.785 121.52L368.639 120.182C392.22 103.447 425.322 99.1616 452.866 109.119C467.305 114.392 481.115 123.287 492.617 134.778C503.934 146.103 513.186 159.974 519.377 174.972C530.807 202.529 534.433 236.024 529.912 272.033C528.681 282.157 526.827 292.458 525.168 302.467C519.756 334.099 514.164 366.831 523.385 397.469C526.563 407.863 531.336 417.883 536.06 427.66C541.793 439.662 547.761 452.073 550.49 464.989C553.487 479.47 550.465 494.971 541.792 508.833C533.729 521.711 521.211 532.352 507.382 538.044C482.086 548.342 450.439 545.091 420.636 529.01C417.409 527.335 414.162 525.31 410.964 523.529C399.458 516.748 387.553 509.745 373.596 509.083C360.661 508.467 347.182 511.151 334.161 513.844C325.516 515.648 316.549 517.366 307.813 518.227C294.31 519.296 280.74 518.049 267.669 514.523ZM166.948 140.698C165.456 142.823 163.722 144.998 161.929 147.387C155.176 156.252 147.513 166.364 141.733 178.019C134.3 193.25 132.884 209.184 138.094 221.85C142.608 232.834 151.559 240.993 160.217 248.959C161.779 250.414 163.341 251.869 164.903 253.325C185.043 272.43 191.297 297.442 190.4 314.436C189.825 325.541 187.312 336.583 185.022 347.226C182.913 356.768 180.747 366.525 179.759 376.6C176.38 413.491 187.11 450.051 209.212 476.81C232.868 505.482 270.591 521.172 307.636 517.605C316.372 516.744 325.231 514.997 333.983 513.221C347.112 510.558 360.59 507.873 373.526 508.49C387.59 509.181 399.602 516.213 411.108 522.993C414.277 524.882 417.553 526.8 420.673 528.445C450.397 544.391 481.909 547.72 507.098 537.393C533.424 526.684 556.572 496.618 549.955 464.844C547.304 452.065 541.335 439.654 535.602 427.652C530.879 417.875 526.135 407.748 522.957 397.354C513.628 366.687 519.25 333.847 524.69 302.108C526.457 292.128 528.203 281.799 529.434 271.674C533.926 235.773 530.3 202.278 518.949 174.857C506.254 144.316 481.502 119.715 452.594 109.275C425.264 99.3758 392.406 103.612 368.853 120.24L366.999 121.578C358.495 127.557 350.534 133.223 340.265 135.509C328.81 137.935 314.783 136.679 302.556 135.565C300.084 135.358 297.748 135.072 295.382 134.894C282.212 133.869 270.105 133.591 261.155 134.395C230.347 123.327 196.043 125.68 166.948 140.698Z" fill="url(#paint28_linear_3673_7903)"/>
<path d="M261.145 510.581C238.002 504.339 216.577 490.862 201.333 471.927C178.925 444.167 168.463 406.185 172.625 367.667C173.815 356.842 176.212 346.228 178.63 335.965C181.142 324.923 183.741 313.559 184.782 302.005C186.91 277.875 178.753 253.958 163.08 237.896C161.283 236.032 159.272 234.111 157.339 232.326C150.037 225.301 142.549 218.11 138.761 208.701C133.913 196.822 135.721 181.568 143.528 167.933C151.393 154.083 161.154 142.582 170.31 136.319C198.864 116.904 235.177 124.171 269.978 133.212C275.656 134.744 282.666 135.6 290.639 136.717C294.641 137.222 298.856 137.784 303.15 138.483C316.489 140.587 331.851 142.432 344.081 138.837C352.578 136.303 359.129 131.176 366.147 125.6C367.622 124.389 369.204 123.207 370.786 122.025C382.084 113.353 396.234 107.747 411.312 105.954C426.282 104.132 441.402 106.027 454.869 111.497C468.979 117.142 481.766 125.991 492.91 137.959C503.526 149.325 512.107 163.13 517.762 177.984C528.178 205.038 531.029 236.715 526.38 272.345C525.1 282.226 523.333 292.205 521.624 301.971C515.99 334.002 510.175 367.134 519.932 397.917C522.962 407.582 527.664 417.008 532.103 426.134C538.051 438.194 544.204 450.769 546.633 463.949C549.408 478.83 545.919 494.78 536.867 508.769C528.26 521.959 515.121 532.778 500.785 538.218C486.936 543.56 471.595 545.053 455.247 542.597C440.429 540.438 425.132 534.934 411.199 526.924C407.923 525.006 404.568 522.953 401.243 520.792C389.745 513.554 377.877 505.987 363.928 504.867C351.108 503.822 337.786 506.779 324.872 509.5C317.306 511.136 309.498 512.822 301.891 513.758C288.243 515.362 274.431 514.164 261.145 510.581ZM445.312 108.575C419.598 101.64 391.355 106.661 370.943 122.297C369.361 123.479 367.885 124.69 366.303 125.872C359.286 131.448 352.706 136.682 344.102 139.187C331.736 142.861 316.403 140.908 302.928 138.882C298.527 138.155 294.418 137.621 290.417 137.117C282.414 136.107 275.434 135.144 269.755 133.612C235.062 124.599 198.749 117.333 170.33 136.67C161.311 142.854 151.55 154.355 143.714 168.098C136.042 181.655 134.292 196.695 139.032 208.544C142.849 217.847 150.337 225.037 157.533 232.033C159.437 233.926 161.477 235.74 163.274 237.603C171.73 246.319 177.974 256.85 181.606 268.976C184.862 279.506 186.03 290.966 185.026 301.955C183.984 313.509 181.385 324.873 178.873 335.916C176.455 346.179 174.058 356.793 172.868 367.617C168.735 406.029 179.226 443.904 201.526 471.635C225.38 501.279 264.76 517.646 301.656 513.35C309.263 512.414 317.072 510.728 324.637 509.092C337.58 506.263 350.902 503.307 363.829 504.381C377.885 505.529 389.753 513.097 401.358 520.363C404.606 522.388 407.931 524.549 411.207 526.467C441.336 543.9 473.911 547.975 500.579 537.703C527.87 527.254 552.426 496.649 546.204 463.833C543.747 450.761 537.594 438.185 531.646 426.125C527.207 417 522.504 407.573 519.503 397.801C509.668 366.883 515.512 333.644 521.146 301.612C522.855 291.846 524.65 281.76 525.902 271.986C530.629 236.492 527.671 204.786 517.362 177.761C505.689 147.266 482.231 122.555 454.733 111.576C451.712 110.416 448.527 109.442 445.312 108.575Z" fill="url(#paint29_linear_3673_7903)"/>
<path d="M254.378 506.687C231.129 500.416 209.361 486.502 193.861 466.81C171.227 438.184 161.032 398.781 165.948 358.742C167.34 347.167 170.075 335.725 172.723 324.605C175.458 313.163 178.28 301.4 179.622 289.582C181.409 273.978 181.426 244.453 161.558 222.203C159.526 219.932 157.359 217.738 155.191 215.545C149.244 209.46 142.976 203.288 139.835 195.317C135.486 184.148 137.599 169.895 145.616 158.04C152.752 147.325 163.066 138.042 173.8 132.32C188.905 124.444 206.332 120.756 225.835 121.306C242.594 121.805 260.425 125.58 278.821 132.38C290.532 136.688 300.703 139.891 310.968 142.315C326.297 145.99 338.812 146.033 348.161 142.465C355.451 139.72 360.951 134.654 366.889 129.247C368.858 127.48 370.857 125.606 373.04 123.897C395.225 105.521 429.076 101.438 457.251 113.748C470.817 119.705 483.061 128.868 493.504 140.877C503.312 152.255 511.329 166.022 516.477 180.624C525.673 206.66 527.918 237.599 523.178 272.285C521.877 281.816 520.032 291.659 518.381 301.21C512.525 333.642 506.487 367.173 516.858 398.237C519.925 407.337 524.343 416.112 528.605 424.615C534.767 436.733 541.027 449.337 543.291 462.702C545.843 477.983 541.918 494.275 532.322 508.577C523.114 522.294 509.681 532.919 494.538 538.372C480.017 543.647 464.062 544.859 447.208 542.152C431.804 539.606 416.165 533.664 401.977 524.896C398.515 522.813 395.111 520.517 391.707 518.22C380.218 510.525 368.358 502.5 354.446 500.816C341.741 499.342 328.741 502.385 316.198 505.437C309.576 506.983 302.818 508.607 296.126 509.56C282.177 511.428 267.985 510.357 254.378 506.687ZM261.715 127.192C228.501 118.233 197.814 119.953 173.985 132.484C163.28 138.1 153.045 147.519 145.938 158.126C138.056 169.903 135.837 184.127 140.243 195.082C143.384 203.053 149.545 209.196 155.492 215.281C157.659 217.475 159.827 219.668 161.859 221.94C169.722 230.725 175.286 241.648 178.287 254.407C180.864 265.328 181.401 277.423 180.079 289.591C178.709 301.515 175.887 313.279 173.152 324.721C170.504 335.841 167.769 347.283 166.406 358.75C161.519 398.682 171.635 437.949 194.269 466.575C218.877 497.686 258.871 514.334 296.134 509.102C302.826 508.15 309.584 506.525 316.206 504.979C328.856 501.957 341.857 498.914 354.561 500.387C368.58 502.1 380.469 510.018 391.93 517.82C395.227 520.088 398.738 522.414 402.092 524.468C432.254 543.059 466.749 548.112 494.41 537.993C526.621 526.343 547.938 493.256 542.805 462.801C540.541 449.436 534.28 436.832 528.226 424.743C523.964 416.239 519.546 407.464 516.508 398.257C506.166 367.087 512.203 333.555 518.088 301.017C519.847 291.494 521.556 281.729 522.857 272.199C527.596 237.513 525.43 206.709 516.234 180.674C505.348 149.816 483.847 125.518 457.193 113.963C429.018 101.652 395.381 105.793 373.333 124.091C371.256 125.829 369.151 127.674 367.181 129.441C361.273 134.741 355.636 139.885 348.347 142.63C338.861 146.276 326.347 146.233 310.91 142.529C300.645 140.105 290.368 136.873 278.763 132.594C272.878 130.547 267.286 128.694 261.715 127.192Z" fill="url(#paint30_linear_3673_7903)"/>
<path d="M248.069 502.803C242.926 501.415 237.87 499.707 232.929 497.57C214.714 489.67 198.626 477.287 186.497 461.721C174.817 446.621 166.524 428.758 161.903 408.782C157.529 390.022 156.711 369.579 159.379 349.846C161.08 337.551 164.074 325.145 167.032 313.303C169.853 301.54 172.897 289.377 174.569 277.189C177.468 256.599 177.205 227.688 160.143 206.54C158.062 204.025 155.844 201.589 153.598 199.259C148.686 194.028 143.666 188.767 140.987 182.069C137.001 171.687 139.662 158.387 147.812 148.176C154.334 140.168 164.033 133.592 177.504 128.378C194.715 121.645 213.885 118.313 232.902 118.961C251.948 119.502 270.871 123.916 287.635 131.655C291.319 133.338 295.053 135.265 298.572 137.133C305.025 140.482 311.693 143.889 318.727 146.361C331.354 150.686 343.197 150.663 352.105 146.172C358.459 143.06 363.424 137.849 368.224 132.824C370.445 130.551 372.724 128.063 375.13 125.954C385.773 116.301 399.795 110.316 415.487 108.803C430.37 107.303 445.988 109.906 459.439 116.292C484.82 128.308 505.076 152.961 515.047 183.801C523.258 209.226 524.836 238.377 519.832 272.762C518.482 282.049 516.723 291.571 515.022 300.879C508.944 333.71 502.684 367.641 513.561 398.956C516.558 407.463 520.77 415.723 524.855 423.604C531.124 435.751 537.52 448.277 539.591 461.934C541.813 477.586 537.558 494.248 527.555 508.785C517.802 522.815 503.884 533.539 488.205 538.847C458.957 548.883 423.213 542.919 392.618 522.947C389.107 520.621 385.518 518.159 382.064 515.619C370.583 507.466 358.838 499.013 344.935 496.872C332.482 494.892 319.988 498.186 307.873 501.353C302.195 502.809 296.245 504.421 290.36 505.362C276.569 507.502 262.212 506.617 248.069 502.803ZM265.918 123.959C236.989 116.157 205.231 117.587 177.475 128.485C164.112 133.728 154.441 140.197 147.919 148.205C139.798 158.309 137.166 171.502 141.181 181.777C143.753 188.446 148.772 193.706 153.685 198.938C155.931 201.267 158.255 203.733 160.337 206.247C177.477 227.531 177.711 256.549 174.812 277.139C173.14 289.328 170.096 301.491 167.246 313.361C164.396 325.231 161.294 337.609 159.593 349.904C153.952 391.356 163.801 432.045 186.662 461.536C211.575 493.649 253.303 511.109 290.262 504.876C296.146 503.935 301.989 502.294 307.774 500.867C319.889 497.7 332.49 494.434 344.943 496.414C358.818 498.663 370.699 507.038 382.151 515.297C385.633 517.73 389.087 520.271 392.598 522.596C423.085 542.539 458.722 548.475 487.863 538.41C521.145 527.049 543.657 493.365 539.055 461.79C537.092 448.161 530.695 435.635 524.397 423.595C520.342 415.607 515.994 407.426 513.026 398.812C502.07 367.361 508.33 333.43 514.437 300.492C516.109 291.291 517.897 281.662 519.247 272.374C524.25 237.989 522.644 208.945 514.54 183.549C504.647 152.845 484.499 128.222 459.118 116.205C430.803 102.708 396.28 106.725 375.159 125.847C372.724 128.063 370.474 130.444 368.253 132.717C363.453 137.742 358.352 143.031 351.998 146.143C342.982 150.605 331.003 150.706 318.406 146.274C311.372 143.803 304.704 140.396 298.25 137.046C294.731 135.178 290.997 133.252 287.313 131.569C280.559 128.483 273.311 125.953 265.918 123.959Z" fill="url(#paint31_linear_3673_7903)"/>
</g>
</g>
</g>
</g>
<defs>
<linearGradient id="paint0_linear_3673_7903" x1="574.132" y1="109.135" x2="86.9354" y2="596.332" gradientUnits="userSpaceOnUse">
<stop stop-color="#4AFEBF"/>
<stop offset="1" stop-color="#51EEDA"/>
</linearGradient>
<linearGradient id="paint1_linear_3673_7903" x1="574.132" y1="109.135" x2="86.9354" y2="596.332" gradientUnits="userSpaceOnUse">
<stop stop-color="#4AFEBF"/>
<stop offset="1" stop-color="#51EEDA"/>
</linearGradient>
<linearGradient id="paint2_linear_3673_7903" x1="574.132" y1="109.135" x2="86.9354" y2="596.332" gradientUnits="userSpaceOnUse">
<stop stop-color="#4AFEBF"/>
<stop offset="1" stop-color="#51EEDA"/>
</linearGradient>
<linearGradient id="paint3_linear_3673_7903" x1="574.132" y1="109.135" x2="86.9354" y2="596.332" gradientUnits="userSpaceOnUse">
<stop stop-color="#4AFEBF"/>
<stop offset="1" stop-color="#51EEDA"/>
</linearGradient>
<linearGradient id="paint4_linear_3673_7903" x1="574.132" y1="109.135" x2="86.9354" y2="596.332" gradientUnits="userSpaceOnUse">
<stop stop-color="#4AFEBF"/>
<stop offset="1" stop-color="#51EEDA"/>
</linearGradient>
<linearGradient id="paint5_linear_3673_7903" x1="574.132" y1="109.135" x2="86.9354" y2="596.332" gradientUnits="userSpaceOnUse">
<stop stop-color="#4AFEBF"/>
<stop offset="1" stop-color="#51EEDA"/>
</linearGradient>
<linearGradient id="paint6_linear_3673_7903" x1="574.132" y1="109.135" x2="86.9354" y2="596.332" gradientUnits="userSpaceOnUse">
<stop stop-color="#4AFEBF"/>
<stop offset="1" stop-color="#51EEDA"/>
</linearGradient>
<linearGradient id="paint7_linear_3673_7903" x1="574.132" y1="109.135" x2="86.9354" y2="596.332" gradientUnits="userSpaceOnUse">
<stop stop-color="#4AFEBF"/>
<stop offset="1" stop-color="#51EEDA"/>
</linearGradient>
<linearGradient id="paint8_linear_3673_7903" x1="574.132" y1="109.135" x2="86.9354" y2="596.332" gradientUnits="userSpaceOnUse">
<stop stop-color="#4AFEBF"/>
<stop offset="1" stop-color="#51EEDA"/>
</linearGradient>
<linearGradient id="paint9_linear_3673_7903" x1="574.132" y1="109.135" x2="86.9354" y2="596.332" gradientUnits="userSpaceOnUse">
<stop stop-color="#4AFEBF"/>
<stop offset="1" stop-color="#51EEDA"/>
</linearGradient>
<linearGradient id="paint10_linear_3673_7903" x1="574.132" y1="109.135" x2="86.9354" y2="596.332" gradientUnits="userSpaceOnUse">
<stop stop-color="#4AFEBF"/>
<stop offset="1" stop-color="#51EEDA"/>
</linearGradient>
<linearGradient id="paint11_linear_3673_7903" x1="574.132" y1="109.135" x2="86.9354" y2="596.332" gradientUnits="userSpaceOnUse">
<stop stop-color="#4AFEBF"/>
<stop offset="1" stop-color="#51EEDA"/>
</linearGradient>
<linearGradient id="paint12_linear_3673_7903" x1="574.132" y1="109.135" x2="86.9354" y2="596.332" gradientUnits="userSpaceOnUse">
<stop stop-color="#4AFEBF"/>
<stop offset="1" stop-color="#51EEDA"/>
</linearGradient>
<linearGradient id="paint13_linear_3673_7903" x1="574.132" y1="109.135" x2="86.9354" y2="596.332" gradientUnits="userSpaceOnUse">
<stop stop-color="#4AFEBF"/>
<stop offset="1" stop-color="#51EEDA"/>
</linearGradient>
<linearGradient id="paint14_linear_3673_7903" x1="574.132" y1="109.135" x2="86.9354" y2="596.332" gradientUnits="userSpaceOnUse">
<stop stop-color="#4AFEBF"/>
<stop offset="1" stop-color="#51EEDA"/>
</linearGradient>
<linearGradient id="paint15_linear_3673_7903" x1="574.132" y1="109.135" x2="86.9354" y2="596.332" gradientUnits="userSpaceOnUse">
<stop stop-color="#4AFEBF"/>
<stop offset="1" stop-color="#51EEDA"/>
</linearGradient>
<linearGradient id="paint16_linear_3673_7903" x1="574.132" y1="109.135" x2="86.9354" y2="596.332" gradientUnits="userSpaceOnUse">
<stop stop-color="#4AFEBF"/>
<stop offset="1" stop-color="#51EEDA"/>
</linearGradient>
<linearGradient id="paint17_linear_3673_7903" x1="574.132" y1="109.135" x2="86.9354" y2="596.332" gradientUnits="userSpaceOnUse">
<stop stop-color="#4AFEBF"/>
<stop offset="1" stop-color="#51EEDA"/>
</linearGradient>
<linearGradient id="paint18_linear_3673_7903" x1="574.132" y1="109.135" x2="86.9354" y2="596.332" gradientUnits="userSpaceOnUse">
<stop stop-color="#4AFEBF"/>
<stop offset="1" stop-color="#51EEDA"/>
</linearGradient>
<linearGradient id="paint19_linear_3673_7903" x1="574.132" y1="109.135" x2="86.9354" y2="596.332" gradientUnits="userSpaceOnUse">
<stop stop-color="#4AFEBF"/>
<stop offset="1" stop-color="#51EEDA"/>
</linearGradient>
<linearGradient id="paint20_linear_3673_7903" x1="574.132" y1="109.135" x2="86.9354" y2="596.332" gradientUnits="userSpaceOnUse">
<stop stop-color="#4AFEBF"/>
<stop offset="1" stop-color="#51EEDA"/>
</linearGradient>
<linearGradient id="paint21_linear_3673_7903" x1="574.132" y1="109.135" x2="86.9354" y2="596.332" gradientUnits="userSpaceOnUse">
<stop stop-color="#4AFEBF"/>
<stop offset="1" stop-color="#51EEDA"/>
</linearGradient>
<linearGradient id="paint22_linear_3673_7903" x1="574.132" y1="109.135" x2="86.9354" y2="596.332" gradientUnits="userSpaceOnUse">
<stop stop-color="#4AFEBF"/>
<stop offset="1" stop-color="#51EEDA"/>
</linearGradient>
<linearGradient id="paint23_linear_3673_7903" x1="574.132" y1="109.135" x2="86.9354" y2="596.332" gradientUnits="userSpaceOnUse">
<stop stop-color="#4AFEBF"/>
<stop offset="1" stop-color="#51EEDA"/>
</linearGradient>
<linearGradient id="paint24_linear_3673_7903" x1="574.132" y1="109.135" x2="86.9354" y2="596.332" gradientUnits="userSpaceOnUse">
<stop stop-color="#4AFEBF"/>
<stop offset="1" stop-color="#51EEDA"/>
</linearGradient>
<linearGradient id="paint25_linear_3673_7903" x1="574.132" y1="109.135" x2="86.9354" y2="596.332" gradientUnits="userSpaceOnUse">
<stop stop-color="#4AFEBF"/>
<stop offset="1" stop-color="#51EEDA"/>
</linearGradient>
<linearGradient id="paint26_linear_3673_7903" x1="574.132" y1="109.135" x2="86.9354" y2="596.332" gradientUnits="userSpaceOnUse">
<stop stop-color="#4AFEBF"/>
<stop offset="1" stop-color="#51EEDA"/>
</linearGradient>
<linearGradient id="paint27_linear_3673_7903" x1="574.132" y1="109.135" x2="86.9354" y2="596.332" gradientUnits="userSpaceOnUse">
<stop stop-color="#4AFEBF"/>
<stop offset="1" stop-color="#51EEDA"/>
</linearGradient>
<linearGradient id="paint28_linear_3673_7903" x1="574.132" y1="109.135" x2="86.9354" y2="596.332" gradientUnits="userSpaceOnUse">
<stop stop-color="#4AFEBF"/>
<stop offset="1" stop-color="#51EEDA"/>
</linearGradient>
<linearGradient id="paint29_linear_3673_7903" x1="574.132" y1="109.135" x2="86.9354" y2="596.332" gradientUnits="userSpaceOnUse">
<stop stop-color="#4AFEBF"/>
<stop offset="1" stop-color="#51EEDA"/>
</linearGradient>
<linearGradient id="paint30_linear_3673_7903" x1="574.132" y1="109.135" x2="86.9354" y2="596.332" gradientUnits="userSpaceOnUse">
<stop stop-color="#4AFEBF"/>
<stop offset="1" stop-color="#51EEDA"/>
</linearGradient>
<linearGradient id="paint31_linear_3673_7903" x1="574.132" y1="109.135" x2="86.9354" y2="596.332" gradientUnits="userSpaceOnUse">
<stop stop-color="#4AFEBF"/>
<stop offset="1" stop-color="#51EEDA"/>
</linearGradient>
</defs>
</svg>
