{
	"INFO_MESSAGES": [
	],
	"CHAIN_SPECIFIC_DATA": [



		{
			"chainId": 11155111,
			"INFO_MESSAGES": []
		},

		{
			"chainId": 1
		},

		{
			"chainId": 56
		},

		{
			"chainId": 137
		},

		{
			"chainId": 66
		},

		{
			"chainId": 1313161554
		},

		{
			"chainId": 42161
		},

		{
			"chainId": 324
		},

		{
			"chainId": 81457,
			"pointsContract": [
				"0xd3807CE2F215DC42ca4bfA616B16C20b0B195128",
				"0x263FADaCA09467A69dF90366979D9De79a575fA8",
				"0x2333615f43f898cD4368513fa59b0fDcF945f492"
			],
			"pointsTypeNames": [
				"PHASE2_POINTS"
			]
		}

	],

	"navigationLinks": [
		{
			"name": "Wrapper",
			"description" : "",
			"url": "",
			"active": true,
			"local": false,
			"newTab": false,
			"children": [
				{
					"name": "Dashboard",
					"description": "View all of your NFTs",
					"url": "/dashboard",
					"active": true,
					"local": false,
					"newTab": false,
					"children": []
				},
				{
					"name": "Wrap wNFT",
					"description" : "Create new wNFT",
					"url": "/wrap",
					"active": false,
					"local": false,
					"newTab": false,
					"children": []
				}
			]
		},
		{
			"name": "Mint",
			"description" : "",
			"url": "/mintnew",
			"active": false,
			"local": false,
			"newTab": false,
			"children": [],
			"showInChains": [ 5, 11155111, 1, 137, 56, 42161, 168587773, 81457 ]
		},
		{
			"name": "SAFT",
			"description" : "",
			"url": "/saft",
			"active": false,
			"local": false,
			"newTab": false,
			"children": [],
			"showInChains": [ 5, 11155111, 1, 137, 56, 42161, 81457 ]
		},
		{
			"name": "Farming",
			"description" : "",
			"url": "https://appv0.envelop.is/farming/",
			"active": false,
			"local": false,
			"newTab": true,
			"children": [],
			"showInChains": [ 1, 56, 137 ],
			"auxStyle": { "color": "#999" }
		},
		{
			"name": "Showcases",
			"description" : "",
			"url": "/launchpad_admin",
			"active": false,
			"local": false,
			"newTab": false,
			"children": [],
			"showInChains": [ 11155111, 137, 81457, 42161, 56 ]
		}
	],
	"defaultChain": 1
}
