<svg width="24" height="24" viewBox="0 0 24 24" fill="none" xmlns="http://www.w3.org/2000/svg">
<g clip-path="url(#clip0_1368_3709)">
<circle cx="12" cy="12" r="12" fill="#D15951"/>
<path fill-rule="evenodd" clip-rule="evenodd" d="M10.3196 6.43867L5.76519 14.7434C5.75914 14.7544 5.75281 14.7653 5.74622 14.776C5.52469 15.136 5.47668 15.4106 5.5303 15.5952C5.77027 16.4216 6.53361 17.0245 7.43579 17.0245H16.5642C17.4664 17.0245 18.2297 16.4216 18.4697 15.5952C18.5233 15.4106 18.4753 15.136 18.2538 14.776C18.2472 14.7653 18.2409 14.7544 18.2348 14.7434L13.6804 6.43867C12.9036 5.19958 11.0964 5.19958 10.3196 6.43867ZM9.02498 5.66243C10.389 3.44585 13.611 3.44586 14.975 5.66244C14.9816 5.67315 14.9879 5.68403 14.994 5.69507L19.5496 14.0019C19.8555 14.5047 20.1457 15.2362 19.9192 16.0161C19.497 17.47 18.1558 18.5338 16.5642 18.5338H7.43579C5.84417 18.5338 4.50299 17.47 4.08082 16.0161C3.85435 15.2362 4.14445 14.5047 4.45039 14.0019L9.00601 5.69507C9.01206 5.68403 9.01838 5.67315 9.02498 5.66243ZM12 7.59351C12.4168 7.59351 12.7547 7.93138 12.7547 8.34818V11.9996C12.7547 12.4163 12.4168 12.7542 12 12.7542C11.5832 12.7542 11.2453 12.4163 11.2453 11.9996V8.34818C11.2453 7.93138 11.5832 7.59351 12 7.59351ZM12 13.9513C12.4168 13.9513 12.7547 14.2892 12.7547 14.706V14.7381C12.7547 15.1549 12.4168 15.4928 12 15.4928C11.5832 15.4928 11.2453 15.1549 11.2453 14.7381V14.706C11.2453 14.2892 11.5832 13.9513 12 13.9513Z" fill="white"/>
</g>
<defs>
<clipPath id="clip0_1368_3709">
<rect width="24" height="24" fill="white"/>
</clipPath>
</defs>
</svg>
