<svg width="24" height="24" viewBox="0 0 24 24" fill="none" xmlns="http://www.w3.org/2000/svg">
<path d="M10.668 18.0437L10.6571 18.0612C10.3211 18.6492 10.1509 18.947 9.91525 19.1717C9.65998 19.4161 9.35016 19.5972 9.0098 19.6965C8.70107 19.7826 8.35525 19.7826 7.66362 19.7826H4.72144C4.10398 19.7826 3.79853 19.7826 3.61198 19.6626C3.5138 19.5987 3.43204 19.5125 3.37329 19.4111C3.31455 19.3098 3.28046 19.196 3.2738 19.079C3.26289 18.8597 3.41562 18.5914 3.72107 18.0546L10.9833 5.25281C11.292 4.70954 11.4491 4.43681 11.6454 4.33645C11.7505 4.28299 11.8668 4.25513 11.9847 4.25513C12.1026 4.25513 12.2189 4.28299 12.324 4.33645C12.5203 4.43572 12.6774 4.70736 12.9862 5.25281L14.4796 7.86009L14.4873 7.87209C14.8211 8.45572 14.9902 8.75245 15.0643 9.06118C15.1463 9.40177 15.1463 9.75695 15.0643 10.0975C14.9891 10.4095 14.8222 10.7085 14.484 11.2997L10.668 18.0437ZM20.7665 19.0714C20.7608 19.1894 20.727 19.3044 20.668 19.4069C20.609 19.5093 20.5265 19.5962 20.4273 19.6605C20.2396 19.7826 19.9276 19.7826 19.3069 19.7826H15.0916C14.4698 19.7826 14.1567 19.7826 13.9745 19.6637C13.8759 19.5989 13.7938 19.5118 13.7348 19.4095C13.6759 19.3072 13.6418 19.1925 13.6353 19.0746C13.6243 18.8565 13.7771 18.5914 14.0858 18.0601L14.0934 18.0481L16.1967 14.4372C16.5065 13.9037 16.6625 13.6397 16.8567 13.5383C16.961 13.4852 17.0763 13.4575 17.1933 13.4575C17.3102 13.4575 17.4256 13.4852 17.5298 13.5383C17.7218 13.6365 17.8723 13.8895 18.1691 14.3914L18.1931 14.4317L20.304 18.0426L20.3345 18.095C20.6269 18.6012 20.7763 18.8586 20.7665 19.0714Z" fill="#979797"/>
</svg>
