<svg width="33" height="33" viewBox="0 0 33 33" fill="none" xmlns="http://www.w3.org/2000/svg">
<path fill-rule="evenodd" clip-rule="evenodd" d="M16.4922 1.5C14.4697 1.5 12.5099 1.89216 10.6555 2.67612C8.87548 3.43037 7.2617 4.51629 5.88899 5.88899C4.51626 7.26173 3.43031 8.87556 2.67606 10.6556L2.67565 10.6566C1.89249 12.494 1.5 14.4688 1.5 16.4922C1.5 18.5154 1.89243 20.492 2.66197 22.3479L2.66693 22.3599C2.7012 22.449 2.73539 22.5319 2.77211 22.6161H6.29145C5.21306 20.8267 4.59904 18.7402 4.59904 16.5078C4.59904 9.95059 9.93501 4.61462 16.4922 4.61462H25.6506C24.6314 3.82723 23.5181 3.18097 22.3285 2.67593C20.4911 1.89277 18.5156 1.5 16.4922 1.5ZM10.2658 1.75515C12.2454 0.918259 14.3378 0.5 16.4922 0.5C18.6456 0.5 20.754 0.917889 22.7193 1.75548C24.423 2.47874 25.9842 3.4763 27.3529 4.74838L28.285 5.61462H16.4922C10.4873 5.61462 5.59904 10.5029 5.59904 16.5078C5.59904 18.8627 6.34374 21.0369 7.62511 22.8249L8.19217 23.6161H2.12955L1.99549 23.3256C1.9025 23.1242 1.81926 22.9415 1.73578 22.725C1.7366 22.727 1.73741 22.729 1.73823 22.7309L2.2001 22.5394L1.73343 22.7189C1.73421 22.721 1.735 22.723 1.73578 22.725C0.917195 20.7486 0.5 18.6438 0.5 16.4922C0.5 14.3387 0.917925 12.2302 1.75559 10.2648C2.5599 8.36685 3.7182 6.64558 5.18189 5.18189C6.64575 3.71803 8.36763 2.55947 10.2658 1.75515ZM30.8472 9.39925L30.9895 9.66015C31.0805 9.82694 31.1596 10.0201 31.2235 10.1763C31.2368 10.2088 31.2495 10.2397 31.2614 10.2684C31.7594 11.457 32.1129 12.6782 32.3219 13.9486L32.3228 13.9538C32.4504 14.7835 32.5312 15.6355 32.5312 16.5079C32.5312 18.6611 32.1133 20.7694 31.2759 22.7347C30.4715 24.6329 29.3131 26.3544 27.8493 27.8182C26.3854 29.2821 24.6639 30.4405 22.7657 31.2448C20.7861 32.0817 18.6933 32.5001 16.539 32.5001C14.3858 32.5001 12.2776 32.0823 10.3124 31.2449C8.59114 30.5208 7.04567 29.5226 5.67824 28.2517L4.74621 27.3855H16.539C22.5439 27.3855 27.4321 22.4972 27.4321 16.4923C27.4321 15.8249 27.3706 15.1567 27.2561 14.5142H17.0546V14.5298H16.5546C15.4456 14.5298 14.5609 15.4261 14.5609 16.5235C14.5609 17.623 15.4477 18.5172 16.539 18.5172H23.4108L23.1265 19.2076C22.7754 20.0604 22.2563 20.8647 21.5682 21.5528C20.2253 22.8957 18.445 23.6163 16.539 23.6163C14.6461 23.6163 12.851 22.8784 11.5097 21.5372C10.1694 20.1968 9.43064 18.4177 9.43064 16.5235C9.43064 14.6306 10.1685 12.8355 11.5097 11.4942C12.8504 10.1536 14.6295 9.41531 16.5384 9.41516M16.5384 9.41516L30.8472 9.39925ZM16.0546 13.5711V13.5142H28.0708L28.1559 13.9088C28.3347 14.7374 28.4321 15.6144 28.4321 16.4923C28.4321 23.0495 23.0962 28.3855 16.539 28.3855H7.37823C8.39417 29.1732 9.5015 29.819 10.7011 30.3235L10.7034 30.3245C12.5408 31.1076 14.5156 31.5001 16.539 31.5001C18.5615 31.5001 20.5212 31.108 22.3756 30.324C24.1556 29.5698 25.7694 28.4838 27.1422 27.1111C28.5149 25.7384 29.6009 24.1245 30.3551 22.3445L30.3555 22.3435C31.1387 20.5061 31.5312 18.5313 31.5312 16.5079C31.5312 15.6979 31.4562 14.8986 31.3348 14.1083C31.1385 12.9171 30.8067 11.771 30.3387 10.6539C30.3217 10.613 30.3052 10.5728 30.2897 10.535C30.2702 10.4877 30.2517 10.4428 30.2337 10.3999L16.5395 10.4152C14.8951 10.4152 13.3697 11.0484 12.2168 12.2013C11.0644 13.3538 10.4306 14.894 10.4306 16.5235C10.4306 18.1517 11.0635 19.6767 12.2168 20.8301C13.3693 21.9825 14.9095 22.6163 16.539 22.6163C18.1865 22.6163 19.7104 21.9964 20.8611 20.8457C21.2627 20.4441 21.5982 19.9953 21.8672 19.5172H16.539C14.8872 19.5172 13.5609 18.1671 13.5609 16.5235C13.5609 15.0464 14.6311 13.809 16.0546 13.5711Z" fill="#7FC7FF"/>
</svg>
