<svg width="24" height="24" viewBox="0 0 24 24" fill="none" xmlns="http://www.w3.org/2000/svg">
<g clip-path="url(#clip0_1095_4038)">
<path fill-rule="evenodd" clip-rule="evenodd" d="M12 24C18.6274 24 24 18.6274 24 12C24 5.37258 18.6274 0 12 0C5.37258 0 0 5.37258 0 12C0 18.6274 5.37258 24 12 24ZM8.50086 15.1872C7.78566 15.1872 7.20006 15.0192 6.74406 14.6832C6.29286 14.3424 6.06726 13.8528 6.06726 13.224C6.06726 13.0896 6.08166 12.9312 6.11046 12.7392C6.18726 12.3072 6.29766 11.7888 6.44166 11.1792C6.84966 9.52799 7.90566 8.70239 9.60486 8.70239C10.0657 8.70239 10.4833 8.77919 10.8481 8.93759C11.2129 9.08639 11.5009 9.31679 11.7121 9.62399C11.9233 9.92639 12.0289 10.2864 12.0289 10.704C12.0289 10.8288 12.0145 10.9872 11.9857 11.1792C11.8945 11.712 11.7889 12.2352 11.6593 12.7392C11.4481 13.56 11.0881 14.1792 10.5697 14.5872C10.0561 14.9904 9.36486 15.1872 8.50086 15.1872ZM8.63046 13.8912C8.96646 13.8912 9.24966 13.7904 9.48486 13.5936C9.72486 13.3968 9.89766 13.0944 9.99846 12.6816C10.1377 12.1152 10.2433 11.6256 10.3153 11.2032C10.3393 11.0784 10.3537 10.9488 10.3537 10.8144C10.3537 10.2672 10.0705 9.99359 9.49926 9.99359C9.16326 9.99359 8.87526 10.0944 8.63526 10.2912C8.40006 10.488 8.23206 10.7904 8.13126 11.2032C8.02086 11.6064 7.91526 12.096 7.80486 12.6816C7.78086 12.8016 7.76646 12.9264 7.76646 13.0608C7.76166 13.6176 8.05446 13.8912 8.63046 13.8912ZM12.2928 15.0385C12.3312 15.0817 12.3792 15.1009 12.4464 15.1009H13.6704C13.7328 15.1009 13.7904 15.0817 13.8432 15.0385C13.9008 14.9953 13.9296 14.9425 13.944 14.8753L14.3568 12.9025H15.5712C16.3584 12.9025 16.9776 12.7393 17.4288 12.4081C17.8896 12.0769 18.192 11.5681 18.3408 10.8769C18.3744 10.7137 18.3936 10.5553 18.3936 10.4065C18.3936 9.8833 18.1872 9.4849 17.7792 9.2065C17.376 8.9329 16.8432 8.7937 16.176 8.7937H13.7808C13.7184 8.7937 13.6608 8.8129 13.608 8.8561C13.5504 8.8993 13.5168 8.9521 13.5072 9.0193L12.264 14.8753C12.2544 14.9377 12.264 14.9905 12.2928 15.0385ZM16.2912 11.4529C16.104 11.5921 15.888 11.6593 15.6336 11.6593H14.6016L14.9424 10.0465H16.0224C16.2672 10.0465 16.4448 10.0945 16.5456 10.1905C16.6464 10.2817 16.6992 10.4161 16.6992 10.5889C16.6992 10.6657 16.6896 10.7569 16.6704 10.8577C16.608 11.1169 16.4832 11.3137 16.2912 11.4529Z" fill="#979797"/>
</g>
<defs>
<clipPath id="clip0_1095_4038">
<rect width="24" height="24" fill="white"/>
</clipPath>
</defs>
</svg>
