<svg width="24" height="24" viewBox="0 0 24 24" fill="none" xmlns="http://www.w3.org/2000/svg">
<path fill-rule="evenodd" clip-rule="evenodd" d="M11.9999 3.40002C8.40281 3.40002 5.48682 6.31601 5.48682 9.91307C5.48682 10.9324 5.87529 12.1202 6.54452 13.3843C7.20694 14.6355 8.10228 15.8832 9.0173 17.0016C9.92966 18.1167 10.8448 19.0829 11.5331 19.7712C11.7043 19.9424 11.8611 20.096 11.9999 20.2301C12.1387 20.096 12.2955 19.9424 12.4667 19.7712C13.1549 19.0829 14.0701 18.1167 14.9824 17.0016C15.8974 15.8832 16.7928 14.6355 17.4552 13.3843C18.1244 12.1202 18.5129 10.9324 18.5129 9.91307C18.5129 6.31601 15.5969 3.40002 11.9999 3.40002ZM11.9999 21.6C11.3355 22.3474 11.3353 22.3473 11.3351 22.3471L11.333 22.3452L11.3279 22.3406L11.3095 22.3241C11.2938 22.31 11.2711 22.2895 11.242 22.263C11.1838 22.21 11.0997 22.1327 10.9935 22.0332C10.7811 21.8343 10.4797 21.5462 10.1188 21.1854C9.3984 20.4649 8.43528 19.4486 7.46938 18.268C6.50614 17.0907 5.52322 15.7297 4.77694 14.3201C4.03747 12.9233 3.48682 11.3981 3.48682 9.91307C3.48682 5.21144 7.29824 1.40002 11.9999 1.40002C16.7015 1.40002 20.5129 5.21144 20.5129 9.91307C20.5129 11.3981 19.9622 12.9233 19.2228 14.3201C18.4765 15.7297 17.4936 17.0907 16.5303 18.268C15.5644 19.4486 14.6013 20.4649 13.8809 21.1854C13.5201 21.5462 13.2186 21.8343 13.0062 22.0332C12.9 22.1327 12.8159 22.21 12.7577 22.263C12.7286 22.2895 12.706 22.31 12.6902 22.3241L12.6719 22.3406L12.6667 22.3452L12.6651 22.3466C12.6649 22.3468 12.6642 22.3474 11.9999 21.6ZM11.9999 21.6L12.6642 22.3474L11.9999 22.938L11.3351 22.3471L11.9999 21.6ZM12.0002 8.20018C11.227 8.20018 10.6002 8.82698 10.6002 9.60018C10.6002 10.3734 11.227 11.0002 12.0002 11.0002C12.7734 11.0002 13.4002 10.3734 13.4002 9.60018C13.4002 8.82698 12.7734 8.20018 12.0002 8.20018ZM8.60017 9.60018C8.60017 7.72241 10.1224 6.20018 12.0002 6.20018C13.8779 6.20018 15.4002 7.72241 15.4002 9.60018C15.4002 11.4779 13.8779 13.0002 12.0002 13.0002C10.1224 13.0002 8.60017 11.4779 8.60017 9.60018Z" fill="black"/>
</svg>
