<svg width="24" height="24" viewBox="0 0 24 24" fill="none" xmlns="http://www.w3.org/2000/svg">
<g clip-path="url(#clip0_1095_3999)">
<path d="M14.242 1.91992C12.2913 1.92069 10.4207 2.69624 9.04181 4.07601C7.66287 5.45579 6.88844 7.32678 6.88886 9.27748C6.88886 9.28264 6.88886 9.28756 6.88886 9.29284V9.30484C6.8941 9.39725 6.93455 9.48413 7.00189 9.54763C7.06923 9.61113 7.15834 9.64642 7.2509 9.64624H21.2329C21.3255 9.64642 21.4146 9.61113 21.4819 9.54762C21.5492 9.48412 21.5896 9.39724 21.5949 9.30484L21.5955 9.29284C21.5955 9.28756 21.5955 9.28264 21.5955 9.27748C21.5959 7.32671 20.8214 5.45567 19.4424 4.07589C18.0634 2.6961 16.1927 1.92059 14.242 1.91992Z" fill="#979797"/>
<path d="M2.02045 17.4923C2.02038 17.5808 1.99407 17.6672 1.94486 17.7408C1.89566 17.8143 1.82576 17.8716 1.74399 17.9054C1.66223 17.9392 1.57227 17.9481 1.4855 17.9308C1.39872 17.9135 1.31902 17.8708 1.25647 17.8082C1.19392 17.7457 1.15132 17.6659 1.13407 17.5792C1.11682 17.4924 1.12569 17.4024 1.15955 17.3207C1.19342 17.2389 1.25075 17.169 1.32431 17.1199C1.39788 17.0707 1.48436 17.0445 1.57285 17.0444C1.63165 17.0444 1.68987 17.056 1.7442 17.0785C1.79852 17.101 1.84787 17.134 1.88944 17.1756C1.931 17.2172 1.96396 17.2666 1.98644 17.3209C2.00892 17.3752 2.02048 17.4335 2.02045 17.4923Z" fill="#979797"/>
<path d="M20.7466 15.0151H5.74381C5.66748 15.0152 5.59249 15.0351 5.52615 15.0729C5.45982 15.1106 5.40441 15.165 5.36534 15.2305C5.32628 15.2961 5.30488 15.3707 5.30326 15.447C5.30164 15.5233 5.31984 15.5987 5.35608 15.6659C5.35848 15.6706 5.36101 15.6753 5.36353 15.6798C5.40131 15.7497 5.45731 15.8081 5.5256 15.8488C5.59388 15.8894 5.6719 15.9108 5.75136 15.9107H20.7394C20.8188 15.9108 20.8968 15.8894 20.9651 15.8487C21.0334 15.8081 21.0894 15.7497 21.1272 15.6798L21.1346 15.6659C21.1709 15.5987 21.189 15.5232 21.1874 15.4469C21.1857 15.3706 21.1643 15.296 21.1252 15.2304C21.0861 15.1649 21.0307 15.1106 20.9643 15.0728C20.8979 15.0351 20.8229 15.0152 20.7466 15.0151Z" fill="#979797"/>
<path d="M22.74 10.9558H5.74341C5.68341 10.956 5.62408 10.9683 5.56902 10.9922C5.51396 11.016 5.46434 11.0508 5.42317 11.0945C5.38201 11.1381 5.35016 11.1897 5.32958 11.246C5.30901 11.3024 5.30013 11.3623 5.30349 11.4222C5.30349 11.4269 5.30349 11.4316 5.30421 11.4363C5.31053 11.5486 5.35968 11.6543 5.44153 11.7315C5.52339 11.8087 5.63172 11.8516 5.74424 11.8514H22.74C22.8525 11.8516 22.9608 11.8087 23.0427 11.7315C23.1245 11.6543 23.1737 11.5486 23.18 11.4363C23.18 11.4316 23.18 11.4269 23.1807 11.4222C23.1841 11.3623 23.1752 11.3022 23.1546 11.2458C23.1339 11.1894 23.102 11.1378 23.0608 11.0942C23.0195 11.0505 22.9698 11.0157 22.9146 10.9919C22.8595 10.9681 22.8 10.9558 22.74 10.9558Z" fill="#979797"/>
<path d="M16.3405 21.1035H8.68056C8.58119 21.1036 8.48474 21.1372 8.40686 21.1989C8.32897 21.2606 8.27421 21.3468 8.25146 21.4435C8.22871 21.5403 8.2393 21.6419 8.2815 21.7318C8.32371 21.8218 8.39507 21.8949 8.484 21.9392L8.51208 21.9532C8.57311 21.9836 8.64037 21.9993 8.70852 21.9991H16.3122C16.3804 21.9993 16.4477 21.9836 16.5088 21.9532L16.5367 21.9392C16.6256 21.8949 16.697 21.8218 16.7392 21.7319C16.7814 21.642 16.792 21.5404 16.7693 21.4437C16.7466 21.347 16.6919 21.2608 16.6141 21.199C16.5363 21.1373 16.4399 21.1036 16.3405 21.1035Z" fill="#979797"/>
<path d="M21.0203 19.074H13.3605C13.2612 19.0742 13.1649 19.1078 13.0871 19.1696C13.0093 19.2313 12.9547 19.3175 12.9319 19.4142C12.9092 19.5108 12.9198 19.6123 12.9619 19.7023C13.004 19.7922 13.0753 19.8652 13.1641 19.9097L13.1921 19.9237C13.2532 19.954 13.3204 19.9696 13.3886 19.9694H20.9918C21.06 19.9696 21.1273 19.954 21.1884 19.9237L21.2163 19.9097C21.3051 19.8653 21.3764 19.7922 21.4185 19.7023C21.4606 19.6124 21.4712 19.511 21.4485 19.4143C21.4259 19.3177 21.3713 19.2315 21.2935 19.1697C21.2158 19.108 21.1195 19.0742 21.0203 19.074Z" fill="#979797"/>
<path d="M10.5757 17.7991L10.5628 17.7852C10.5044 17.7223 10.4657 17.6437 10.4513 17.5592C10.4369 17.4746 10.4476 17.3876 10.4819 17.309C10.5162 17.2303 10.5727 17.1634 10.6445 17.1164C10.7163 17.0694 10.8002 17.0444 10.886 17.0444H23.318C23.4038 17.0444 23.4878 17.0694 23.5596 17.1164C23.6314 17.1634 23.6879 17.2303 23.7222 17.309C23.7565 17.3876 23.7672 17.4746 23.7528 17.5592C23.7384 17.6437 23.6997 17.7223 23.6413 17.7852L23.6284 17.7991C23.587 17.8434 23.5369 17.8788 23.4814 17.903C23.4258 17.9272 23.3658 17.9398 23.3052 17.94H10.8989C10.8383 17.9398 10.7783 17.9272 10.7227 17.903C10.6671 17.8788 10.6171 17.8434 10.5757 17.7991Z" fill="#979797"/>
<path d="M3.17122 17.0444H9.10786C9.20716 17.0446 9.3035 17.0783 9.38128 17.14C9.45906 17.2018 9.51373 17.2879 9.53646 17.3846C9.55918 17.4813 9.54863 17.5828 9.50649 17.6727C9.46436 17.7626 9.39312 17.8357 9.30429 17.8801L9.27634 17.8942C9.21531 17.9245 9.14805 17.9402 9.07989 17.94H3.19989C3.1317 17.9402 3.0644 17.9245 3.00333 17.8942L2.97538 17.8801C2.8866 17.8357 2.81539 17.7627 2.77324 17.6728C2.7311 17.583 2.7205 17.4815 2.74314 17.3849C2.76579 17.2883 2.82036 17.2021 2.89804 17.1403C2.97572 17.0785 3.07197 17.0448 3.17122 17.0444Z" fill="#979797"/>
<path d="M4.59265 11.4035C4.5926 11.492 4.56632 11.5785 4.51713 11.6521C4.46794 11.7256 4.39804 11.7829 4.31627 11.8168C4.23451 11.8506 4.14455 11.8594 4.05777 11.8422C3.97099 11.8249 3.89128 11.7822 3.82871 11.7197C3.76615 11.6571 3.72355 11.5774 3.70629 11.4906C3.68903 11.4038 3.69788 11.3138 3.73174 11.2321C3.7656 11.1503 3.82293 11.0804 3.8965 11.0313C3.97007 10.9821 4.05657 10.9558 4.14505 10.9558C4.20384 10.9558 4.26205 10.9674 4.31637 10.9899C4.37068 11.0124 4.42003 11.0454 4.46159 11.087C4.50316 11.1285 4.53613 11.1779 4.55862 11.2322C4.5811 11.2865 4.59267 11.3447 4.59265 11.4035Z" fill="#979797"/>
<path d="M15.142 13.5542C15.1432 13.5496 15.1444 13.5448 15.1457 13.5402C15.1632 13.4749 15.1654 13.4065 15.1522 13.3402C15.139 13.2739 15.1107 13.2115 15.0695 13.1579C15.0284 13.1043 14.9754 13.0608 14.9148 13.031C14.8541 13.0011 14.7874 12.9856 14.7198 12.9856H2.28589C2.21828 12.9855 2.15156 13.001 2.0909 13.0309C2.03024 13.0608 1.97726 13.1042 1.93609 13.1578C1.89491 13.2115 1.86663 13.2738 1.85344 13.3402C1.84025 13.4065 1.84249 13.4749 1.86001 13.5402C1.86121 13.5448 1.86253 13.5496 1.86385 13.5542C1.88906 13.6478 1.94441 13.7306 2.02133 13.7896C2.09826 13.8487 2.19249 13.8808 2.28949 13.881H14.7162C14.8132 13.8808 14.9075 13.8487 14.9844 13.7896C15.0613 13.7306 15.1167 13.6478 15.142 13.5542Z" fill="#979797"/>
<path d="M1.13483 13.4333C1.13478 13.5218 1.1085 13.6083 1.0593 13.6819C1.0101 13.7554 0.940196 13.8127 0.858425 13.8466C0.776655 13.8804 0.686689 13.8892 0.599902 13.8719C0.513115 13.8546 0.433402 13.812 0.370844 13.7494C0.308287 13.6868 0.265696 13.6071 0.248449 13.5203C0.231203 13.4335 0.240077 13.3435 0.273952 13.2618C0.307828 13.18 0.365179 13.1102 0.438762 13.061C0.512344 13.0118 0.598853 12.9856 0.687346 12.9856C0.806047 12.9857 0.919862 13.0329 1.00377 13.1168C1.08769 13.2008 1.13483 13.3146 1.13483 13.4333Z" fill="#979797"/>
<path d="M4.59265 15.4629C4.5926 15.5513 4.56632 15.6378 4.51713 15.7114C4.46794 15.7849 4.39804 15.8423 4.31627 15.8761C4.23451 15.9099 4.14455 15.9188 4.05777 15.9015C3.97099 15.8842 3.89128 15.8416 3.82871 15.779C3.76615 15.7164 3.72355 15.6367 3.70629 15.5499C3.68903 15.4631 3.69788 15.3732 3.73174 15.2914C3.7656 15.2097 3.82293 15.1398 3.8965 15.0906C3.97007 15.0414 4.05657 15.0152 4.14505 15.0151C4.26378 15.0152 4.37762 15.0624 4.46156 15.1463C4.5455 15.2303 4.59265 15.3441 4.59265 15.4629Z" fill="#979797"/>
<path d="M12.2097 19.5219C12.2097 19.6104 12.1834 19.6969 12.1342 19.7705C12.085 19.844 12.0151 19.9013 11.9333 19.9352C11.8516 19.969 11.7616 19.9778 11.6748 19.9606C11.5881 19.9433 11.5083 19.9006 11.4458 19.8381C11.3832 19.7755 11.3406 19.6958 11.3234 19.609C11.3061 19.5222 11.3149 19.4322 11.3488 19.3505C11.3827 19.2687 11.44 19.1988 11.5136 19.1497C11.5871 19.1005 11.6736 19.0742 11.7621 19.0742C11.8209 19.0742 11.8791 19.0858 11.9334 19.1083C11.9877 19.1308 12.0371 19.1638 12.0787 19.2054C12.1202 19.2469 12.1532 19.2963 12.1757 19.3506C12.1982 19.4049 12.2097 19.4631 12.2097 19.5219Z" fill="#979797"/>
<path d="M7.52948 21.5515C7.52943 21.64 7.50315 21.7265 7.45395 21.8C7.40475 21.8736 7.33485 21.9309 7.25308 21.9647C7.17131 21.9986 7.08134 22.0074 6.99456 21.9901C6.90777 21.9728 6.82806 21.9302 6.7655 21.8676C6.70294 21.805 6.66035 21.7253 6.6431 21.6385C6.62586 21.5517 6.63473 21.4617 6.66861 21.3799C6.70248 21.2982 6.75984 21.2283 6.83342 21.1792C6.90701 21.13 6.99351 21.1038 7.082 21.1038C7.14078 21.1038 7.19898 21.1154 7.25328 21.1379C7.30758 21.1604 7.35692 21.1934 7.39847 21.2349C7.44002 21.2765 7.47298 21.3259 7.49546 21.3802C7.51794 21.4345 7.5295 21.4927 7.52948 21.5515Z" fill="#979797"/>
</g>
<defs>
<clipPath id="clip0_1095_3999">
<rect width="24" height="24" fill="white"/>
</clipPath>
</defs>
</svg>
