<svg width="24" height="24" viewBox="0 0 24 24" fill="none" xmlns="http://www.w3.org/2000/svg">
<g clip-path="url(#clip0_1095_3655)">
<path d="M11.9437 17.97L4.57947 13.62L11.9422 24L19.3125 13.62L11.9437 17.97ZM12.0562 1.75782e-05L4.69047 12.2228L12.0555 16.5765L19.4205 12.2265L12.0562 -0.000732422V1.75782e-05Z" fill="white"/>
</g>
<defs>
<clipPath id="clip0_1095_3655">
<rect width="24" height="24" fill="white"/>
</clipPath>
</defs>
</svg>
