<svg width="46" height="46" viewBox="0 0 46 46" fill="none" xmlns="http://www.w3.org/2000/svg">
<circle cx="23" cy="23" r="22.5" fill="#D0DEF5" stroke="#2952E1"/>
<path d="M13.8488 10.7393H33.617C35.2746 10.7393 36.6183 12.083 36.6183 13.7407V32.2596C36.6183 33.9172 35.2745 35.261 33.6169 35.261H13.8488C12.8221 35.261 11.9897 34.4287 11.9897 33.4019V32.0857V31.224V14.7763V13.9146V12.5983C11.9897 11.5716 12.8221 10.7393 13.8488 10.7393Z" fill="#2952E1"/>
<path d="M10.3478 10.7393H30.116C31.7736 10.7393 33.1174 12.083 33.1174 13.7407V32.2596C33.1174 33.9172 31.7736 35.261 30.1159 35.261H10.3478C9.32113 35.261 8.48877 34.4287 8.48877 33.4019V32.0857V31.224V14.7763V13.9146V12.5983C8.48877 11.5716 9.32113 10.7393 10.3478 10.7393Z" fill="#496EF1"/>
<path d="M28.4451 23.0001C28.4451 21.0827 29.9994 19.5283 31.9168 19.5283H37.3534C39.2708 19.5283 40.8251 21.0827 40.8251 23.0001V23.0001C40.8251 24.9174 39.2708 26.4718 37.3534 26.4718H31.9168C29.9994 26.4718 28.4451 24.9174 28.4451 23.0001V23.0001Z" fill="#11319F"/>
<path d="M31.8592 25.0632C32.9988 25.0632 33.9226 24.1394 33.9226 22.9999C33.9226 21.8603 32.9988 20.9365 31.8592 20.9365C30.7197 20.9365 29.7959 21.8603 29.7959 22.9999C29.7959 24.1394 30.7197 25.0632 31.8592 25.0632Z" fill="#D0DEF5"/>
</svg>
