<svg width="24" height="24" viewBox="0 0 24 24" fill="none" xmlns="http://www.w3.org/2000/svg">
<path d="M16.8611 8.60731C16.5207 8.40003 16.0832 8.40003 15.6938 8.60731L12.972 10.3168L11.1251 11.4044L8.45125 13.1139C8.11088 13.3211 7.67343 13.3211 7.28397 13.1139L5.19379 11.7666C5.01269 11.6492 4.86421 11.4879 4.76216 11.2978C4.66012 11.1076 4.60783 10.8947 4.61015 10.6789V8.08913C4.61015 7.67458 4.80543 7.26003 5.19379 7.00149L7.28397 5.70658C7.62434 5.49931 8.06179 5.49931 8.45125 5.70658L10.5414 7.05385C10.8818 7.26113 11.1251 7.67567 11.1251 8.14149V9.85094L12.972 8.71094V6.95022C12.972 6.53567 12.7778 6.12113 12.3883 5.86258L8.49924 3.42767C8.15888 3.2204 7.72143 3.2204 7.33197 3.42767L3.34688 5.91494C2.95743 6.12222 2.76324 6.53676 2.76324 6.95022V11.8189C2.76324 12.2335 2.95743 12.648 3.34688 12.9066L7.28506 15.3404C7.62434 15.5477 8.06179 15.5477 8.45125 15.3404L11.124 13.6833L12.972 12.5444L15.6447 10.8862C15.9862 10.6789 16.4236 10.6789 16.812 10.8862L18.9022 12.1811C19.2425 12.3884 19.4858 12.8029 19.4858 13.2688V15.8586C19.4858 16.2731 19.2916 16.6877 18.9022 16.9462L16.8611 18.2411C16.5207 18.4484 16.0832 18.4484 15.6938 18.2411L13.6036 16.9462C13.4225 16.8288 13.274 16.6676 13.172 16.4774C13.0699 16.2873 13.0176 16.0744 13.02 15.8586V14.2004L11.1731 15.3404V17.0499C11.1731 17.4644 11.3672 17.8789 11.7567 18.1375L15.6949 20.5724C16.0342 20.7797 16.4716 20.7797 16.8611 20.5724L20.7992 18.1375C21.1385 17.9302 21.3818 17.5157 21.3818 17.0499V12.1299C21.3818 11.7153 21.1876 11.3008 20.7982 11.0422L16.86 8.60731H16.8611Z" fill="#979797"/>
</svg>
