<svg width="24" height="24" viewBox="0 0 24 24" fill="none" xmlns="http://www.w3.org/2000/svg">
<g clip-path="url(#clip0_1095_3788)">
<path d="M5.01421 11.27C4.96358 11.3505 4.93543 11.4431 4.9327 11.5382C4.92997 11.6333 4.95275 11.7274 4.99868 11.8106C5.04461 11.8939 5.112 11.9634 5.19387 12.0118C5.27573 12.0602 5.36906 12.0858 5.46417 12.086H11.5431C11.5887 12.0858 11.6336 12.0978 11.6729 12.1208C11.7123 12.1438 11.7448 12.1769 11.767 12.2167C11.7892 12.2566 11.8003 12.3016 11.7992 12.3472C11.7981 12.3928 11.7848 12.4372 11.7606 12.4759L5.79414 22.0286C5.7793 22.0532 5.75964 22.0745 5.73634 22.0913C5.71303 22.1081 5.68658 22.12 5.65855 22.1263C5.63053 22.1326 5.60152 22.1332 5.57327 22.128C5.54502 22.1228 5.51811 22.112 5.49417 22.0961C3.34455 20.7074 1.69459 18.6685 0.784773 16.2766C-0.125048 13.8846 -0.247181 11.2646 0.436172 8.79835C1.11953 6.33211 2.57265 4.14857 4.58376 2.56595C6.59488 0.983329 9.05887 0.0843466 11.6166 2.1023e-05C11.6545 -0.000513235 11.6919 0.00914418 11.7247 0.0279833C11.7576 0.0468224 11.7848 0.0741509 11.8035 0.10711C11.8223 0.14007 11.8318 0.17745 11.8311 0.21534C11.8304 0.253229 11.8195 0.290237 11.7996 0.322493L5.01421 11.27ZM18.723 2.05334C18.6994 2.03692 18.6726 2.02553 18.6444 2.01987C18.6162 2.01422 18.5872 2.01442 18.559 2.02047C18.5309 2.02652 18.5043 2.03828 18.4809 2.05503C18.4575 2.07178 18.4378 2.09316 18.423 2.11784L12.5481 11.5295C12.524 11.5681 12.5107 11.6124 12.5095 11.6579C12.5083 11.7033 12.5193 11.7483 12.5413 11.788C12.5633 11.8278 12.5956 11.861 12.6348 11.8841C12.6739 11.9072 12.7186 11.9194 12.764 11.9195H18.843C18.9381 11.9196 19.0314 11.9452 19.1133 11.9936C19.1952 12.0421 19.2626 12.1115 19.3085 12.1948C19.3544 12.2781 19.3772 12.3722 19.3745 12.4672C19.3717 12.5623 19.3436 12.6549 19.293 12.7354L12.4206 23.7414C12.4042 23.7674 12.3952 23.7973 12.3946 23.828C12.3941 23.8586 12.402 23.8889 12.4175 23.9153C12.433 23.9418 12.4554 23.9635 12.4824 23.9781C12.5094 23.9927 12.5399 23.9995 12.5705 23.9979C15.0887 23.8759 17.5046 22.9645 19.4759 21.393C21.4473 19.8215 22.8742 17.6696 23.5545 15.242C24.2348 12.8144 24.1339 10.2343 23.2662 7.86727C22.3985 5.5002 20.808 3.46617 18.72 2.05334H18.723Z" fill="white"/>
</g>
<defs>
<clipPath id="clip0_1095_3788">
<rect width="24" height="24" fill="white"/>
</clipPath>
</defs>
</svg>
