<svg width="24" height="24" viewBox="0 0 24 24" fill="none" xmlns="http://www.w3.org/2000/svg">
<path d="M16.8508 2.69401C19.5741 3.88549 21.4465 6.77909 21.2763 9.67269C16.3401 9.67269 11.404 9.67269 6.63806 9.67269C6.63806 7.80036 7.31891 5.75782 8.6806 4.39613C10.5529 2.01316 14.1274 1.33232 16.8508 2.69401Z" fill="#979797"/>
<path d="M16.5106 21.2473C16.851 21.2473 17.0212 21.4175 17.0212 21.5877C17.0212 21.7579 16.851 21.9282 16.5106 21.9282H8.68086C8.34044 21.9282 8.17023 21.7579 8.17023 21.5877C8.17023 21.4175 8.34044 21.2473 8.68086 21.2473H16.5106Z" fill="#979797"/>
<path d="M6.97877 22.0982C7.3192 22.0982 7.48941 21.928 7.48941 21.5875C7.48941 21.2471 7.3192 21.0769 6.97877 21.0769C6.63835 21.0769 6.46814 21.2471 6.46814 21.5875C6.46814 21.928 6.63835 22.0982 6.97877 22.0982Z" fill="#979797"/>
<path d="M11.7448 20.0557C12.0852 20.0557 12.2554 19.8855 12.2554 19.5451C12.2554 19.2046 12.0852 19.0344 11.7448 19.0344C11.4043 19.0344 11.2341 19.2046 11.2341 19.5451C11.2341 19.8855 11.4043 20.0557 11.7448 20.0557Z" fill="#979797"/>
<path d="M20.936 19.0344C21.2764 19.0344 21.4467 19.2046 21.4467 19.5451C21.4467 19.8855 21.2764 20.0557 20.936 20.0557H13.2765C12.9361 20.0557 12.7659 19.8855 12.7659 19.5451C12.7659 19.2046 12.9361 19.0344 13.2765 19.0344H20.936Z" fill="#979797"/>
<path d="M1.53206 18.0132C1.87248 18.0132 2.04269 17.843 2.04269 17.5026C2.04269 17.1622 1.87248 16.9919 1.53206 16.9919C1.19163 16.9919 1.02142 17.1622 1.02142 17.5026C1.02142 17.843 1.36185 18.0132 1.53206 18.0132Z" fill="#979797"/>
<path d="M9.19128 16.9919C9.5317 16.9919 9.70191 17.1622 9.70191 17.5026C9.70191 17.843 9.5317 18.0132 9.19128 18.0132H2.89345C2.55302 18.0132 2.38281 17.843 2.38281 17.5026C2.38281 17.1622 2.55302 16.9919 2.89345 16.9919H9.19128Z" fill="#979797"/>
<path d="M23.4893 16.9919C23.8298 16.9919 24 17.1622 24 17.5026C24 17.843 23.8298 18.0132 23.4893 18.0132H10.8937C10.5533 18.0132 10.3831 17.843 10.3831 17.5026C10.3831 17.1622 10.5533 16.9919 10.8937 16.9919H23.4893Z" fill="#979797"/>
<path d="M21.1062 14.9495C21.4466 14.9495 21.6168 15.1197 21.6168 15.4601C21.6168 15.8005 21.4466 15.9707 21.1062 15.9707H5.61696C5.44675 16.1409 5.10632 15.8005 5.10632 15.4601C5.10632 15.1197 5.27653 14.9495 5.61696 14.9495H21.1062Z" fill="#979797"/>
<path d="M3.91487 16.1409C4.25529 16.1409 4.42551 15.9707 4.42551 15.6303C4.42551 15.2899 4.25529 14.9495 3.91487 14.9495C3.57445 14.9495 3.40424 15.2899 3.40424 15.4601C3.40424 15.6303 3.57445 16.1409 3.91487 16.1409Z" fill="#979797"/>
<path d="M17.8724 13.0771C18.2128 13.0771 18.383 13.2474 18.383 13.5878C18.383 13.9282 18.2128 14.0984 17.8724 14.0984H2.38313C2.21292 14.0984 1.8725 13.9282 1.8725 13.5878C1.8725 13.2474 2.04271 13.0771 2.38313 13.0771H17.8724Z" fill="#979797"/>
<path d="M0.510635 14.0984C0.851058 14.0984 1.02127 13.9282 1.02127 13.5878C1.02127 13.2474 0.851058 13.0771 0.510635 13.0771C0.170212 13.0771 0 13.2474 0 13.5878C0 13.9282 0.170212 14.0984 0.510635 14.0984Z" fill="#979797"/>
<path d="M3.91487 12.0559C4.25529 12.0559 4.42551 11.8857 4.42551 11.5453C4.42551 11.2049 4.25529 11.0347 3.91487 11.0347C3.57445 11.0347 3.40424 11.3751 3.40424 11.5453C3.40424 11.8857 3.57445 12.0559 3.91487 12.0559Z" fill="#979797"/>
<path d="M22.6383 11.0347C22.9787 11.0347 23.149 11.2049 23.149 11.5453C23.149 11.8857 22.9787 12.0559 22.6383 12.0559H5.78737C5.44695 12.0559 5.27673 11.8857 5.27673 11.5453C5.27673 11.2049 5.44695 11.0347 5.78737 11.0347H22.6383Z" fill="#979797"/>
</svg>
