<svg width="24" height="24" viewBox="0 0 24 24" fill="none" xmlns="http://www.w3.org/2000/svg">
<g clip-path="url(#clip0_1095_4115)">
<path d="M6.57662 12.008C6.5532 12.4358 6.70018 12.8554 6.98541 13.175C7.27064 13.4947 7.67088 13.6883 8.09854 13.7136C8.1299 13.7136 8.16254 13.7136 8.19198 13.7136C8.50789 13.7134 8.8168 13.6206 9.08055 13.4467C9.34431 13.2729 9.55135 13.0255 9.67608 12.7353C9.80082 12.4451 9.8378 12.1247 9.78244 11.8136C9.72707 11.5026 9.58181 11.2147 9.36458 10.9853C9.14735 10.7559 8.86769 10.5952 8.56014 10.5231C8.25259 10.4509 7.93064 10.4704 7.63406 10.5792C7.33748 10.688 7.07928 10.8813 6.89135 11.1352C6.70342 11.3892 6.59401 11.6926 6.57662 12.008Z" fill="#979797"/>
<path d="M0.551663 11.592C0.448552 11.5862 0.346041 11.6111 0.25709 11.6636C0.168139 11.7161 0.096742 11.7937 0.0519242 11.8868C0.00710633 11.9798 -0.00911969 12.0841 0.00529737 12.1863C0.0197144 12.2886 0.0641272 12.3843 0.132921 12.4613C0.201715 12.5383 0.291801 12.5932 0.391792 12.6191C0.491782 12.6449 0.597186 12.6405 0.69468 12.6064C0.792173 12.5724 0.877379 12.5102 0.939524 12.4277C1.00167 12.3452 1.03797 12.2461 1.04382 12.143C1.0478 12.0745 1.03821 12.0059 1.01561 11.9411C0.993015 11.8763 0.957846 11.8165 0.912124 11.7654C0.866402 11.7142 0.811026 11.6725 0.749171 11.6428C0.687316 11.613 0.620197 11.5958 0.551663 11.592Z" fill="#979797"/>
<path d="M6.47422 2.62752C6.56613 2.58072 6.64212 2.50776 6.69262 2.41783C6.74311 2.3279 6.76585 2.22504 6.75797 2.12221C6.75008 2.01938 6.71193 1.92118 6.64831 1.84001C6.5847 1.75883 6.49847 1.6983 6.40051 1.66607C6.30254 1.63383 6.19722 1.63131 6.09783 1.65885C5.99844 1.68638 5.90943 1.74273 5.84202 1.82078C5.77461 1.89883 5.73181 1.9951 5.71904 2.09743C5.70626 2.19977 5.72407 2.3036 5.77022 2.39584C5.80118 2.45732 5.84396 2.5121 5.89612 2.55703C5.94827 2.60197 6.00878 2.63617 6.07417 2.65769C6.13956 2.67921 6.20856 2.68762 6.2772 2.68245C6.34585 2.67727 6.4128 2.6586 6.47422 2.62752Z" fill="#979797"/>
<path d="M8.1139 5.4864C8.25641 5.41455 8.37442 5.30206 8.45301 5.16316C8.5316 5.02425 8.56724 4.86516 8.55542 4.706C8.54361 4.54684 8.48486 4.39476 8.38662 4.26898C8.28838 4.1432 8.15506 4.04938 8.0035 3.99936C7.85194 3.94935 7.68895 3.9454 7.53515 3.988C7.38134 4.03061 7.24363 4.11786 7.1394 4.23873C7.03518 4.3596 6.96913 4.50865 6.94962 4.66705C6.9301 4.82545 6.95798 4.98608 7.02974 5.12864C7.12615 5.31977 7.29449 5.46481 7.49778 5.53189C7.70107 5.59898 7.92267 5.58261 8.1139 5.4864Z" fill="#979797"/>
<path d="M2.5971 7.45248C2.70713 7.52456 2.83605 7.56239 2.96758 7.56119C3.09911 7.56 3.22732 7.51982 3.33601 7.44574C3.4447 7.37166 3.52898 7.26702 3.57819 7.14503C3.6274 7.02305 3.63933 6.88922 3.61246 6.76046C3.5856 6.6317 3.52116 6.5138 3.42728 6.42167C3.3334 6.32954 3.21431 6.26732 3.08507 6.24288C2.95583 6.21844 2.82224 6.23288 2.70121 6.28437C2.58017 6.33586 2.47713 6.42209 2.4051 6.53216C2.30857 6.67967 2.27457 6.85949 2.31057 7.03206C2.34658 7.20464 2.44964 7.35586 2.5971 7.45248Z" fill="#979797"/>
<path d="M3.5795 11.304C3.41999 11.2949 3.26136 11.3333 3.12368 11.4143C2.986 11.4954 2.87544 11.6154 2.80601 11.7593C2.73657 11.9032 2.71137 12.0645 2.7336 12.2227C2.75582 12.3809 2.82447 12.529 2.93086 12.6482C3.03725 12.7674 3.1766 12.8523 3.33128 12.8923C3.48597 12.9323 3.64904 12.9255 3.79986 12.8728C3.95069 12.8201 4.0825 12.7239 4.17861 12.5962C4.27472 12.4686 4.33083 12.3154 4.33982 12.1558C4.35188 11.9421 4.27856 11.7323 4.13599 11.5725C3.99342 11.4128 3.79326 11.3162 3.5795 11.304Z" fill="#979797"/>
<path d="M2.68798 16.7261C2.57051 16.7852 2.47321 16.8779 2.40841 16.9924C2.34362 17.1069 2.31422 17.238 2.32395 17.3691C2.33367 17.5003 2.38208 17.6257 2.46306 17.7293C2.54403 17.833 2.65393 17.9103 2.77885 17.9515C2.90376 17.9927 3.03809 17.9959 3.16484 17.9607C3.29159 17.9256 3.40506 17.8536 3.49091 17.7539C3.57675 17.6543 3.63111 17.5314 3.64711 17.4008C3.66311 17.2703 3.64003 17.1379 3.58078 17.0205C3.5416 16.9424 3.48739 16.8729 3.42128 16.8158C3.35516 16.7588 3.27843 16.7153 3.19549 16.688C3.11255 16.6606 3.02503 16.6499 2.93794 16.6564C2.85085 16.663 2.76591 16.6866 2.68798 16.7261Z" fill="#979797"/>
<path d="M5.82398 9.63296C5.98106 9.73596 6.16515 9.79008 6.35298 9.78847C6.54081 9.78685 6.72394 9.72958 6.87922 9.62389C7.0345 9.5182 7.15496 9.36883 7.22535 9.19469C7.29575 9.02054 7.31293 8.82943 7.27472 8.64552C7.2365 8.46161 7.14461 8.29316 7.01067 8.16148C6.87672 8.02979 6.70674 7.94078 6.52221 7.90569C6.33767 7.87061 6.14688 7.89103 5.97396 7.96438C5.80103 8.03773 5.65374 8.1607 5.5507 8.31775C5.48219 8.42203 5.43492 8.53878 5.41157 8.66134C5.38823 8.7839 5.38928 8.90986 5.41466 9.03201C5.44004 9.15417 5.48926 9.27012 5.55949 9.37324C5.62973 9.47635 5.71961 9.56461 5.82398 9.63296Z" fill="#979797"/>
<path d="M15.7741 5.4224C15.9076 5.51005 16.0642 5.55612 16.2239 5.55479C16.3837 5.55346 16.5395 5.50478 16.6716 5.41491C16.8036 5.32504 16.9061 5.19801 16.966 5.0499C17.0259 4.90179 17.0405 4.73925 17.008 4.58283C16.9755 4.42641 16.8973 4.28314 16.7834 4.17115C16.6695 4.05915 16.5249 3.98346 16.3679 3.95365C16.211 3.92383 16.0487 3.94124 15.9016 4.00366C15.7546 4.06608 15.6293 4.17071 15.5417 4.30432C15.4835 4.39297 15.4434 4.49222 15.4235 4.59641C15.4037 4.70059 15.4046 4.80767 15.4262 4.91151C15.4477 5.01535 15.4896 5.11392 15.5493 5.20158C15.609 5.28924 15.6853 5.36428 15.7741 5.4224Z" fill="#979797"/>
<path d="M17.4304 2.57247C17.5168 2.62901 17.618 2.65868 17.7212 2.65772C17.8245 2.65677 17.9251 2.62523 18.0104 2.5671C18.0957 2.50897 18.1619 2.42685 18.2006 2.33112C18.2393 2.23539 18.2487 2.13035 18.2277 2.02926C18.2067 1.92818 18.1562 1.83559 18.0826 1.76319C18.009 1.69079 17.9156 1.64183 17.8142 1.6225C17.7127 1.60317 17.6079 1.61434 17.5128 1.65459C17.4177 1.69483 17.3367 1.76236 17.28 1.84863C17.2423 1.90602 17.2162 1.97027 17.2034 2.03773C17.1905 2.10519 17.1911 2.17451 17.2051 2.24175C17.219 2.30898 17.2461 2.3728 17.2848 2.42955C17.3234 2.4863 17.3729 2.53487 17.4304 2.57247Z" fill="#979797"/>
<path d="M15.9008 10.4662C15.6889 10.4542 15.4767 10.484 15.2764 10.5539C15.076 10.6238 14.8914 10.7326 14.733 10.8739C14.5747 11.0152 14.4457 11.1863 14.3535 11.3774C14.2612 11.5685 14.2076 11.776 14.1955 11.9878C14.1834 12.1997 14.2132 12.4119 14.2832 12.6123C14.3531 12.8126 14.4618 12.9973 14.6031 13.1556C14.7444 13.314 14.9155 13.4429 15.1067 13.5352C15.2978 13.6274 15.5052 13.6811 15.7171 13.6931C15.7485 13.6931 15.7811 13.6931 15.8099 13.6931C16.2306 13.6931 16.6347 13.529 16.9364 13.2357C17.238 12.9425 17.4134 12.5431 17.4252 12.1226C17.4371 11.702 17.2844 11.2934 16.9998 10.9837C16.7151 10.6739 16.3208 10.4873 15.9008 10.4637V10.4662Z" fill="#979797"/>
<path d="M8.6451 9.52096C8.7793 9.78859 8.98557 10.0134 9.24067 10.1701C9.49576 10.3269 9.78955 10.4092 10.0889 10.408C10.3648 10.4079 10.6361 10.3372 10.877 10.2026C11.1178 10.068 11.3202 9.87402 11.4648 9.63906C11.6094 9.4041 11.6915 9.13603 11.7032 8.86037C11.7148 8.58472 11.6557 8.31066 11.5315 8.06432C11.3386 7.68155 11.0015 7.3911 10.5945 7.25686C10.1874 7.12261 9.7437 7.15557 9.36094 7.34848C8.97818 7.54138 8.68773 7.87844 8.55348 8.2855C8.41924 8.69256 8.4522 9.13627 8.6451 9.51904V9.52096Z" fill="#979797"/>
<path d="M21.312 7.45055C21.429 7.39097 21.5258 7.29805 21.5901 7.18352C21.6544 7.06898 21.6834 6.93797 21.6733 6.807C21.6633 6.67604 21.6146 6.55099 21.5336 6.44763C21.4525 6.34426 21.3427 6.26722 21.2179 6.22622C21.0931 6.18522 20.959 6.18209 20.8324 6.21724C20.7058 6.25238 20.5925 6.32422 20.5067 6.4237C20.421 6.52317 20.3666 6.64582 20.3504 6.77618C20.3343 6.90653 20.3571 7.03875 20.416 7.15616C20.4554 7.23444 20.5098 7.30418 20.5762 7.36137C20.6426 7.41856 20.7196 7.46208 20.8028 7.48943C20.8861 7.51678 20.9739 7.52743 21.0613 7.52076C21.1487 7.51409 21.2339 7.49023 21.312 7.45055Z" fill="#979797"/>
<path d="M17.216 7.96512C17.0483 8.04969 16.9095 8.18209 16.817 8.34556C16.7246 8.50903 16.6826 8.69624 16.6966 8.88353C16.7105 9.07081 16.7796 9.24977 16.8952 9.39777C17.0109 9.54577 17.1677 9.65618 17.3461 9.71503C17.5244 9.77388 17.7162 9.77854 17.8972 9.72841C18.0782 9.67828 18.2403 9.57563 18.3629 9.43341C18.4856 9.29119 18.5633 9.11581 18.5863 8.92942C18.6093 8.74303 18.5766 8.554 18.4921 8.38624C18.3786 8.16131 18.1804 7.99064 17.9412 7.91169C17.7019 7.83273 17.4411 7.85195 17.216 7.96512Z" fill="#979797"/>
<path d="M11.9392 2.32864C12.0704 2.33598 12.2008 2.3043 12.314 2.23759C12.4272 2.17088 12.5181 2.07213 12.5752 1.9538C12.6323 1.83547 12.6531 1.70287 12.6349 1.57274C12.6168 1.44261 12.5605 1.32078 12.4731 1.22263C12.3857 1.12448 12.2713 1.05441 12.1441 1.02126C12.017 0.988116 11.8829 0.993379 11.7587 1.03639C11.6346 1.0794 11.5259 1.15822 11.4465 1.26292C11.3671 1.36761 11.3205 1.49348 11.3126 1.62464C11.3073 1.71206 11.3192 1.79969 11.3479 1.88247C11.3765 1.96525 11.4212 2.04155 11.4795 2.10698C11.5377 2.17241 11.6083 2.22568 11.6872 2.26372C11.7661 2.30176 11.8517 2.32382 11.9392 2.32864Z" fill="#979797"/>
<path d="M11.9315 6.51232C12.119 6.52264 12.3053 6.47716 12.467 6.38162C12.6286 6.28608 12.7583 6.14476 12.8397 5.97553C12.9211 5.8063 12.9504 5.61675 12.9241 5.43084C12.8978 5.24492 12.8169 5.07098 12.6918 4.93099C12.5666 4.791 12.4028 4.69125 12.221 4.64434C12.0392 4.59744 11.8475 4.60548 11.6703 4.66745C11.493 4.72942 11.3381 4.84254 11.2251 4.99252C11.1122 5.1425 11.0462 5.32261 11.0355 5.51008C11.0284 5.63474 11.046 5.75958 11.0872 5.87745C11.1284 5.99532 11.1924 6.10391 11.2757 6.197C11.3589 6.29009 11.4597 6.36585 11.5722 6.41996C11.6847 6.47406 11.8068 6.50545 11.9315 6.51232Z" fill="#979797"/>
<path d="M6.78398 16.2115C6.95175 16.127 7.09069 15.9947 7.18324 15.8312C7.27579 15.6678 7.31779 15.4805 7.30393 15.2932C7.29007 15.1059 7.22098 14.9269 7.10539 14.7788C6.98979 14.6307 6.83289 14.5203 6.65452 14.4614C6.47615 14.4025 6.28432 14.3978 6.10329 14.448C5.92227 14.4981 5.76017 14.6008 5.6375 14.743C5.51483 14.8853 5.43709 15.0607 5.41413 15.2471C5.39116 15.4336 5.42399 15.6226 5.50846 15.7904C5.62188 16.0153 5.81992 16.1859 6.05908 16.2649C6.29824 16.3439 6.55897 16.3247 6.78398 16.2115Z" fill="#979797"/>
<path d="M12.544 7.89856C12.3474 8.19901 12.2565 8.55645 12.2859 8.91432C12.3152 9.2722 12.4631 9.61006 12.706 9.87447C12.949 10.1389 13.2732 10.3147 13.6273 10.3742C13.9814 10.4337 14.3452 10.3733 14.6612 10.2028C14.9772 10.0322 15.2273 9.76119 15.3719 9.43254C15.5166 9.10388 15.5475 8.73638 15.4598 8.38818C15.3721 8.03998 15.1708 7.73097 14.8877 7.51003C14.6047 7.28909 14.256 7.16884 13.8969 7.16832C13.6286 7.16827 13.3644 7.23498 13.1282 7.36246C12.892 7.48994 12.6912 7.67417 12.544 7.89856Z" fill="#979797"/>
<path d="M15.3549 14.6557C15.211 14.37 14.9857 14.1335 14.7074 13.9759C14.4291 13.8183 14.1104 13.7468 13.7914 13.7705C13.4725 13.7941 13.1677 13.9118 12.9157 14.1087C12.6637 14.3056 12.4757 14.5728 12.3756 14.8765C12.2754 15.1802 12.2676 15.5068 12.3531 15.815C12.4387 16.1231 12.6137 16.399 12.856 16.6077C13.0983 16.8164 13.3971 16.9485 13.7146 16.9874C14.032 17.0262 14.3538 16.97 14.6393 16.8259C14.8296 16.7313 14.9993 16.5999 15.1384 16.4392C15.2776 16.2786 15.3835 16.092 15.4501 15.8901C15.5166 15.6883 15.5425 15.4753 15.5261 15.2634C15.5098 15.0515 15.4516 14.8449 15.3549 14.6557Z" fill="#979797"/>
<path d="M18.176 14.5437C18.0189 14.4407 17.8348 14.3866 17.647 14.3882C17.4592 14.3898 17.276 14.4471 17.1207 14.5527C16.9655 14.6584 16.845 14.8078 16.7746 14.9819C16.7042 15.1561 16.687 15.3472 16.7253 15.5311C16.7635 15.715 16.8554 15.8835 16.9893 16.0152C17.1232 16.1468 17.2932 16.2359 17.4778 16.2709C17.6623 16.306 17.8531 16.2856 18.026 16.2123C18.1989 16.1389 18.3462 16.0159 18.4493 15.8589C18.5177 15.7546 18.5649 15.6378 18.5882 15.5153C18.6115 15.3927 18.6104 15.2668 18.585 15.1447C18.5597 15.0225 18.5105 14.9066 18.4403 14.8035C18.3701 14.7004 18.2803 14.6121 18.176 14.5437Z" fill="#979797"/>
<path d="M21.2723 12.1155C21.2814 11.956 21.243 11.7974 21.162 11.6597C21.0809 11.522 20.9608 11.4115 20.817 11.342C20.6731 11.2726 20.5118 11.2474 20.3536 11.2696C20.1954 11.2918 20.0473 11.3605 19.9281 11.4669C19.8089 11.5733 19.7239 11.7126 19.684 11.8673C19.644 12.022 19.6508 12.185 19.7035 12.3359C19.7562 12.4867 19.8524 12.6185 19.9801 12.7146C20.1077 12.8107 20.2609 12.8668 20.4205 12.8758C20.6342 12.8879 20.844 12.8146 21.0038 12.672C21.1635 12.5294 21.2601 12.3293 21.2723 12.1155Z" fill="#979797"/>
<path d="M23.5072 11.5414C23.4041 11.5357 23.3016 11.5606 23.2126 11.613C23.1237 11.6655 23.0523 11.7432 23.0074 11.8362C22.9626 11.9293 22.9464 12.0335 22.9608 12.1358C22.9752 12.238 23.0196 12.3337 23.0884 12.4107C23.1572 12.4878 23.2473 12.5427 23.3473 12.5685C23.4473 12.5943 23.5527 12.5899 23.6502 12.5559C23.7477 12.5218 23.8329 12.4596 23.895 12.3771C23.9572 12.2946 23.9935 12.1956 23.9993 12.0925C24.007 11.9542 23.9595 11.8185 23.8672 11.7151C23.775 11.6118 23.6455 11.5494 23.5072 11.5414Z" fill="#979797"/>
<path d="M21.4029 16.7235C21.2928 16.6515 21.1639 16.6137 21.0324 16.615C20.901 16.6162 20.7728 16.6564 20.6641 16.7305C20.5555 16.8046 20.4713 16.9092 20.4221 17.0312C20.3729 17.1531 20.3609 17.2869 20.3878 17.4156C20.4146 17.5444 20.479 17.6622 20.5728 17.7544C20.6667 17.8465 20.7857 17.9087 20.9149 17.9332C21.0441 17.9577 21.1776 17.9434 21.2987 17.892C21.4197 17.8406 21.5228 17.7544 21.5949 17.6445C21.6428 17.5714 21.6758 17.4896 21.6921 17.4038C21.7083 17.3179 21.7075 17.2297 21.6897 17.1442C21.6719 17.0587 21.6374 16.9775 21.5881 16.9053C21.5389 16.8331 21.476 16.7714 21.4029 16.7235Z" fill="#979797"/>
<path d="M6.56958 21.6042C6.48325 21.5474 6.38205 21.5176 6.27876 21.5184C6.17547 21.5192 6.07474 21.5506 5.98931 21.6087C5.90388 21.6668 5.83759 21.7488 5.79881 21.8446C5.76003 21.9403 5.75051 22.0454 5.77146 22.1465C5.7924 22.2477 5.84287 22.3403 5.91648 22.4128C5.99009 22.4853 6.08353 22.5343 6.18499 22.5536C6.28645 22.573 6.39137 22.5618 6.48649 22.5215C6.5816 22.4813 6.66263 22.4137 6.71934 22.3274C6.79521 22.2115 6.82205 22.0704 6.79398 21.9348C6.7659 21.7992 6.68521 21.6803 6.56958 21.6042Z" fill="#979797"/>
<path d="M17.5251 21.5491C17.4332 21.5959 17.3572 21.6689 17.3067 21.7588C17.2562 21.8487 17.2335 21.9516 17.2414 22.0544C17.2492 22.1573 17.2874 22.2554 17.351 22.3366C17.4146 22.4178 17.5009 22.4783 17.5988 22.5106C17.6968 22.5428 17.8021 22.5453 17.9015 22.5178C18.0009 22.4902 18.0899 22.4339 18.1573 22.3559C18.2247 22.2778 18.2675 22.1815 18.2803 22.0792C18.2931 21.9769 18.2753 21.873 18.2291 21.7808C18.1983 21.7192 18.1556 21.6643 18.1034 21.6193C18.0513 21.5742 17.9908 21.54 17.9253 21.5184C17.8599 21.4969 17.7908 21.4885 17.7221 21.4938C17.6535 21.4991 17.5865 21.5179 17.5251 21.5491Z" fill="#979797"/>
<path d="M11.456 16.2774C11.6531 15.9767 11.7442 15.6188 11.715 15.2604C11.6858 14.902 11.5379 14.5635 11.2947 14.2987C11.0515 14.0338 10.7268 13.8576 10.3722 13.798C10.0176 13.7384 9.65325 13.7988 9.33681 13.9696C9.02037 14.1404 8.76993 14.4118 8.62515 14.741C8.48036 15.0701 8.44949 15.4382 8.53742 15.7869C8.62536 16.1355 8.82708 16.4449 9.11065 16.666C9.39421 16.8872 9.74343 17.0074 10.103 17.0077C10.3716 17.0088 10.6362 16.9425 10.8725 16.8149C11.1089 16.6874 11.3095 16.5026 11.456 16.2774Z" fill="#979797"/>
<path d="M8.2259 18.7542C8.09234 18.6666 7.93577 18.6205 7.77602 18.6218C7.61627 18.6232 7.46049 18.6719 7.32841 18.7617C7.19632 18.8516 7.09386 18.9786 7.03397 19.1267C6.97408 19.2748 6.95947 19.4374 6.99197 19.5938C7.02447 19.7502 7.10263 19.8935 7.21656 20.0055C7.33049 20.1175 7.47508 20.1932 7.63204 20.223C7.78899 20.2528 7.95126 20.2354 8.09832 20.173C8.24538 20.1106 8.37063 20.0059 8.45822 19.8723C8.57563 19.6932 8.61711 19.4748 8.57355 19.2652C8.52998 19.0555 8.40494 18.8717 8.2259 18.7542Z" fill="#979797"/>
<path d="M11.9923 21.8474C11.8611 21.8399 11.7306 21.8714 11.6173 21.9381C11.5041 22.0047 11.4131 22.1034 11.3559 22.2217C11.2986 22.34 11.2778 22.4726 11.2958 22.6028C11.3139 22.733 11.3702 22.8549 11.4575 22.9531C11.5448 23.0513 11.6593 23.1214 11.7865 23.1546C11.9136 23.1878 12.0478 23.1826 12.172 23.1396C12.2962 23.0966 12.4048 23.0178 12.4842 22.9131C12.5637 22.8084 12.6103 22.6825 12.6182 22.5514C12.6235 22.464 12.6115 22.3765 12.5829 22.2938C12.5542 22.2111 12.5096 22.1348 12.4514 22.0694C12.3933 22.004 12.3228 21.9507 12.244 21.9126C12.1652 21.8745 12.0797 21.8523 11.9923 21.8474Z" fill="#979797"/>
<path d="M11.9993 17.6637C11.8119 17.6534 11.6256 17.6988 11.4639 17.7944C11.3023 17.8899 11.1726 18.0311 11.0912 18.2003C11.0099 18.3695 10.9805 18.559 11.0067 18.7449C11.033 18.9308 11.1138 19.1048 11.2389 19.2448C11.364 19.3848 11.5277 19.4846 11.7095 19.5316C11.8913 19.5785 12.0829 19.5706 12.2602 19.5087C12.4374 19.4468 12.5924 19.3338 12.7054 19.1839C12.8185 19.034 12.8846 18.854 12.8953 18.6666C12.9024 18.5419 12.8849 18.417 12.8437 18.2991C12.8025 18.1812 12.7384 18.0725 12.6552 17.9794C12.572 17.8863 12.4712 17.8104 12.3587 17.7563C12.2462 17.7021 12.124 17.6706 11.9993 17.6637Z" fill="#979797"/>
<path d="M15.8854 18.6896C15.7432 18.7619 15.6256 18.8747 15.5474 19.0138C15.4692 19.1529 15.434 19.3121 15.4462 19.4712C15.4584 19.6303 15.5174 19.7822 15.6158 19.9078C15.7142 20.0333 15.8476 20.127 15.9992 20.1768C16.1508 20.2267 16.3137 20.2305 16.4675 20.1878C16.6212 20.1452 16.7589 20.0579 16.8631 19.9371C16.9673 19.8163 17.0334 19.6673 17.053 19.5089C17.0727 19.3506 17.045 19.19 16.9734 19.0474C16.9257 18.9522 16.8596 18.8675 16.779 18.7979C16.6984 18.7284 16.6049 18.6755 16.5038 18.6423C16.4027 18.609 16.296 18.5961 16.1899 18.6042C16.0838 18.6123 15.9803 18.6414 15.8854 18.6896Z" fill="#979797"/>
</g>
<defs>
<clipPath id="clip0_1095_4115">
<rect width="24" height="24" fill="white"/>
</clipPath>
</defs>
</svg>
