<svg width="24" height="24" viewBox="0 0 24 24" fill="none" xmlns="http://www.w3.org/2000/svg">
<g clip-path="url(#clip0_1095_4127)">
<path d="M20.4856 3.516C18.218 1.248 15.2057 0 12.0012 0C5.38325 0 0 5.3832 0 12C0 18.6168 5.38325 24 12.0012 24C15.2057 24 18.2204 22.752 20.4856 20.484C22.7533 18.216 24 15.204 24 12C24 8.796 22.7533 5.7816 20.4856 3.516ZM12.0012 23.1696C5.84206 23.1696 0.831149 18.1584 0.831149 12C0.831149 5.8416 5.84206 0.8304 12.0012 0.8304C18.1603 0.8304 23.1713 5.8416 23.1713 12C23.1713 18.1584 18.1603 23.1696 12.0012 23.1696Z" fill="#979797"/>
<path d="M15.9331 12.2807C15.1654 11.5946 14.1601 11.1363 13.1859 10.6924L13.1787 10.69C11.4608 9.90544 9.97567 9.22645 10.0812 7.62131C10.1268 7.00948 10.5707 6.64 10.9354 6.44085C11.3457 6.21532 11.8903 6.08097 12.3942 6.08097C12.4542 6.08097 12.5141 6.08337 12.5717 6.08577C14.0377 6.18412 15.1941 6.80555 16.3242 8.09637L16.3914 8.17554L16.4706 8.10837L16.9121 7.72449L16.9912 7.65491L16.9216 7.57573C15.662 6.13134 14.2944 5.40436 12.6221 5.29158C12.5501 5.28438 12.4733 5.28198 12.3894 5.28198C12.339 5.28198 12.2838 5.28198 12.2262 5.28438H12.1542C11.0578 5.28438 9.8557 5.64429 8.94156 6.24892C7.8499 6.9711 7.23807 7.96441 7.22127 9.0465C7.17809 11.6785 9.33027 12.5639 11.2281 13.3485L11.2329 13.3508L11.2521 13.358C12.9316 14.0538 14.3808 14.6537 14.3496 16.2612C14.3352 17.3217 12.8188 17.9071 11.7775 17.9071H11.7343H11.6312V17.9095C10.0788 17.8639 8.69203 17.1945 7.50919 15.9253L7.43722 15.8485L7.36042 15.9181L6.93096 16.3164L6.85419 16.3884L6.92616 16.4651C8.26975 17.9119 9.92767 18.6893 11.7223 18.7109H11.8039C12.9628 18.7109 14.2224 18.399 15.1726 17.8735C16.3626 17.2233 17.056 16.2756 17.128 15.2055C17.2096 14.0298 16.8185 13.0725 15.9331 12.2807ZM10.362 9.99181C11.0458 10.5772 11.9719 10.9971 12.8668 11.4026L12.8836 11.4098C13.8313 11.8465 14.7287 12.2592 15.3789 12.8326C16.0987 13.466 16.4034 14.2002 16.3386 15.1431C16.2786 16.0764 15.5852 16.7003 14.9542 17.077C15.0766 16.8274 15.1438 16.5563 15.151 16.2684C15.1654 15.2991 14.7935 14.5241 14.0113 13.8955C13.3275 13.3461 12.4206 12.9742 11.5424 12.6118C9.71655 11.8609 7.99145 11.1507 8.02263 9.0537C8.03223 8.24752 8.51688 7.48456 9.38784 6.90633C9.41662 6.88713 9.44542 6.86793 9.47662 6.84873C9.37344 7.07428 9.31587 7.30941 9.30147 7.55653C9.23189 8.52825 9.5798 9.32481 10.362 9.99181Z" fill="#979797"/>
</g>
<defs>
<clipPath id="clip0_1095_4127">
<rect width="24" height="24" fill="white"/>
</clipPath>
</defs>
</svg>
