[
    {
        "anonymous": false,
        "inputs": [
            {
                "indexed": true,
                "internalType": "address",
                "name": "previousOwner",
                "type": "address"
            },
            {
                "indexed": true,
                "internalType": "address",
                "name": "newOwner",
                "type": "address"
            }
        ],
        "name": "OwnershipTransferred",
        "type": "event"
    },
    {
        "anonymous": false,
        "inputs": [
            {
                "indexed": true,
                "internalType": "address",
                "name": "buyer",
                "type": "address"
            },
            {
                "indexed": true,
                "internalType": "address",
                "name": "service",
                "type": "address"
            },
            {
                "components": [
                    {
                        "internalType": "uint256",
                        "name": "validUntil",
                        "type": "uint256"
                    },
                    {
                        "internalType": "uint256",
                        "name": "countsLeft",
                        "type": "uint256"
                    }
                ],
                "indexed": false,
                "internalType": "struct Ticket",
                "name": "ticket",
                "type": "tuple"
            }
        ],
        "name": "TicketSold",
        "type": "event"
    },
    {
        "inputs": [
            {
                "internalType": "address",
                "name": "_service",
                "type": "address"
            },
            {
                "internalType": "uint256",
                "name": "_tarifIndex",
                "type": "uint256"
            },
            {
                "internalType": "uint256",
                "name": "_payWithIndex",
                "type": "uint256"
            },
            {
                "internalType": "address",
                "name": "_buyFor",
                "type": "address"
            },
            {
                "internalType": "address",
                "name": "_payer",
                "type": "address"
            }
        ],
        "name": "buySubscription",
        "outputs": [
            {
                "components": [
                    {
                        "internalType": "uint256",
                        "name": "validUntil",
                        "type": "uint256"
                    },
                    {
                        "internalType": "uint256",
                        "name": "countsLeft",
                        "type": "uint256"
                    }
                ],
                "internalType": "struct Ticket",
                "name": "ticket",
                "type": "tuple"
            }
        ],
        "stateMutability": "payable",
        "type": "function"
    },
    {
        "inputs": [
            {
                "internalType": "address",
                "name": "_service",
                "type": "address"
            }
        ],
        "name": "buyTicket",
        "outputs": [

        ],
        "stateMutability": "payable",
        "type": "function"
    },
    {
        "inputs": [

        ],
        "name": "owner",
        "outputs": [
            {
                "internalType": "address",
                "name": "",
                "type": "address"
            }
        ],
        "stateMutability": "view",
        "type": "function"
    },
    {
        "inputs": [

        ],
        "name": "renounceOwnership",
        "outputs": [

        ],
        "stateMutability": "nonpayable",
        "type": "function"
    },
    {
        "inputs": [
            {
                "internalType": "address",
                "name": "newOwner",
                "type": "address"
            }
        ],
        "name": "transferOwnership",
        "outputs": [

        ],
        "stateMutability": "nonpayable",
        "type": "function"
    },
    {
        "inputs": [
            {
                "internalType": "address",
                "name": "_erc20",
                "type": "address"
            }
        ],
        "name": "withdrawFeeERC20",
        "outputs": [

        ],
        "stateMutability": "nonpayable",
        "type": "function"
    },
    {
        "inputs": [

        ],
        "name": "withdrawFeeEther",
        "outputs": [

        ],
        "stateMutability": "nonpayable",
        "type": "function"
    },
    {
        "stateMutability": "payable",
        "type": "receive"
    }
]