<svg width="182" height="182" viewBox="0 0 182 182" fill="none" xmlns="http://www.w3.org/2000/svg">
<circle cx="91" cy="91" r="91" fill="#1E2121"/>
<path d="M37 49.7069C37 47.1073 39.3424 45 42.232 45H140.768C143.658 45 146 47.1073 146 49.7069V131.293C146 133.893 143.658 136 140.768 136H42.232C39.3424 136 37 133.893 37 131.293V49.7069Z" fill="#343D3D"/>
<path d="M37 49.6667C37 47.0893 39.3424 45 42.232 45H140.768C143.658 45 146 47.0893 146 49.6667V73H37V49.6667Z" fill="#28BCA9"/>
<path d="M73.5159 63.9862H71L76.396 52.9893H78.4968L83.8759 63.9862H81.36L80.2673 61.7086H74.6256L73.5159 63.9862ZM77.421 55.773L75.4049 59.9218H79.4879L77.4549 55.773H77.421Z" fill="white"/>
<path d="M87.4676 67H85.299V55.7883H86.6883L87.0695 57.0153C87.9109 56.0798 89.0376 55.612 90.4494 55.612C91.2457 55.612 91.9629 55.8011 92.601 56.1794C93.2392 56.5578 93.7333 57.0741 94.0834 57.7285C94.4392 58.3778 94.6171 59.0961 94.6171 59.8834C94.6171 60.6656 94.4392 61.3839 94.0834 62.0383C93.7333 62.6876 93.2363 63.204 92.5925 63.5874C91.9544 63.9709 91.24 64.1626 90.4494 64.1626C89.7717 64.1626 89.1759 64.0297 88.662 63.7638C88.1481 63.498 87.75 63.1887 87.4676 62.8359V67ZM89.9157 62.3681C90.6499 62.3681 91.2485 62.1329 91.7116 61.6626C92.1746 61.1922 92.4062 60.5992 92.4062 59.8834C92.4062 59.1626 92.1746 58.5695 91.7116 58.1043C91.2541 57.6391 90.6555 57.4064 89.9157 57.4064C89.2042 57.4064 88.614 57.6442 88.1453 58.1196C87.6822 58.59 87.4507 59.1779 87.4507 59.8834C87.4507 60.5838 87.6822 61.1743 88.1453 61.6549C88.614 62.1304 89.2042 62.3681 89.9157 62.3681Z" fill="white"/>
<path d="M98.8357 63.9862H96.6671V55.7883H98.0563L98.5731 57.2301C98.686 57.046 98.799 56.885 98.9119 56.7469C99.0248 56.6089 99.183 56.4606 99.3863 56.3021C99.5896 56.1385 99.8098 56.0082 100.047 55.911C100.29 55.8088 100.595 55.7296 100.962 55.6733C101.329 55.6171 101.736 55.6017 102.182 55.6273L101.885 57.7209C101.326 57.6851 100.843 57.7209 100.437 57.8282C100.03 57.9356 99.7138 58.0992 99.4879 58.319C99.262 58.5389 99.0954 58.7868 98.9881 59.0629C98.8865 59.339 98.8357 59.6508 98.8357 59.9985V63.9862Z" fill="white"/>
<path d="M104.062 54.0475C103.814 53.8124 103.69 53.5286 103.69 53.1963C103.69 52.864 103.814 52.5828 104.062 52.3528C104.316 52.1176 104.627 52 104.994 52C105.355 52 105.663 52.1176 105.917 52.3528C106.177 52.5828 106.307 52.864 106.307 53.1963C106.307 53.5286 106.177 53.8124 105.917 54.0475C105.663 54.2776 105.355 54.3926 104.994 54.3926C104.627 54.3926 104.316 54.2776 104.062 54.0475ZM106.104 63.9862H103.935V55.7883H106.104V63.9862Z" fill="white"/>
<path d="M111 63.9862H108.831V52.161H111V63.9862Z" fill="white"/>
<path d="M49 40H55V51H49V40Z" fill="white"/>
<path d="M129 40H134V51H129V40Z" fill="white"/>
<circle cx="91" cy="104" r="20.5" fill="#343D3D" stroke="#4AFEBF" stroke-width="3"/>
<path d="M89.7734 112H78.1016L78.125 109.82L84.4414 103.363C85.0508 102.754 85.4844 102.215 85.7422 101.746C86.0078 101.277 86.1406 100.742 86.1406 100.141C86.1406 99.375 85.9102 98.7773 85.4492 98.3477C84.9961 97.9102 84.3789 97.6914 83.5977 97.6914C82.9883 97.6914 82.375 97.8477 81.7578 98.1602C81.1484 98.4727 80.4844 98.9805 79.7656 99.6836L77.8672 97.5508C78.7578 96.6836 79.6797 96.0234 80.6328 95.5703C81.5938 95.1172 82.6484 94.8906 83.7969 94.8906C85.4688 94.8906 86.7969 95.3555 87.7812 96.2852C88.7734 97.207 89.2695 98.4297 89.2695 99.9531C89.2695 100.883 89.0742 101.746 88.6836 102.543C88.3008 103.332 87.6875 104.156 86.8438 105.016L82.7305 109.234H89.7734V112Z" fill="white"/>
<path d="M91.3789 109.551L93.3477 107.418C94.5977 108.809 96.0547 109.504 97.7188 109.504C98.7031 109.504 99.4609 109.258 99.9922 108.766C100.523 108.266 100.789 107.617 100.789 106.82C100.789 105.984 100.508 105.352 99.9453 104.922C99.3906 104.492 98.5664 104.277 97.4727 104.277H92.3867L93.5352 95.1953H103.039V97.9609H96.1836L95.7266 101.535H97.7422C98.6484 101.535 99.4609 101.629 100.18 101.816C100.906 101.996 101.555 102.281 102.125 102.672C102.695 103.062 103.133 103.594 103.438 104.266C103.75 104.938 103.906 105.73 103.906 106.645C103.906 108.449 103.344 109.848 102.219 110.84C101.094 111.824 99.5938 112.316 97.7188 112.316C96.4531 112.316 95.2734 112.07 94.1797 111.578C93.0938 111.086 92.1602 110.41 91.3789 109.551Z" fill="white"/>
<path d="M128.336 109H120.945L120.961 108.266L125.711 103.258C126.143 102.81 126.464 102.396 126.672 102.016C126.885 101.635 126.992 101.221 126.992 100.773C126.992 100.049 126.771 99.487 126.328 99.0859C125.885 98.6849 125.307 98.4844 124.594 98.4844C124.083 98.4844 123.589 98.599 123.109 98.8281C122.635 99.0521 122.133 99.4245 121.602 99.9453L121.008 99.2734C122.091 98.1536 123.302 97.5938 124.641 97.5938C125.62 97.5938 126.414 97.8828 127.023 98.4609C127.633 99.0339 127.938 99.7891 127.938 100.727C127.938 101.315 127.818 101.841 127.578 102.305C127.339 102.768 126.966 103.266 126.461 103.797L122.367 108.102H128.336V109Z" fill="white" fill-opacity="0.3"/>
<path d="M130.133 105.578C130.133 105.214 130.174 104.865 130.258 104.531C130.341 104.193 130.469 103.867 130.641 103.555C130.812 103.242 130.966 102.987 131.102 102.789C131.237 102.591 131.419 102.346 131.648 102.055L134.977 97.7969H136.133L132.805 102.055C132.789 102.076 132.763 102.107 132.727 102.148C132.695 102.185 132.672 102.214 132.656 102.234C133.078 102.052 133.516 101.961 133.969 101.961C135.094 101.961 136.013 102.297 136.727 102.969C137.44 103.641 137.797 104.51 137.797 105.578C137.797 106.646 137.44 107.518 136.727 108.195C136.013 108.872 135.094 109.211 133.969 109.211C132.839 109.211 131.917 108.872 131.203 108.195C130.49 107.518 130.133 106.646 130.133 105.578ZM131.07 105.578C131.07 106.417 131.333 107.083 131.859 107.578C132.385 108.068 133.089 108.312 133.969 108.312C134.844 108.312 135.544 108.065 136.07 107.57C136.602 107.076 136.867 106.411 136.867 105.578C136.867 104.75 136.602 104.089 136.07 103.594C135.544 103.094 134.844 102.844 133.969 102.844C133.104 102.844 132.404 103.094 131.867 103.594C131.336 104.094 131.07 104.755 131.07 105.578Z" fill="white" fill-opacity="0.3"/>
<path d="M51.3359 109H43.9453L43.9609 108.266L48.7109 103.258C49.1432 102.81 49.4635 102.396 49.6719 102.016C49.8854 101.635 49.9922 101.221 49.9922 100.773C49.9922 100.049 49.7708 99.487 49.3281 99.0859C48.8854 98.6849 48.3073 98.4844 47.5938 98.4844C47.0833 98.4844 46.5885 98.599 46.1094 98.8281C45.6354 99.0521 45.1328 99.4245 44.6016 99.9453L44.0078 99.2734C45.0911 98.1536 46.3021 97.5938 47.6406 97.5938C48.6198 97.5938 49.4141 97.8828 50.0234 98.4609C50.6328 99.0339 50.9375 99.7891 50.9375 100.727C50.9375 101.315 50.8177 101.841 50.5781 102.305C50.3385 102.768 49.9661 103.266 49.4609 103.797L45.3672 108.102H51.3359V109Z" fill="white" fill-opacity="0.3"/>
<path d="M58.2109 106.188H52.3203V105.367L58.0547 97.7969H59.1406V105.305H60.8828V106.188H59.1406V109H58.2109V106.188ZM58.2109 99.125L53.5234 105.305H58.2109V99.125Z" fill="white" fill-opacity="0.3"/>
</svg>
