<svg width="182" height="182" viewBox="0 0 182 182" fill="none" xmlns="http://www.w3.org/2000/svg">
<circle cx="91" cy="91" r="91" fill="#1E2121"/>
<rect x="42.8633" y="41.0305" width="74" height="88.8" rx="5" transform="rotate(-5.04183 42.8633 41.0305)" fill="#343D3D"/>
<circle cx="82.2686" cy="66.6666" r="18" transform="rotate(-5.04183 82.2686 66.6666)" fill="url(#paint0_linear_2604_6272)"/>
<line x1="60.8819" y1="99.635" x2="109.095" y2="95.3814" stroke="white" stroke-width="3" stroke-linecap="round"/>
<line x1="61.5987" y1="107.76" x2="109.812" y2="103.506" stroke="white" stroke-width="3" stroke-linecap="round"/>
<line x1="62.3726" y1="116.534" x2="110.586" y2="112.28" stroke="white" stroke-width="3" stroke-linecap="round"/>
<g filter="url(#filter0_d_2604_6272)">
<rect x="65.418" y="46.0679" width="74" height="88.8" rx="5" transform="rotate(7.99081 65.418 46.0679)" fill="#343D3D"/>
<circle cx="98.0271" cy="79.9298" r="18" transform="rotate(7.99081 98.0271 79.9298)" fill="url(#paint1_linear_2604_6272)"/>
<line x1="69.7565" y1="107.226" x2="117.687" y2="113.954" stroke="white" stroke-width="3" stroke-linecap="round"/>
<line x1="68.6227" y1="115.303" x2="116.553" y2="122.032" stroke="white" stroke-width="3" stroke-linecap="round"/>
<line x1="67.3981" y1="124.026" x2="115.329" y2="130.754" stroke="white" stroke-width="3" stroke-linecap="round"/>
</g>
<defs>
<filter id="filter0_d_2604_6272" x="50.7192" y="42.7139" width="87.3345" height="100.933" filterUnits="userSpaceOnUse" color-interpolation-filters="sRGB">
<feFlood flood-opacity="0" result="BackgroundImageFix"/>
<feColorMatrix in="SourceAlpha" type="matrix" values="0 0 0 0 0 0 0 0 0 0 0 0 0 0 0 0 0 0 127 0" result="hardAlpha"/>
<feOffset dx="-3" dy="-4"/>
<feComposite in2="hardAlpha" operator="out"/>
<feColorMatrix type="matrix" values="0 0 0 0 0.117647 0 0 0 0 0.129412 0 0 0 0 0.129412 0 0 0 1 0"/>
<feBlend mode="normal" in2="BackgroundImageFix" result="effect1_dropShadow_2604_6272"/>
<feBlend mode="normal" in="SourceGraphic" in2="effect1_dropShadow_2604_6272" result="shape"/>
</filter>
<linearGradient id="paint0_linear_2604_6272" x1="82.2686" y1="48.6666" x2="82.2686" y2="84.6666" gradientUnits="userSpaceOnUse">
<stop stop-color="#4AFEBF"/>
<stop offset="1" stop-color="#51EEDA"/>
</linearGradient>
<linearGradient id="paint1_linear_2604_6272" x1="98.0271" y1="61.9298" x2="98.0271" y2="97.9298" gradientUnits="userSpaceOnUse">
<stop stop-color="#4AFEBF"/>
<stop offset="1" stop-color="#51EEDA"/>
</linearGradient>
</defs>
</svg>
