<svg width="182" height="182" viewBox="0 0 182 182" fill="none" xmlns="http://www.w3.org/2000/svg">
<circle cx="91" cy="91" r="91" fill="#1E2121"/>
<path d="M33 63.5897C33 61.6072 34.6072 60 36.5897 60H85.4103C87.3928 60 89 61.6072 89 63.5897V79.7436C89 81.7261 87.3928 83.3333 85.4103 83.3333H36.5897C34.6072 83.3333 33 81.7261 33 79.7436V63.5897Z" fill="#4AFEBF"/>
<path d="M47.1016 73.6211L48.0977 74.7285C47.7148 75.1699 47.2207 75.5195 46.6152 75.7773C46.0137 76.0312 45.4121 76.1582 44.8105 76.1582C44.2129 76.1582 43.6484 76.0449 43.1172 75.8184C42.5859 75.5918 42.1289 75.2852 41.7461 74.8984C41.3633 74.5117 41.0605 74.0488 40.8379 73.5098C40.6152 72.9707 40.5039 72.4004 40.5039 71.7988C40.5039 71.1973 40.6152 70.627 40.8379 70.0879C41.0605 69.5488 41.3633 69.0859 41.7461 68.6992C42.1289 68.3125 42.5859 68.0078 43.1172 67.7852C43.6484 67.5586 44.2129 67.4453 44.8105 67.4453C45.416 67.4453 46.0098 67.5684 46.5918 67.8145C47.1777 68.0605 47.6836 68.4082 48.1094 68.8574L47.0781 70C46.7383 69.6055 46.3848 69.3145 46.0176 69.127C45.6543 68.9395 45.252 68.8457 44.8105 68.8457C44.2676 68.8457 43.7832 68.9844 43.3574 69.2617C42.9316 69.5352 42.6074 69.8945 42.3848 70.3398C42.1621 70.7852 42.0508 71.2715 42.0508 71.7988C42.0508 72.3262 42.1621 72.8125 42.3848 73.2578C42.6074 73.7031 42.9316 74.0645 43.3574 74.3418C43.7832 74.6152 44.2676 74.752 44.8105 74.752C45.666 74.752 46.4297 74.375 47.1016 73.6211Z" fill="#1E2121"/>
<path d="M51.0273 76H49.4922V67.5977H51.0273V71.0781H54.9648V67.5977H56.5V76H54.9648V72.4609H51.0273V76Z" fill="#1E2121"/>
<path d="M64.5156 76H58.5156V67.5977H64.457V68.9805H60.0508V71.0781H64.2402V72.4609H60.0508V74.6172H64.5156V76Z" fill="#1E2121"/>
<path d="M72.3203 73.6211L73.3164 74.7285C72.9336 75.1699 72.4395 75.5195 71.834 75.7773C71.2324 76.0312 70.6309 76.1582 70.0293 76.1582C69.4316 76.1582 68.8672 76.0449 68.3359 75.8184C67.8047 75.5918 67.3477 75.2852 66.9648 74.8984C66.582 74.5117 66.2793 74.0488 66.0566 73.5098C65.834 72.9707 65.7227 72.4004 65.7227 71.7988C65.7227 71.1973 65.834 70.627 66.0566 70.0879C66.2793 69.5488 66.582 69.0859 66.9648 68.6992C67.3477 68.3125 67.8047 68.0078 68.3359 67.7852C68.8672 67.5586 69.4316 67.4453 70.0293 67.4453C70.6348 67.4453 71.2285 67.5684 71.8105 67.8145C72.3965 68.0605 72.9023 68.4082 73.3281 68.8574L72.2969 70C71.957 69.6055 71.6035 69.3145 71.2363 69.127C70.873 68.9395 70.4707 68.8457 70.0293 68.8457C69.4863 68.8457 69.002 68.9844 68.5762 69.2617C68.1504 69.5352 67.8262 69.8945 67.6035 70.3398C67.3809 70.7852 67.2695 71.2715 67.2695 71.7988C67.2695 72.3262 67.3809 72.8125 67.6035 73.2578C67.8262 73.7031 68.1504 74.0645 68.5762 74.3418C69.002 74.6152 69.4863 74.752 70.0293 74.752C70.8848 74.752 71.6484 74.375 72.3203 73.6211Z" fill="#1E2121"/>
<path d="M76.2461 76H74.7109V67.5977H76.2461V71.1016L79.4746 67.5977H81.4902L78.1445 71.248L81.625 76H79.7383L77.0371 72.3496L76.2461 73.2402V76Z" fill="#1E2121"/>
<path d="M91 109.59C91 107.607 92.6072 106 94.5897 106H143.41C145.393 106 147 107.607 147 109.59V125.744C147 127.726 145.393 129.333 143.41 129.333H94.5897C92.6072 129.333 91 127.726 91 125.744V109.59Z" fill="#D84747"/>
<path d="M103.806 121.159C104.827 121.934 106.196 122.322 107.566 122.322C109.608 122.322 110.991 121.198 110.991 119.556C110.991 117.308 109.104 117.062 107.605 116.83C106.597 116.662 105.796 116.519 105.796 115.692C105.796 114.826 106.507 114.452 107.54 114.452C108.342 114.452 109.104 114.697 109.996 115.292L110.797 113.961C109.595 113.172 108.691 112.94 107.476 112.94C105.576 112.94 104.116 113.974 104.116 115.744C104.116 117.993 106.093 118.186 107.605 118.458C108.561 118.626 109.311 118.82 109.311 119.634C109.311 120.345 108.691 120.81 107.502 120.81C106.623 120.81 105.512 120.422 104.633 119.802L103.806 121.159Z" fill="white"/>
<path d="M119.177 122.154V120.668H114.369V118.342H118.88V116.855H114.369V114.594H119.112V113.108H112.715V122.154H119.177Z" fill="white"/>
<path d="M126.899 122.154V120.694H122.674V113.108H121.019V122.154H126.899Z" fill="white"/>
<path d="M134.307 122.154V120.694H130.082V113.108H128.427V122.154H134.307Z" fill="white"/>
<path fill-rule="evenodd" clip-rule="evenodd" d="M51.9602 113.96V104H57.9067V113.96H67.867V119.907H57.9067V129.867H51.9602V119.907H42V113.96H51.9602Z" fill="white"/>
<path fill-rule="evenodd" clip-rule="evenodd" d="M139.606 54.6297L126.225 77.8071L126.224 77.807L125.679 78.7518L109 69.1222L111.889 64.1185L123.564 70.8593L134.602 51.7408L139.606 54.6297Z" fill="white"/>
</svg>
