<svg width="24" height="24" viewBox="0 0 24 24" fill="none" xmlns="http://www.w3.org/2000/svg">
<path d="M12 0C18.628 0 24 5.37305 24 12C24 18.628 18.628 24 12 24C5.37305 24 0 18.6275 0 12C0 5.37305 5.37305 0 12 0Z" fill="#F5AC37"/>
<path d="M12.4422 12.8481H17.002C17.0992 12.8481 17.1451 12.8481 17.1521 12.7207C17.1894 12.2568 17.1894 11.7902 17.1521 11.3258C17.1521 11.2356 17.1073 11.1984 17.0096 11.1984H7.93477C7.82245 11.1984 7.79221 11.2356 7.79221 11.3409V12.6758C7.79221 12.8481 7.79221 12.8481 7.97203 12.8481H12.4422V12.8481ZM16.6429 9.63831C16.6559 9.60429 16.6559 9.56703 16.6429 9.53355C16.5668 9.36776 16.4766 9.20954 16.3718 9.06104C16.2141 8.80724 16.0284 8.57342 15.8167 8.36335C15.7168 8.23645 15.6012 8.12251 15.4716 8.02585C14.8225 7.47343 14.0509 7.08246 13.2214 6.8859C12.8029 6.79194 12.3752 6.74712 11.9465 6.7509H7.91911C7.80679 6.7509 7.79167 6.79572 7.79167 6.89346V9.55569C7.79167 9.66801 7.79167 9.69825 7.93423 9.69825H16.5889C16.5889 9.69825 16.664 9.68313 16.6791 9.63831H16.6424H16.6429ZM16.6429 14.4082C16.5155 14.3941 16.3869 14.3941 16.2595 14.4082H7.94233C7.83001 14.4082 7.79221 14.4082 7.79221 14.5583V17.1611C7.79221 17.281 7.79221 17.3112 7.94233 17.3112H11.7823C11.9659 17.3253 12.1495 17.3123 12.3293 17.274C12.8866 17.234 13.4347 17.1131 13.9574 16.9138C14.1475 16.8479 14.3311 16.7621 14.5045 16.6589H14.5569C15.457 16.1907 16.1882 15.4552 16.6494 14.5524C16.6494 14.5524 16.7018 14.439 16.6429 14.4093V14.4082ZM6.28505 18.6607V18.6159V16.8684V16.2761V14.5135C6.28505 14.4157 6.28505 14.4012 6.16517 14.4012H4.5376C4.44742 14.4012 4.41016 14.4012 4.41016 14.2813V12.8562H6.15005C6.24725 12.8562 6.28505 12.8562 6.28505 12.7288V11.3188C6.28505 11.2286 6.28505 11.2065 6.16517 11.2065H4.5376C4.44742 11.2065 4.41016 11.2065 4.41016 11.0866V9.76683C4.41016 9.68421 4.41016 9.66207 4.53004 9.66207H6.14249C6.25481 9.66207 6.28505 9.66207 6.28505 9.51951V5.47703C6.28505 5.35714 6.28505 5.3269 6.43518 5.3269H12.0599C12.4681 5.3431 12.8737 5.38792 13.2749 5.46191C14.1016 5.61473 14.896 5.91011 15.6223 6.33185C16.104 6.61536 16.5473 6.95772 16.9421 7.35192C17.2391 7.66027 17.5069 7.99399 17.7445 8.34931C17.9805 8.7095 18.1765 9.09452 18.3304 9.49683C18.3493 9.60159 18.4498 9.67233 18.5545 9.65451H19.897C20.0692 9.65451 20.0692 9.65451 20.0768 9.81975V11.0499C20.0768 11.1698 20.032 11.2 19.9115 11.2H18.8764C18.7716 11.2 18.7414 11.2 18.7489 11.335C18.79 11.7918 18.79 12.2503 18.7489 12.7072C18.7489 12.8346 18.7489 12.8497 18.892 12.8497H20.0762C20.1286 12.9172 20.0762 12.9847 20.0762 13.0528C20.0838 13.1397 20.0838 13.2277 20.0762 13.3147V14.2224C20.0762 14.3499 20.039 14.3877 19.9261 14.3877H18.5086C18.4098 14.3688 18.3137 14.4319 18.291 14.5302C17.9535 15.4077 17.4135 16.1945 16.7158 16.8252C16.4609 17.0547 16.1931 17.2707 15.9133 17.47C15.6131 17.6428 15.321 17.8226 15.0132 17.9652C14.4467 18.2201 13.8527 18.408 13.243 18.5273C12.6641 18.631 12.0772 18.678 11.488 18.6699H6.28289V18.6623L6.28505 18.6607Z" fill="#FEFEFD"/>
<g clip-path="url(#clip0_2721_5645)">
<path d="M12 24C18.6274 24 24 18.6274 24 12C24 5.37258 18.6274 0 12 0C5.37258 0 0 5.37258 0 12C0 18.6274 5.37258 24 12 24Z" fill="#627EEA"/>
<path d="M12.373 3V9.6525L17.9958 12.165L12.373 3Z" fill="white" fill-opacity="0.602"/>
<path d="M12.3735 3L6.75 12.165L12.3735 9.6525V3Z" fill="white"/>
<path d="M12.373 16.4759V20.9962L17.9995 13.2119L12.373 16.4759Z" fill="white" fill-opacity="0.602"/>
<path d="M12.3735 20.9962V16.4752L6.75 13.2119L12.3735 20.9962Z" fill="white"/>
<path d="M12.373 15.4298L17.9958 12.1651L12.373 9.65405V15.4298Z" fill="white" fill-opacity="0.2"/>
<path d="M6.75 12.1651L12.3735 15.4298V9.65405L6.75 12.1651Z" fill="white" fill-opacity="0.602"/>
<g clip-path="url(#clip1_2721_5645)">
<path d="M12 24C18.6274 24 24 18.6274 24 12C24 5.37258 18.6274 0 12 0C5.37258 0 0 5.37258 0 12C0 18.6274 5.37258 24 12 24Z" fill="black"/>
<path d="M8.69929 10.2807C8.52235 10.1409 8.49224 9.88415 8.63205 9.7072L9.32427 8.83108C9.46408 8.65413 9.72086 8.62402 9.8978 8.76383V8.76383C10.0747 8.90363 10.1049 9.16041 9.96505 9.33736L9.27282 10.2135C9.13302 10.3904 8.87624 10.4205 8.69929 10.2807V10.2807Z" fill="#4AFEBF"/>
<path d="M13.3443 11.8091C13.3443 12.5517 12.7424 13.1537 11.9998 13.1537C11.2572 13.1537 10.6553 12.5517 10.6553 11.8091C10.6553 11.0666 11.2572 10.4646 11.9998 10.4646C12.7424 10.4646 13.3443 11.0666 13.3443 11.8091Z" fill="#51EEDA"/>
<path fill-rule="evenodd" clip-rule="evenodd" d="M12.8916 17.3084C12.4245 17.8581 11.576 17.8581 11.109 17.3084L7.24175 12.7573C6.87065 12.3206 6.87065 11.6793 7.24175 11.2426L7.62863 10.7873C7.83777 10.5411 8.20684 10.5112 8.45297 10.7203C8.6991 10.9294 8.72908 11.2985 8.51994 11.5446L8.13306 11.9999L12.0003 16.5511L13.121 15.2322C13.3301 14.9861 13.6992 14.9561 13.9453 15.1652C14.1914 15.3744 14.2214 15.7434 14.0123 15.9896L12.8916 17.3084ZM15.3092 13.56C15.0631 13.3509 15.0331 12.9818 15.2423 12.7357L15.8675 11.9999L12.0003 7.44881L11.1858 8.40733C10.9766 8.65346 10.6076 8.68344 10.3614 8.4743C10.1153 8.26516 10.0853 7.89609 10.2945 7.64996L11.109 6.69144C11.576 6.14175 12.4245 6.14175 12.8916 6.69144L16.7588 11.2426C17.1299 11.6793 17.1299 12.3206 16.7588 12.7573L16.1336 13.4931C15.9244 13.7392 15.5554 13.7692 15.3092 13.56Z" fill="url(#paint0_linear_2721_5645)"/>
<path fill-rule="evenodd" clip-rule="evenodd" d="M12 4.91963C8.08962 4.91963 4.91963 8.08962 4.91963 12C4.91963 15.9104 8.08962 19.0804 12 19.0804C12.323 19.0804 12.5848 19.3422 12.5848 19.6652C12.5848 19.9882 12.323 20.25 12 20.25C7.44365 20.25 3.75 16.5564 3.75 12C3.75 7.44365 7.44365 3.75 12 3.75C12.323 3.75 12.5848 4.01183 12.5848 4.33482C12.5848 4.6578 12.323 4.91963 12 4.91963Z" fill="url(#paint1_linear_2721_5645)"/>
<path fill-rule="evenodd" clip-rule="evenodd" d="M16.9797 17.8566C16.7523 17.6272 16.754 17.2569 16.9834 17.0295C18.279 15.7458 19.0804 13.967 19.0804 11.9999C19.0804 10.0329 18.279 8.25407 16.9834 6.97034C16.754 6.74301 16.7523 6.37272 16.9797 6.14329C17.207 5.91387 17.5773 5.91217 17.8067 6.13951C19.3148 7.63388 20.25 9.70824 20.25 11.9999C20.25 14.2916 19.3148 16.366 17.8067 17.8604C17.5773 18.0877 17.207 18.086 16.9797 17.8566Z" fill="url(#paint2_linear_2721_5645)"/>
<path d="M15.48 19.0828C15.48 19.43 15.1985 19.7115 14.8513 19.7115C14.5041 19.7115 14.2227 19.43 14.2227 19.0828C14.2227 18.7356 14.5041 18.4541 14.8513 18.4541C15.1985 18.4541 15.48 18.7356 15.48 19.0828Z" fill="#4AFEBF"/>
</g>
</g>
<defs>
<linearGradient id="paint0_linear_2721_5645" x1="12.0003" y1="17.7207" x2="12.0003" y2="6.27918" gradientUnits="userSpaceOnUse">
<stop stop-color="#4AFEBF"/>
<stop offset="1" stop-color="#51EEDA"/>
</linearGradient>
<linearGradient id="paint1_linear_2721_5645" x1="8.16741" y1="3.75" x2="8.16741" y2="20.25" gradientUnits="userSpaceOnUse">
<stop stop-color="#4AFEBF"/>
<stop offset="1" stop-color="#51EEDA"/>
</linearGradient>
<linearGradient id="paint2_linear_2721_5645" x1="18.5301" y1="18.0298" x2="18.5301" y2="5.97011" gradientUnits="userSpaceOnUse">
<stop stop-color="#4AFEBF"/>
<stop offset="1" stop-color="#51EEDA"/>
</linearGradient>
<clipPath id="clip0_2721_5645">
<rect width="24" height="24" fill="white"/>
</clipPath>
<clipPath id="clip1_2721_5645">
<rect width="24" height="24" fill="white"/>
</clipPath>
</defs>
</svg>
