<svg width="159" height="36" viewBox="0 0 159 36" fill="none" xmlns="http://www.w3.org/2000/svg">
<path d="M39.6392 34.0001V28.1819H41.7131C42.1657 28.1819 42.5407 28.2643 42.8381 28.4291C43.1354 28.5939 43.358 28.8193 43.5057 29.1052C43.6534 29.3893 43.7273 29.7094 43.7273 30.0655C43.7273 30.4234 43.6525 30.7454 43.5028 31.0314C43.3551 31.3155 43.1316 31.5408 42.8324 31.7075C42.535 31.8723 42.161 31.9547 41.7102 31.9547H40.2841V31.2103H41.6307C41.9167 31.2103 42.1487 31.1611 42.3267 31.0626C42.5047 30.9622 42.6354 30.8259 42.7188 30.6535C42.8021 30.4812 42.8438 30.2852 42.8438 30.0655C42.8438 29.8458 42.8021 29.6507 42.7188 29.4802C42.6354 29.3098 42.5038 29.1763 42.3239 29.0797C42.1458 28.9831 41.911 28.9348 41.6193 28.9348H40.517V34.0001H39.6392ZM50.1304 31.091C50.1304 31.7122 50.0167 32.2463 49.7895 32.6933C49.5622 33.1384 49.2506 33.4812 48.8548 33.7217C48.4609 33.9603 48.0129 34.0797 47.5111 34.0797C47.0073 34.0797 46.5575 33.9603 46.1616 33.7217C45.7677 33.4812 45.4571 33.1374 45.2298 32.6905C45.0025 32.2435 44.8889 31.7103 44.8889 31.091C44.8889 30.4698 45.0025 29.9367 45.2298 29.4916C45.4571 29.0446 45.7677 28.7018 46.1616 28.4632C46.5575 28.2227 47.0073 28.1024 47.5111 28.1024C48.0129 28.1024 48.4609 28.2227 48.8548 28.4632C49.2506 28.7018 49.5622 29.0446 49.7895 29.4916C50.0167 29.9367 50.1304 30.4698 50.1304 31.091ZM49.2611 31.091C49.2611 30.6175 49.1843 30.2189 49.0309 29.895C48.8794 29.5693 48.6711 29.323 48.4059 29.1564C48.1427 28.9878 47.8444 28.9035 47.5111 28.9035C47.1758 28.9035 46.8766 28.9878 46.6133 29.1564C46.3501 29.323 46.1417 29.5693 45.9883 29.895C45.8368 30.2189 45.7611 30.6175 45.7611 31.091C45.7611 31.5645 45.8368 31.9641 45.9883 32.2899C46.1417 32.6138 46.3501 32.86 46.6133 33.0285C46.8766 33.1952 47.1758 33.2785 47.5111 33.2785C47.8444 33.2785 48.1427 33.1952 48.4059 33.0285C48.6711 32.86 48.8794 32.6138 49.0309 32.2899C49.1843 31.9641 49.2611 31.5645 49.2611 31.091ZM52.6137 34.0001L51.0001 28.1819H51.9234L53.0569 32.6876H53.1109L54.2899 28.1819H55.2046L56.3836 32.6905H56.4376L57.5683 28.1819H58.4944L56.8779 34.0001H55.9944L54.77 29.6422H54.7245L53.5001 34.0001H52.6137ZM59.6148 34.0001V28.1819H63.2626V28.9376H60.4927V30.7103H63.0722V31.4632H60.4927V33.2444H63.2966V34.0001H59.6148ZM64.7551 34.0001V28.1819H66.829C67.2798 28.1819 67.6538 28.2596 67.9512 28.4149C68.2504 28.5702 68.4739 28.7852 68.6216 29.0598C68.7693 29.3325 68.8432 29.6478 68.8432 30.0058C68.8432 30.3619 68.7684 30.6753 68.6188 30.9461C68.4711 31.2151 68.2476 31.4244 67.9483 31.574C67.651 31.7236 67.2769 31.7984 66.8262 31.7984H65.2551V31.0427H66.7466C67.0307 31.0427 67.2618 31.002 67.4398 30.9206C67.6197 30.8391 67.7514 30.7208 67.8347 30.5655C67.918 30.4102 67.9597 30.2236 67.9597 30.0058C67.9597 29.7861 67.9171 29.5958 67.8318 29.4348C67.7485 29.2738 67.6169 29.1507 67.437 29.0655C67.2589 28.9783 67.025 28.9348 66.7353 28.9348H65.633V34.0001H64.7551ZM67.6273 31.3751L69.0648 34.0001H68.0648L66.6557 31.3751H67.6273ZM70.2314 34.0001V28.1819H73.8791V28.9376H71.1092V30.7103H73.6888V31.4632H71.1092V33.2444H73.9132V34.0001H70.2314ZM77.2552 34.0001H75.3717V28.1819H77.3149C77.885 28.1819 78.3745 28.2984 78.7836 28.5314C79.1927 28.7624 79.5062 29.0948 79.724 29.5285C79.9437 29.9603 80.0535 30.4783 80.0535 31.0825C80.0535 31.6886 79.9427 32.2094 79.7211 32.645C79.5014 33.0806 79.1833 33.4158 78.7666 33.6507C78.3499 33.8836 77.8461 34.0001 77.2552 34.0001ZM76.2495 33.2331H77.2069C77.6501 33.2331 78.0185 33.1497 78.312 32.9831C78.6056 32.8145 78.8253 32.5711 78.9711 32.253C79.117 31.9329 79.1899 31.5427 79.1899 31.0825C79.1899 30.6261 79.117 30.2388 78.9711 29.9206C78.8272 29.6024 78.6122 29.3609 78.3262 29.1961C78.0403 29.0314 77.6851 28.949 77.2609 28.949H76.2495V33.2331ZM83.9023 34.0001V28.1819H86.033C86.4459 28.1819 86.7877 28.2501 87.0586 28.3865C87.3294 28.521 87.5321 28.7037 87.6665 28.9348C87.801 29.1639 87.8682 29.4225 87.8682 29.7103C87.8682 29.9528 87.8237 30.1573 87.7347 30.324C87.6457 30.4888 87.5264 30.6213 87.3768 30.7217C87.229 30.8202 87.0662 30.8922 86.8881 30.9376V30.9944C87.0813 31.0039 87.2698 31.0664 87.4535 31.1819C87.6391 31.2956 87.7925 31.4575 87.9137 31.6677C88.0349 31.878 88.0955 32.1336 88.0955 32.4348C88.0955 32.7321 88.0254 32.9992 87.8853 33.2359C87.747 33.4708 87.533 33.6573 87.2432 33.7956C86.9535 33.9319 86.5832 34.0001 86.1324 34.0001H83.9023ZM84.7802 33.2473H86.0472C86.4677 33.2473 86.7688 33.1658 86.9506 33.003C87.1324 32.8401 87.2234 32.6365 87.2234 32.3922C87.2234 32.2085 87.177 32.0399 87.0841 31.8865C86.9913 31.7331 86.8588 31.6109 86.6864 31.52C86.516 31.4291 86.3133 31.3836 86.0785 31.3836H84.7802V33.2473ZM84.7802 30.699H85.9563C86.1533 30.699 86.3304 30.6611 86.4876 30.5853C86.6466 30.5096 86.7726 30.4035 86.8654 30.2672C86.9601 30.1289 87.0074 29.966 87.0074 29.7785C87.0074 29.538 86.9232 29.3363 86.7546 29.1734C86.586 29.0105 86.3275 28.9291 85.979 28.9291H84.7802V30.699ZM89.0078 28.1819H90.005L91.5249 30.8268H91.5874L93.1073 28.1819H94.1044L91.9936 31.716V34.0001H91.1186V31.716L89.0078 28.1819ZM97.6905 34.0001V28.1819H101.338V28.9376H98.5683V30.7103H101.148V31.4632H98.5683V33.2444H101.372V34.0001H97.6905ZM107.527 28.1819V34.0001H106.72L103.763 29.7331H103.709V34.0001H102.831V28.1819H103.643L106.603 32.4547H106.657V28.1819H107.527ZM109.636 28.1819L111.255 32.9206H111.321L112.94 28.1819H113.889L111.795 34.0001H110.781L108.687 28.1819H109.636ZM115.049 34.0001V28.1819H118.697V28.9376H115.927V30.7103H118.506V31.4632H115.927V33.2444H118.731V34.0001H115.049ZM120.189 34.0001V28.1819H121.067V33.2444H123.703V34.0001H120.189ZM129.852 31.091C129.852 31.7122 129.739 32.2463 129.511 32.6933C129.284 33.1384 128.973 33.4812 128.577 33.7217C128.183 33.9603 127.735 34.0797 127.233 34.0797C126.729 34.0797 126.279 33.9603 125.883 33.7217C125.49 33.4812 125.179 33.1374 124.952 32.6905C124.724 32.2435 124.611 31.7103 124.611 31.091C124.611 30.4698 124.724 29.9367 124.952 29.4916C125.179 29.0446 125.49 28.7018 125.883 28.4632C126.279 28.2227 126.729 28.1024 127.233 28.1024C127.735 28.1024 128.183 28.2227 128.577 28.4632C128.973 28.7018 129.284 29.0446 129.511 29.4916C129.739 29.9367 129.852 30.4698 129.852 31.091ZM128.983 31.091C128.983 30.6175 128.906 30.2189 128.753 29.895C128.601 29.5693 128.393 29.323 128.128 29.1564C127.865 28.9878 127.566 28.9035 127.233 28.9035C126.898 28.9035 126.598 28.9878 126.335 29.1564C126.072 29.323 125.864 29.5693 125.71 29.895C125.559 30.2189 125.483 30.6175 125.483 31.091C125.483 31.5645 125.559 31.9641 125.71 32.2899C125.864 32.6138 126.072 32.86 126.335 33.0285C126.598 33.1952 126.898 33.2785 127.233 33.2785C127.566 33.2785 127.865 33.1952 128.128 33.0285C128.393 32.86 128.601 32.6138 128.753 32.2899C128.906 31.9641 128.983 31.5645 128.983 31.091ZM131.267 34.0001V28.1819H133.341C133.793 28.1819 134.168 28.2643 134.466 28.4291C134.763 28.5939 134.985 28.8193 135.133 29.1052C135.281 29.3893 135.355 29.7094 135.355 30.0655C135.355 30.4234 135.28 30.7454 135.13 31.0314C134.983 31.3155 134.759 31.5408 134.46 31.7075C134.163 31.8723 133.788 31.9547 133.338 31.9547H131.912V31.2103H133.258C133.544 31.2103 133.776 31.1611 133.954 31.0626C134.132 30.9622 134.263 30.8259 134.346 30.6535C134.43 30.4812 134.471 30.2852 134.471 30.0655C134.471 29.8458 134.43 29.6507 134.346 29.4802C134.263 29.3098 134.131 29.1763 133.951 29.0797C133.773 28.9831 133.538 28.9348 133.247 28.9348H132.145V34.0001H131.267Z" fill="#2C2C2C" fill-opacity="0.6"/>
<path d="M50.1523 20.5349V16.6718H46.9731V15.0725H52.0789V21.2477C51.3275 21.7808 50.499 22.1854 49.5934 22.4616C48.6879 22.7313 47.7213 22.8662 46.6937 22.8662C44.4459 22.8662 42.6862 22.2111 41.4145 20.9009C40.1493 19.5843 39.5167 17.7539 39.5167 15.4097C39.5167 13.0591 40.1493 11.2287 41.4145 9.91853C42.6862 8.60191 44.4459 7.9436 46.6937 7.9436C47.6314 7.9436 48.5209 8.05921 49.3623 8.29041C50.21 8.52162 50.9904 8.86202 51.7032 9.3116V11.3828C50.9839 10.7727 50.2196 10.3135 49.4104 10.0052C48.6012 9.69694 47.7502 9.5428 46.8575 9.5428C45.0978 9.5428 43.7748 10.0341 42.8885 11.0168C42.0086 11.9994 41.5687 13.4637 41.5687 15.4097C41.5687 17.3493 42.0086 18.8104 42.8885 19.7929C43.7748 20.7756 45.0978 21.2669 46.8575 21.2669C47.5448 21.2669 48.1581 21.2091 48.6976 21.0935C49.2371 20.9715 49.722 20.7853 50.1523 20.5349Z" fill="#2C2C2C"/>
<path d="M64.7956 16.7493V17.6163H56.6455C56.7226 18.8366 57.0887 19.7678 57.7438 20.4101C58.4053 21.0459 59.3237 21.3638 60.499 21.3638C61.1797 21.3638 61.8381 21.2803 62.4739 21.1134C63.1161 20.9464 63.752 20.6959 64.3814 20.3619V22.0381C63.7455 22.3079 63.0937 22.5134 62.4257 22.6547C61.7578 22.796 61.0802 22.8666 60.393 22.8666C58.6718 22.8666 57.3071 22.3657 56.2987 21.3638C55.2968 20.3619 54.7959 19.0068 54.7959 17.2985C54.7959 15.5323 55.2711 14.1322 56.2216 13.0982C57.1786 12.0578 58.4663 11.5376 60.0848 11.5376C61.5362 11.5376 62.6826 12.0064 63.5239 12.9441C64.3717 13.8754 64.7956 15.1437 64.7956 16.7493ZM63.023 16.2291C63.0101 15.2593 62.7372 14.4854 62.2041 13.9074C61.6775 13.3294 60.9774 13.0404 60.104 13.0404C59.1149 13.0404 58.3218 13.3197 57.7245 13.8785C57.1336 14.4372 56.7932 15.224 56.7033 16.2388L63.023 16.2291Z" fill="#2C2C2C"/>
<path d="M69.458 8.73397V11.7974H73.1091V13.175H69.458V19.0323C69.458 19.9121 69.5768 20.4773 69.8144 20.7278C70.0585 20.9782 70.5498 21.1035 71.2884 21.1035H73.1092V22.587H71.2884C69.9205 22.587 68.9764 22.3333 68.4561 21.826C67.9359 21.3122 67.6758 20.3809 67.6758 19.0322V13.1749H66.3753V11.7973H67.6758V8.73389L69.458 8.73397Z" fill="#2C2C2C"/>
<path d="M79.1179 9.80332V15.2078H81.5648C82.4704 15.2078 83.1704 14.9733 83.665 14.5045C84.1595 14.0357 84.4068 13.3678 84.4068 12.5007C84.4068 11.6401 84.1595 10.9754 83.665 10.5066C83.1705 10.0378 82.4704 9.80336 81.5648 9.80336L79.1179 9.80332ZM77.1719 8.2041H81.5648C83.1769 8.2041 84.3939 8.57019 85.216 9.30238C86.0445 10.0281 86.4587 11.0942 86.4587 12.5007C86.4587 13.9201 86.0445 14.9926 85.216 15.7184C84.3939 16.4441 83.1769 16.807 81.5648 16.807H79.1179V22.5871H77.1719V8.2041Z" fill="#2C2C2C"/>
<path d="M93.0171 17.1638C91.5849 17.1638 90.5926 17.3276 90.0403 17.6551C89.4879 17.9827 89.2118 18.5414 89.2118 19.3313C89.2118 19.9607 89.4173 20.4617 89.8283 20.8342C90.2458 21.2002 90.8109 21.3833 91.5238 21.3833C92.5065 21.3833 93.2932 21.0365 93.8841 20.3429C94.4814 19.6429 94.78 18.7148 94.78 17.5588V17.1638L93.0171 17.1638ZM96.5526 16.4316V22.5875H94.78V20.9498C94.3754 21.6048 93.8712 22.0897 93.2675 22.4045C92.6638 22.7127 91.9253 22.8669 91.0518 22.8669C89.9471 22.8669 89.0672 22.5586 88.4122 21.9421C87.7635 21.3191 87.4391 20.4874 87.4391 19.447C87.4391 18.2332 87.8438 17.318 88.653 16.7015C89.4687 16.0849 90.6825 15.7766 92.2945 15.7766H94.78V15.6032C94.78 14.7875 94.5103 14.1582 93.9708 13.715C93.4377 13.2655 92.6863 13.0407 91.7165 13.0407C91.1 13.0407 90.4995 13.1145 89.9151 13.2623C89.3307 13.41 88.7687 13.6315 88.2292 13.927V12.2893C88.8779 12.0388 89.5073 11.8525 90.1174 11.7305C90.7276 11.6021 91.3216 11.5378 91.8997 11.5378C93.4603 11.5378 94.626 11.9425 95.3967 12.7517C96.1674 13.5609 96.5526 14.7875 96.5526 16.4316Z" fill="#2C2C2C"/>
<path d="M107.098 12.1153V13.7915C106.597 13.5346 106.076 13.3419 105.537 13.2135C104.998 13.085 104.439 13.0208 103.861 13.0208C102.981 13.0208 102.319 13.1557 101.876 13.4254C101.44 13.6952 101.221 14.0998 101.221 14.6393C101.221 15.0503 101.379 15.3747 101.693 15.6123C102.008 15.8435 102.641 16.0651 103.591 16.277L104.198 16.4119C105.457 16.6817 106.35 17.0638 106.876 17.5583C107.409 18.0464 107.676 18.7304 107.676 19.6103C107.676 20.6121 107.278 21.4053 106.481 21.9897C105.691 22.5742 104.603 22.8664 103.215 22.8664C102.637 22.8664 102.034 22.8086 101.404 22.693C100.781 22.5838 100.123 22.4168 99.4294 22.1921V20.3617C100.085 20.7021 100.73 20.959 101.366 21.1324C102.002 21.2993 102.631 21.3828 103.254 21.3828C104.089 21.3828 104.731 21.2415 105.181 20.9589C105.63 20.6699 105.855 20.2653 105.855 19.7451C105.855 19.2634 105.691 18.8941 105.364 18.6373C105.043 18.3804 104.333 18.1331 103.235 17.8955L102.618 17.751C101.52 17.5198 100.727 17.1665 100.239 16.6913C99.7506 16.2096 99.5066 15.5513 99.5066 14.7164C99.5066 13.7016 99.8662 12.9181 100.586 12.3657C101.305 11.8134 102.326 11.5372 103.649 11.5372C104.304 11.5372 104.921 11.5854 105.499 11.6817C106.077 11.7781 106.609 11.9226 107.098 12.1153Z" fill="#2C2C2C"/>
<path d="M117.386 12.1153V13.7915C116.885 13.5346 116.365 13.3419 115.825 13.2135C115.286 13.085 114.727 13.0208 114.149 13.0208C113.269 13.0208 112.607 13.1557 112.164 13.4254C111.728 13.6952 111.509 14.0998 111.509 14.6393C111.509 15.0503 111.667 15.3747 111.981 15.6123C112.296 15.8435 112.929 16.0651 113.879 16.277L114.486 16.4119C115.745 16.6817 116.638 17.0638 117.164 17.5583C117.697 18.0464 117.964 18.7304 117.964 19.6103C117.964 20.6121 117.566 21.4053 116.769 21.9897C115.979 22.5742 114.891 22.8664 113.503 22.8664C112.925 22.8664 112.322 22.8086 111.692 22.693C111.069 22.5838 110.411 22.4168 109.717 22.1921V20.3617C110.373 20.7021 111.018 20.959 111.654 21.1324C112.29 21.2993 112.919 21.3828 113.542 21.3828C114.377 21.3828 115.019 21.2415 115.469 20.9589C115.918 20.6699 116.143 20.2653 116.143 19.7451C116.143 19.2634 115.979 18.8941 115.652 18.6373C115.331 18.3804 114.621 18.1331 113.523 17.8955L112.906 17.751C111.808 17.5198 111.015 17.1665 110.527 16.6913C110.039 16.2096 109.795 15.5513 109.795 14.7164C109.795 13.7016 110.154 12.9181 110.873 12.3657C111.593 11.8134 112.614 11.5372 113.937 11.5372C114.592 11.5372 115.209 11.5854 115.787 11.6817C116.365 11.7781 116.898 11.9226 117.386 12.1153Z" fill="#2C2C2C"/>
<path d="M120.577 20.684H122.158V22.5871H120.577V20.684Z" fill="#2C2C2C"/>
<path d="M125.267 14.1953H126.645V22.5873H125.267V14.1953ZM125.267 10.9285H126.645V12.6743H125.267V10.9285Z" fill="#2C2C2C"/>
<path d="M134.867 14.4423V15.7461C134.478 15.5462 134.073 15.3964 133.653 15.2965C133.234 15.1966 132.799 15.1466 132.35 15.1466C131.665 15.1466 131.151 15.2515 130.806 15.4613C130.466 15.6711 130.297 15.9858 130.297 16.4054C130.297 16.7251 130.419 16.9774 130.664 17.1622C130.908 17.342 131.401 17.5144 132.14 17.6792L132.612 17.7841C133.591 17.9939 134.285 18.2911 134.695 18.6758C135.109 19.0554 135.317 19.5874 135.317 20.2717C135.317 21.051 135.007 21.6679 134.388 22.1225C133.773 22.577 132.927 22.8043 131.848 22.8043C131.398 22.8043 130.928 22.7594 130.439 22.6694C129.954 22.5845 129.442 22.4546 128.903 22.2798V20.8562C129.412 21.1209 129.914 21.3207 130.409 21.4556C130.903 21.5855 131.393 21.6504 131.878 21.6504C132.527 21.6504 133.026 21.5405 133.376 21.3207C133.726 21.0959 133.901 20.7812 133.901 20.3766C133.901 20.002 133.773 19.7148 133.518 19.515C133.269 19.3151 132.717 19.1228 131.863 18.938L131.383 18.8256C130.529 18.6458 129.912 18.3711 129.532 18.0014C129.153 17.6268 128.963 17.1148 128.963 16.4653C128.963 15.6761 129.243 15.0667 129.802 14.6371C130.361 14.2075 131.156 13.9927 132.185 13.9927C132.694 13.9927 133.174 14.0301 133.623 14.1051C134.073 14.18 134.488 14.2924 134.867 14.4423Z" fill="#2C2C2C"/>
<path d="M140.169 9.3053H137.686V3.42798H139.96C140.162 3.42798 140.358 3.44437 140.546 3.47716C140.738 3.50995 140.926 3.56733 141.112 3.6493C141.3 3.72854 141.463 3.82827 141.6 3.94849C141.739 4.06599 141.851 4.219 141.936 4.40753C142.023 4.59607 142.067 4.80782 142.067 5.04281C142.067 5.59201 141.795 6.0087 141.251 6.29287V6.30106C141.934 6.59343 142.276 7.06066 142.276 7.70277C142.276 7.93229 142.238 8.13995 142.161 8.32575C142.085 8.50882 141.982 8.66046 141.854 8.78069C141.725 8.90091 141.57 9.00201 141.387 9.08398C141.206 9.16322 141.015 9.2206 140.813 9.25612C140.613 9.28891 140.399 9.3053 140.169 9.3053ZM138.759 4.36245V5.87891H139.985C140.305 5.87891 140.55 5.81334 140.723 5.68218C140.897 5.5483 140.985 5.36796 140.985 5.14117C140.985 4.86794 140.896 4.66984 140.718 4.54688C140.541 4.42393 140.272 4.36245 139.911 4.36245H138.759ZM138.759 6.79699V8.37493H140.112C140.486 8.37493 140.759 8.31209 140.932 8.1864C141.106 8.06071 141.194 7.86808 141.194 7.6085C141.194 7.36259 141.1 7.16586 140.911 7.01831C140.723 6.87076 140.464 6.79699 140.136 6.79699H138.759Z" fill="#CC453C"/>
<path d="M147.547 9.3053H143.35V3.42798H147.506V4.39524H144.424V5.86252H147.354V6.82978H144.424V8.33804H147.547V9.3053Z" fill="#CC453C"/>
<path d="M151.067 9.3053H149.993V4.41163H148.166V3.42798H152.891V4.41163H151.067V9.3053Z" fill="#CC453C"/>
<path d="M153.715 9.3053H152.498L155.108 3.42798H156.125L158.728 9.3053H157.51L156.982 8.08803H154.252L153.715 9.3053ZM155.604 4.91575L154.629 7.13307H156.604L155.621 4.91575H155.604Z" fill="#CC453C"/>
<path d="M24.1263 14.5866C23.6854 14.1457 23.6854 13.4282 24.1263 12.9873C24.5672 12.5464 25.2847 12.5464 25.7256 12.9873C26.1665 13.4282 26.1665 14.1457 25.7256 14.5866C25.2847 15.0275 24.5672 15.0275 24.1263 14.5866Z" fill="#2952E1"/>
<path fill-rule="evenodd" clip-rule="evenodd" d="M35.166 10.0479C36.1083 10.9902 36.1083 12.5204 35.166 13.4627L22.8986 25.7301C21.9563 26.6724 20.4262 26.6724 19.4838 25.7301L17.3831 23.6293L17.8499 23.1625C18.481 22.5314 18.481 21.5026 17.8499 20.8629C17.2361 20.2491 16.2592 20.2318 15.6195 20.7938L10.6918 25.7214C9.74949 26.6638 8.21931 26.6638 7.27699 25.7214L0.706735 19.1512C-0.235578 18.2089 -0.235578 16.6787 0.706735 15.7364L12.8963 3.54682C13.8386 2.60451 15.3688 2.60451 16.3111 3.54682L20.7806 8.01633L25.2501 3.54682C26.1924 2.60451 27.7226 2.60451 28.6649 3.54682L30.7397 5.62164L30.2556 6.08848L30.247 6.09712L30.2383 6.10577C29.6072 6.73686 29.6072 7.76562 30.2383 8.40536C30.8694 9.03645 31.8982 9.03645 32.5379 8.40536C32.5466 8.39671 32.5466 8.39671 32.5552 8.38807L32.5638 8.37942L33.0307 7.8953L35.166 10.0479ZM32.9788 9.7367C31.8377 10.4802 30.2988 10.3505 29.296 9.34767C28.2932 8.34484 28.1635 6.80602 28.907 5.66487L27.7312 4.48914C27.299 4.05688 26.6074 4.05688 26.1838 4.48914L21.7056 8.96729C22.086 9.41683 22.0601 10.0825 21.6451 10.5061C21.2215 10.9297 20.5558 10.947 20.1063 10.5666L13.9251 16.7479C13.4928 17.1801 13.4928 17.8717 13.9251 18.2953L15.144 19.5143C16.2765 18.7967 17.7981 18.9351 18.7836 19.9292C19.7691 20.9148 19.9075 22.4363 19.1986 23.5688L20.4175 24.7878C20.8498 25.22 21.5414 25.22 21.965 24.7878L28.1462 18.6065C27.7658 18.1656 27.7918 17.4913 28.2067 17.0764C28.6303 16.6528 29.296 16.6355 29.7369 17.0159L34.2237 12.5291C34.656 12.0968 34.656 11.4052 34.2237 10.9816L32.9788 9.7367Z" fill="#2952E1"/>
</svg>