<svg width="185" height="158" viewBox="0 0 185 158" fill="none" xmlns="http://www.w3.org/2000/svg">
<g filter="url(#filter0_d)">
<path d="M12.3171 70.7597C10.6253 69.783 10.0457 67.6198 11.0224 65.928L28.5309 35.6025C29.5076 33.9107 31.6709 33.3311 33.3626 34.3078L88.5 66.1414C90.1918 67.1181 90.7714 69.2814 89.7947 70.9731L72.2862 101.299C71.3095 102.99 69.1462 103.57 67.4545 102.593L12.3171 70.7597Z" fill="#51EEDA"/>
<path fill-rule="evenodd" clip-rule="evenodd" d="M32.494 39.5243L16.2691 67.6268L68.2667 97.6476L84.4916 69.5452L32.494 39.5243ZM15.3027 67.8857L68.5256 98.614L85.458 69.2862L32.2351 38.558L15.3027 67.8857Z" fill="white"/>
<path d="M57.1737 56.7336C63.6446 60.4696 65.8618 68.744 62.1258 75.2149C58.3898 81.6859 50.1154 83.903 43.6444 80.167C37.1735 76.431 34.9564 68.1566 38.6924 61.6857C42.4284 55.2147 50.7027 52.9976 57.1737 56.7336Z" fill="#35C4B1"/>
</g>
<g filter="url(#filter1_d)">
<path d="M34.9779 22.7231C34.3979 20.5585 35.6825 18.3335 37.8471 17.7535L76.6492 7.35653C78.8138 6.77652 81.0388 8.06111 81.6188 10.2257L100.522 80.7749C101.102 82.9395 99.8178 85.1645 97.6532 85.7445L58.8511 96.1415C56.6865 96.7215 54.4615 95.4369 53.8815 93.2723L34.9779 22.7231Z" fill="#51EEDA"/>
<path fill-rule="evenodd" clip-rule="evenodd" d="M76.6839 13.7535L40.7263 23.3883L58.5535 89.9201L94.511 80.2853L76.6839 13.7535ZM39.7324 22.8145L57.9796 90.914L95.505 80.8591L77.2577 12.7596L39.7324 22.8145Z" fill="white"/>
<path d="M82.7426 47.7321C84.9611 56.0118 80.0476 64.5223 71.7679 66.7408C63.4882 68.9593 54.9777 64.0458 52.7592 55.7661C50.5407 47.4864 55.4542 38.9759 63.7339 36.7574C72.0136 34.5389 80.5241 39.4524 82.7426 47.7321Z" fill="#35C4B1"/>
</g>
<g filter="url(#filter2_d)">
<path d="M84.7063 8.75065C85.5718 6.68354 87.9492 5.70943 90.0163 6.57491L127.07 22.0892C129.137 22.9547 130.112 25.332 129.246 27.3991L101.038 94.7701C100.173 96.8373 97.7955 97.8114 95.7283 96.9459L58.6743 81.4316C56.6072 80.5661 55.6331 78.1888 56.4986 76.1217L84.7063 8.75065Z" fill="#51EEDA"/>
<path fill-rule="evenodd" clip-rule="evenodd" d="M123.183 27.1704L88.8453 12.7934L62.2438 76.328L96.5815 90.705L123.183 27.1704ZM88.4102 11.7314L61.1818 76.7632L97.0167 91.767L124.245 26.7353L88.4102 11.7314Z" fill="white"/>
<path d="M107.189 57.7548C103.879 65.6615 94.7855 69.3875 86.8788 66.077C78.9721 62.7666 75.2461 53.6732 78.5566 45.7665C81.8671 37.8598 90.9604 34.1339 98.8671 37.4443C106.774 40.7548 110.5 49.8481 107.189 57.7548Z" fill="#35C4B1"/>
</g>
<g filter="url(#filter3_d)">
<path d="M141.785 29.6211C144.177 28.2404 147.235 29.0598 148.615 31.4512L173.365 74.3195C174.746 76.7109 173.927 79.7689 171.535 81.1496L93.5928 126.15C91.2014 127.53 88.1434 126.711 86.7627 124.319L62.0127 81.4512C60.632 79.0598 61.4514 76.0018 63.8428 74.6211L141.785 29.6211Z" fill="#51EEDA"/>
<path fill-rule="evenodd" clip-rule="evenodd" d="M165.761 76.4003L142.825 36.6746L69.3215 79.1121L92.2571 118.838L165.761 76.4003ZM143.191 35.3086L67.9555 78.7461L91.8911 120.204L167.127 76.7663L143.191 35.3086Z" fill="white"/>
<path d="M127.252 94.4477C118.104 99.729 106.408 96.5948 101.126 87.4475C95.8453 78.3002 98.9794 66.6035 108.127 61.3223C117.274 56.041 128.971 59.1752 134.252 68.3225C139.533 77.4698 136.399 89.1665 127.252 94.4477Z" fill="#35C4B1"/>
</g>
<rect x="21.0078" y="100.149" width="131.5" height="57" rx="10" fill="white"/>
<path fill-rule="evenodd" clip-rule="evenodd" d="M63.646 129.631L63.6649 146.051L70.2428 146.07C75.4553 146.085 76.8332 146.07 76.8806 145.995C76.9137 145.943 76.9411 143.437 76.9418 140.425L76.9429 134.951L85.5003 134.972C92.5263 134.989 94.1047 135.011 94.3209 135.096C95.2513 135.46 95.751 135.834 96.0873 136.417C96.4842 137.106 96.5025 137.342 96.5025 141.763C96.5025 144.011 96.5231 145.904 96.5482 145.969C96.5894 146.077 97.2452 146.088 103.197 146.088H109.801L109.846 145.919C109.919 145.646 109.891 137.458 109.814 136.798C109.657 135.433 109.563 135.068 109.082 133.928C108.555 132.677 107.431 131.358 106.219 130.567C105.796 130.291 104.793 129.764 104.692 129.764C104.648 129.764 104.498 129.709 104.357 129.642C104.078 129.51 104.082 129.387 104.364 129.387C104.463 129.387 104.564 129.354 104.59 129.312C104.615 129.271 104.687 129.237 104.749 129.237C104.848 129.237 105.336 129.012 105.909 128.701C106.652 128.297 107.712 127.328 108.132 126.668C108.389 126.262 108.84 125.359 108.925 125.08C109.284 123.893 109.306 123.733 109.311 122.165C109.317 120.582 109.301 120.458 108.942 119.231C108.767 118.635 108.34 117.754 107.993 117.276C107.607 116.742 106.626 115.788 106.116 115.451C105.594 115.105 104.685 114.634 104.214 114.465C104.007 114.391 103.77 114.3 103.687 114.264C103.256 114.076 101.744 113.715 100.527 113.51C99.1803 113.283 98.1636 113.269 81.0992 113.24L63.627 113.211L63.646 129.631ZM94.4871 122.984C94.9051 123.096 95.2617 123.324 95.48 123.619C95.711 123.931 95.7062 124.876 95.4718 125.253C95.251 125.608 94.7836 125.844 94.1373 125.928C93.8437 125.967 89.8797 125.998 85.2746 126L76.9429 126.002V124.42V122.839L85.5379 122.863C92.1825 122.882 94.2132 122.91 94.4871 122.984Z" fill="black"/>
<defs>
<filter id="filter0_d" x="0.548828" y="27.833" width="99.7212" height="89.2344" filterUnits="userSpaceOnUse" color-interpolation-filters="sRGB">
<feFlood flood-opacity="0" result="BackgroundImageFix"/>
<feColorMatrix in="SourceAlpha" type="matrix" values="0 0 0 0 0 0 0 0 0 0 0 0 0 0 0 0 0 0 127 0" result="hardAlpha"/>
<feOffset dy="4"/>
<feGaussianBlur stdDeviation="5"/>
<feColorMatrix type="matrix" values="0 0 0 0 0 0 0 0 0 0 0 0 0 0 0 0 0 0 0.5 0"/>
<feBlend mode="normal" in2="BackgroundImageFix" result="effect1_dropShadow"/>
<feBlend mode="normal" in="SourceGraphic" in2="effect1_dropShadow" result="shape"/>
</filter>
<filter id="filter1_d" x="24.8379" y="1.21729" width="85.823" height="109.063" filterUnits="userSpaceOnUse" color-interpolation-filters="sRGB">
<feFlood flood-opacity="0" result="BackgroundImageFix"/>
<feColorMatrix in="SourceAlpha" type="matrix" values="0 0 0 0 0 0 0 0 0 0 0 0 0 0 0 0 0 0 127 0" result="hardAlpha"/>
<feOffset dy="4"/>
<feGaussianBlur stdDeviation="5"/>
<feColorMatrix type="matrix" values="0 0 0 0 0 0 0 0 0 0 0 0 0 0 0 0 0 0 0.5 0"/>
<feBlend mode="normal" in2="BackgroundImageFix" result="effect1_dropShadow"/>
<feBlend mode="normal" in="SourceGraphic" in2="effect1_dropShadow" result="shape"/>
</filter>
<filter id="filter2_d" x="46.1836" y="0.258789" width="93.3793" height="111.003" filterUnits="userSpaceOnUse" color-interpolation-filters="sRGB">
<feFlood flood-opacity="0" result="BackgroundImageFix"/>
<feColorMatrix in="SourceAlpha" type="matrix" values="0 0 0 0 0 0 0 0 0 0 0 0 0 0 0 0 0 0 127 0" result="hardAlpha"/>
<feOffset dy="4"/>
<feGaussianBlur stdDeviation="5"/>
<feColorMatrix type="matrix" values="0 0 0 0 0 0 0 0 0 0 0 0 0 0 0 0 0 0 0.5 0"/>
<feBlend mode="normal" in2="BackgroundImageFix" result="effect1_dropShadow"/>
<feBlend mode="normal" in="SourceGraphic" in2="effect1_dropShadow" result="shape"/>
</filter>
<filter id="filter3_d" x="51.3418" y="22.9502" width="132.694" height="117.87" filterUnits="userSpaceOnUse" color-interpolation-filters="sRGB">
<feFlood flood-opacity="0" result="BackgroundImageFix"/>
<feColorMatrix in="SourceAlpha" type="matrix" values="0 0 0 0 0 0 0 0 0 0 0 0 0 0 0 0 0 0 127 0" result="hardAlpha"/>
<feOffset dy="4"/>
<feGaussianBlur stdDeviation="5"/>
<feColorMatrix type="matrix" values="0 0 0 0 0 0 0 0 0 0 0 0 0 0 0 0 0 0 0.5 0"/>
<feBlend mode="normal" in2="BackgroundImageFix" result="effect1_dropShadow"/>
<feBlend mode="normal" in="SourceGraphic" in2="effect1_dropShadow" result="shape"/>
</filter>
</defs>
</svg>
