<svg width="141" height="140" viewBox="0 0 141 140" fill="none" xmlns="http://www.w3.org/2000/svg">
<path d="M20 128.108H2V102.908H19.82V107.048H6.608V113.348H19.172V117.488H6.608V123.968H20V128.108Z" fill="white"/>
<path d="M29.4528 128.108H24.9528V109.316H27.8688L28.7328 112.376C29.5248 110.972 31.6488 108.92 34.6728 108.92C38.6328 108.92 41.5848 110.972 41.5848 117.092V128.108H37.1208V117.704C37.1208 114.464 35.6088 113.096 33.3768 113.096C31.0368 113.096 29.4528 114.968 29.4528 117.92V128.108Z" fill="white"/>
<path d="M56.2495 128.108H51.7855L44.2615 109.316H48.9775L53.9815 122.384H54.0535L59.0575 109.316H63.7375L56.2495 128.108Z" fill="white"/>
<path d="M83.569 120.44H69.817C70.357 123.104 72.265 124.58 75.073 124.58C77.125 124.58 78.349 124.184 80.329 122.816L82.417 125.84C80.113 127.748 77.989 128.504 74.929 128.504C69.241 128.504 65.209 124.22 65.209 118.712C65.209 113.204 69.421 108.92 74.749 108.92C80.545 108.92 83.569 113.42 83.569 118.784V120.44ZM69.781 117.2H79.141C78.925 114.932 77.593 112.772 74.785 112.772C72.229 112.772 70.285 114.356 69.781 117.2Z" fill="white"/>
<path d="M92.3473 128.108H87.8473V101H92.3473V128.108Z" fill="white"/>
<path d="M96.6035 118.712C96.6035 113.204 100.743 108.92 106.359 108.92C111.975 108.92 116.116 113.204 116.116 118.712C116.116 124.22 111.975 128.504 106.359 128.504C100.743 128.504 96.6035 124.22 96.6035 118.712ZM106.359 124.4C109.419 124.4 111.544 121.952 111.544 118.712C111.544 115.436 109.419 113.024 106.359 113.024C103.299 113.024 101.14 115.436 101.14 118.712C101.14 121.952 103.299 124.4 106.359 124.4Z" fill="white"/>
<path d="M124.867 135.02H120.367V109.316H123.247L124.039 112.124C125.407 110.432 127.675 108.92 131.059 108.92C136.099 108.92 139.699 113.24 139.699 118.712C139.699 124.148 136.099 128.504 131.059 128.504C127.963 128.504 125.839 126.812 124.867 125.48V135.02ZM129.943 124.4C133.039 124.4 135.127 121.952 135.127 118.712C135.127 115.436 133.039 113.024 129.943 113.024C126.955 113.024 124.831 115.508 124.831 118.712C124.831 121.88 126.955 124.4 129.943 124.4Z" fill="white"/>
<path d="M56.5954 33.4974C55.8233 32.8874 55.6919 31.7669 56.3019 30.9948L59.3226 27.1717C59.9326 26.3996 61.0531 26.2682 61.8252 26.8782C62.5974 27.4883 62.7287 28.6088 62.1187 29.3809L59.0981 33.204C58.488 33.9761 57.3675 34.1075 56.5954 33.4974Z" fill="#4AFEBF"/>
<path d="M76.8671 40.1674C76.8671 43.4077 74.2403 46.0345 71 46.0345C67.7597 46.0345 65.1329 43.4077 65.1329 40.1674C65.1329 36.9271 67.7597 34.3003 71 34.3003C74.2403 34.3003 76.8671 36.9271 76.8671 40.1674Z" fill="#51EEDA"/>
<path fill-rule="evenodd" clip-rule="evenodd" d="M74.8894 64.1644C72.8512 66.563 69.1488 66.563 67.1107 64.1644L50.2356 44.3049C48.6163 42.3992 48.6162 39.6009 50.2356 37.6952L51.9238 35.7084C52.8364 34.6344 54.4469 34.5035 55.5209 35.4162C56.5949 36.3288 56.7258 37.9393 55.8132 39.0133L54.1249 41.0001L71 60.8595L75.8903 55.1044C76.8029 54.0304 78.4134 53.8995 79.4874 54.8121C80.5614 55.7248 80.6923 57.3352 79.7797 58.4093L74.8894 64.1644ZM85.4392 47.8078C84.3652 46.8952 84.2343 45.2847 85.1469 44.2107L87.8751 41.0001L71 21.1406L67.4459 25.3232C66.5333 26.3972 64.9228 26.5281 63.8488 25.6155C62.7748 24.7028 62.644 23.0924 63.5566 22.0183L67.1107 17.8357C69.1488 15.4371 72.8512 15.4371 74.8894 17.8357L91.7644 37.6952C93.3838 39.6009 93.3838 42.3992 91.7644 44.3049L89.0363 47.5156C88.1237 48.5896 86.5132 48.7204 85.4392 47.8078Z" fill="url(#paint0_linear_5357_10884)"/>
<path fill-rule="evenodd" clip-rule="evenodd" d="M71 10.1039C53.9365 10.1039 40.1039 23.9365 40.1039 41C40.1039 58.0635 53.9365 71.8962 71 71.8962C72.4094 71.8962 73.5519 73.0387 73.5519 74.4481C73.5519 75.8575 72.4094 77 71 77C51.1178 77 35 60.8823 35 41C35 21.1178 51.1178 5 71 5C72.4094 5 73.5519 6.14254 73.5519 7.55193C73.5519 8.96132 72.4094 10.1039 71 10.1039Z" fill="url(#paint1_linear_5357_10884)"/>
<path fill-rule="evenodd" clip-rule="evenodd" d="M92.7294 66.5565C91.7374 65.5554 91.7448 63.9396 92.7459 62.9476C98.3992 57.3459 101.896 49.5838 101.896 41.0003C101.896 32.4167 98.3992 24.6546 92.7459 19.0529C91.7448 18.0609 91.7374 16.4451 92.7294 15.444C93.7214 14.4428 95.3372 14.4354 96.3384 15.4275C102.919 21.9483 107 31.0001 107 41.0003C107 51.0004 102.919 60.0522 96.3384 66.5731C95.3372 67.5651 93.7214 67.5577 92.7294 66.5565Z" fill="url(#paint2_linear_5357_10884)"/>
<path d="M86.1841 71.9069C86.1841 73.422 84.9559 74.6502 83.4408 74.6502C81.9257 74.6502 80.6975 73.422 80.6975 71.9069C80.6975 70.3918 81.9257 69.1636 83.4408 69.1636C84.9559 69.1636 86.1841 70.3918 86.1841 71.9069Z" fill="#4AFEBF"/>
<defs>
<linearGradient id="paint0_linear_5357_10884" x1="71" y1="65.9634" x2="71" y2="16.0367" gradientUnits="userSpaceOnUse">
<stop stop-color="#4AFEBF"/>
<stop offset="1" stop-color="#51EEDA"/>
</linearGradient>
<linearGradient id="paint1_linear_5357_10884" x1="54.276" y1="5" x2="54.276" y2="77" gradientUnits="userSpaceOnUse">
<stop stop-color="#4AFEBF"/>
<stop offset="1" stop-color="#51EEDA"/>
</linearGradient>
<linearGradient id="paint2_linear_5357_10884" x1="99.4951" y1="67.3123" x2="99.4951" y2="14.6883" gradientUnits="userSpaceOnUse">
<stop stop-color="#4AFEBF"/>
<stop offset="1" stop-color="#51EEDA"/>
</linearGradient>
</defs>
</svg>
