<svg width="138" height="131" viewBox="0 0 138 131" fill="none" xmlns="http://www.w3.org/2000/svg">
<path d="M18 123.108H0V97.908H17.82V102.048H4.608V108.348H17.172V112.488H4.608V118.968H18V123.108Z" fill="#51EEDA"/>
<path d="M27.4528 123.108H22.9528V104.316H25.8688L26.7328 107.376C27.5248 105.972 29.6488 103.92 32.6728 103.92C36.6328 103.92 39.5848 105.972 39.5848 112.092V123.108H35.1208V112.704C35.1208 109.464 33.6088 108.096 31.3768 108.096C29.0368 108.096 27.4528 109.968 27.4528 112.92V123.108Z" fill="#51EEDA"/>
<path d="M54.2495 123.108H49.7855L42.2615 104.316H46.9775L51.9815 117.384H52.0535L57.0575 104.316H61.7375L54.2495 123.108Z" fill="#51EEDA"/>
<path d="M81.569 115.44H67.817C68.357 118.104 70.265 119.58 73.073 119.58C75.125 119.58 76.349 119.184 78.329 117.816L80.417 120.84C78.113 122.748 75.989 123.504 72.929 123.504C67.241 123.504 63.209 119.22 63.209 113.712C63.209 108.204 67.421 103.92 72.749 103.92C78.545 103.92 81.569 108.42 81.569 113.784V115.44ZM67.781 112.2H77.141C76.925 109.932 75.593 107.772 72.785 107.772C70.229 107.772 68.285 109.356 67.781 112.2Z" fill="#51EEDA"/>
<path d="M90.3473 123.108H85.8473V96H90.3473V123.108Z" fill="#51EEDA"/>
<path d="M94.6035 113.712C94.6035 108.204 98.7435 103.92 104.359 103.92C109.975 103.92 114.116 108.204 114.116 113.712C114.116 119.22 109.975 123.504 104.359 123.504C98.7435 123.504 94.6035 119.22 94.6035 113.712ZM104.359 119.4C107.419 119.4 109.544 116.952 109.544 113.712C109.544 110.436 107.419 108.024 104.359 108.024C101.299 108.024 99.1395 110.436 99.1395 113.712C99.1395 116.952 101.299 119.4 104.359 119.4Z" fill="#51EEDA"/>
<path d="M122.867 130.02H118.367V104.316H121.247L122.039 107.124C123.407 105.432 125.675 103.92 129.059 103.92C134.099 103.92 137.699 108.24 137.699 113.712C137.699 119.148 134.099 123.504 129.059 123.504C125.963 123.504 123.839 121.812 122.867 120.48V130.02ZM127.943 119.4C131.039 119.4 133.127 116.952 133.127 113.712C133.127 110.436 131.039 108.024 127.943 108.024C124.955 108.024 122.831 110.508 122.831 113.712C122.831 116.88 124.955 119.4 127.943 119.4Z" fill="#51EEDA"/>
<path d="M54.5954 28.4974C53.8233 27.8874 53.6919 26.7669 54.302 25.9948L57.3226 22.1717C57.9327 21.3996 59.0532 21.2682 59.8253 21.8782V21.8782C60.5974 22.4883 60.7288 23.6088 60.1187 24.3809L57.0981 28.204C56.4881 28.9761 55.3676 29.1075 54.5954 28.4974V28.4974Z" fill="#4AFEBF"/>
<path d="M74.8671 35.1674C74.8671 38.4077 72.2403 41.0345 69 41.0345C65.7597 41.0345 63.1329 38.4077 63.1329 35.1674C63.1329 31.9271 65.7597 29.3003 69 29.3003C72.2403 29.3003 74.8671 31.9271 74.8671 35.1674Z" fill="#51EEDA"/>
<path fill-rule="evenodd" clip-rule="evenodd" d="M72.8893 59.1644C70.8511 61.563 67.1488 61.563 65.1106 59.1644L48.2355 39.3049C46.6162 37.3992 46.6162 34.6009 48.2355 32.6952L49.9237 30.7084C50.8364 29.6344 52.4468 29.5035 53.5209 30.4162C54.5949 31.3288 54.7257 32.9393 53.8131 34.0133L52.1249 36.0001L69 55.8595L73.8902 50.1044C74.8028 49.0304 76.4133 48.8995 77.4874 49.8121C78.5614 50.7248 78.6922 52.3352 77.7796 53.4093L72.8893 59.1644ZM83.4391 42.8078C82.3651 41.8952 82.2343 40.2847 83.1469 39.2107L85.875 36.0001L69 16.1406L65.4459 20.3232C64.5333 21.3972 62.9228 21.5281 61.8487 20.6155C60.7747 19.7028 60.6439 18.0924 61.5565 17.0183L65.1106 12.8357C67.1488 10.4371 70.8511 10.4371 72.8893 12.8357L89.7644 32.6952C91.3837 34.6009 91.3837 37.3992 89.7644 39.3049L87.0362 42.5156C86.1236 43.5896 84.5131 43.7204 83.4391 42.8078Z" fill="url(#paint0_linear_7001_81)"/>
<path fill-rule="evenodd" clip-rule="evenodd" d="M69 5.10386C51.9365 5.10386 38.1039 18.9365 38.1039 36C38.1039 53.0635 51.9365 66.8962 69 66.8962C70.4094 66.8962 71.552 68.0387 71.552 69.4481C71.552 70.8575 70.4094 72 69 72C49.1178 72 33 55.8823 33 36C33 16.1178 49.1178 0 69 0C70.4094 0 71.552 1.14254 71.552 2.55193C71.552 3.96132 70.4094 5.10386 69 5.10386Z" fill="url(#paint1_linear_7001_81)"/>
<path fill-rule="evenodd" clip-rule="evenodd" d="M90.7294 61.5565C89.7374 60.5554 89.7448 58.9396 90.7459 57.9476C96.3992 52.3459 99.8961 44.5838 99.8961 36.0003C99.8961 27.4167 96.3992 19.6546 90.7459 14.0529C89.7448 13.0609 89.7374 11.4451 90.7294 10.444C91.7214 9.44283 93.3372 9.43544 94.3384 10.4275C100.919 16.9483 105 26.0001 105 36.0003C105 46.0004 100.919 55.0522 94.3384 61.5731C93.3372 62.5651 91.7214 62.5577 90.7294 61.5565Z" fill="url(#paint2_linear_7001_81)"/>
<path d="M84.1842 66.9069C84.1842 68.422 82.9559 69.6502 81.4408 69.6502C79.9257 69.6502 78.6975 68.422 78.6975 66.9069C78.6975 65.3918 79.9257 64.1636 81.4408 64.1636C82.9559 64.1636 84.1842 65.3918 84.1842 66.9069Z" fill="#4AFEBF"/>
<defs>
<linearGradient id="paint0_linear_7001_81" x1="69" y1="60.9634" x2="69" y2="11.0367" gradientUnits="userSpaceOnUse">
<stop stop-color="#4AFEBF"/>
<stop offset="1" stop-color="#51EEDA"/>
</linearGradient>
<linearGradient id="paint1_linear_7001_81" x1="52.276" y1="0" x2="52.276" y2="72" gradientUnits="userSpaceOnUse">
<stop stop-color="#4AFEBF"/>
<stop offset="1" stop-color="#51EEDA"/>
</linearGradient>
<linearGradient id="paint2_linear_7001_81" x1="97.4951" y1="62.3123" x2="97.4951" y2="9.68825" gradientUnits="userSpaceOnUse">
<stop stop-color="#4AFEBF"/>
<stop offset="1" stop-color="#51EEDA"/>
</linearGradient>
</defs>
</svg>
