<svg width="143" height="63" viewBox="0 0 143 63" fill="none" xmlns="http://www.w3.org/2000/svg">
<path d="M140.436 9.96133C139.448 10.0175 138.246 10.1278 136.961 10.3389C133.706 10.8732 129.784 12.0736 127.534 14.8088C124.832 17.2909 123.633 21.0825 123.098 24.184C122.828 25.7503 122.723 27.1644 122.686 28.187C122.673 28.539 122.668 28.845 122.667 29.0955C122.413 29.0038 122.095 28.8965 121.722 28.7845C120.687 28.4737 119.222 28.1252 117.5 27.9736C114.055 27.6705 109.553 28.1538 105.413 31.3295C101.529 34.2534 99.5945 38.1459 98.6309 41.2883C98.1486 42.861 97.9074 44.2522 97.7866 45.2521C97.7393 45.6435 97.7104 45.9756 97.6928 46.2356C97.3867 46.1592 96.9763 46.0644 96.4837 45.9682C95.365 45.7497 93.8158 45.5231 92.0975 45.4928C88.6885 45.4328 84.4924 46.1456 81.75 49.3837C79.5355 51.6154 78.3328 55.0362 77.5663 57.8168C77.3727 58.5191 77.2054 59.1867 77.0567 59.7898C77.0291 59.9021 77.0021 60.0119 76.9757 60.1192C76.8598 60.5911 76.756 61.0138 76.6582 61.3795C76.5419 61.8145 76.4413 62.1407 76.3496 62.3574C76.2314 62.1976 76.0851 61.9554 75.9072 61.6261C75.6684 61.1841 75.4028 60.6439 75.0988 60.0257C74.8598 59.5397 74.5972 59.0056 74.3052 58.4329C73.0072 55.8874 71.1968 52.7204 68.7453 50.7526L68.7419 50.7499C65.2614 48.006 60.9436 48.156 57.5821 48.939C55.8927 49.3325 54.4176 49.8915 53.3657 50.3514C52.8958 50.5568 52.5091 50.743 52.224 50.8868C52.1434 50.6276 52.0332 50.2932 51.8901 49.899C51.5366 48.9256 50.9809 47.5843 50.1697 46.1072C48.5503 43.1583 45.8944 39.6348 41.7659 37.4418L41.7649 37.4412C37.1323 34.9948 32.6242 35.3669 29.2976 36.3379C27.6346 36.8233 26.2599 37.46 25.3002 37.9756C24.9381 38.1701 24.6345 38.3478 24.3959 38.4941C24.3369 38.256 24.2611 37.9646 24.1673 37.63C23.8978 36.6686 23.4787 35.3467 22.8793 33.9032C21.688 31.0346 19.7528 27.6069 16.7961 25.6292C13.8167 23.6362 9.53921 23.4139 6.1008 23.6518C4.74359 23.7457 3.49734 23.913 2.48301 24.0818L24.0944 10.0507C30 13.2176 34.8526 17.1698 39.5744 21.0154C41.5035 22.5866 43.4108 24.14 45.3591 25.6148C52.122 30.7338 59.3028 34.828 69.3643 35.0684L69.8762 35.0806V34.5686V34.5658V34.563V34.5602V34.5575V34.5547V34.5519V34.5491V34.5464V34.5436V34.5408V34.538V34.5353V34.5325V34.5297V34.5269V34.5241V34.5214V34.5186V34.5158V34.513V34.5103V34.5075V34.5047V34.5019V34.4991V34.4963V34.4936V34.4908V34.488V34.4852V34.4824V34.4796V34.4769V34.4741V34.4713V34.4685V34.4657V34.4629V34.4601V34.4573V34.4545V34.4518V34.449V34.4462V34.4434V34.4406V34.4378V34.435V34.4322V34.4294V34.4266V34.4238V34.421V34.4182V34.4154V34.4126V34.4097V34.4069V34.4041V34.4013V34.3985V34.3957V34.3929V34.39V34.3872V34.3844V34.3816V34.3788V34.3759V34.3731V34.3703V34.3675V34.3646V34.3618V34.359V34.3561V34.3533V34.3505V34.3476V34.3448V34.3419V34.3391V34.3362V34.3334V34.3305V34.3277V34.3248V34.322V34.3191V34.3163V34.3134V34.3105V34.3077V34.3048V34.3019V34.2991V34.2962V34.2933V34.2904V34.2876V34.2847V34.2818V34.2789V34.276V34.2731V34.2702V34.2673V34.2644V34.2615V34.2586V34.2557V34.2528V34.2499V34.247V34.2441V34.2412V34.2383V34.2353V34.2324V34.2295V34.2266V34.2236V34.2207V34.2178V34.2148V34.2119V34.2089V34.206V34.203V34.2001V34.1971V34.1942V34.1912V34.1883V34.1853V34.1823V34.1794V34.1764V34.1734V34.1704V34.1674V34.1644V34.1615V34.1585V34.1555V34.1525V34.1495V34.1465V34.1435V34.1404V34.1374V34.1344V34.1314V34.1284V34.1253V34.1223V34.1193V34.1162V34.1132V34.1102V34.1071V34.1041V34.101V34.0979V34.0949V34.0918V34.0888V34.0857V34.0826V34.0795V34.0764V34.0734V34.0703V34.0672V34.0641V34.061V34.0579V34.0548V34.0517V34.0485V34.0454V34.0423V34.0392V34.036V34.0329V34.0298V34.0266V34.0235V34.0203V34.0172V34.014V34.0108V34.0077V34.0045V34.0013V33.9982V33.995V33.9918V33.9886V33.9854V33.9822V33.979V33.9758V33.9726V33.9694V33.9661V33.9629V33.9597V33.9564V33.9532V33.95V33.9467V33.9435V33.9402V33.9369V33.9337V33.9304V33.9271V33.9238V33.9206V33.9173V33.914V33.9107V33.9074V33.9041V33.9008V33.8974V33.8941V33.8908V33.8875V33.8841V33.8808V33.8774V33.8741V33.8707V33.8674V33.864V33.8606V33.8572V33.8539V33.8505V33.8471V33.8437V33.8403V33.8369V33.8335V33.83V33.8266V33.8232V33.8198V33.8163V33.8129V33.8094V33.806V33.8025V33.799V33.7956V33.7921V33.7886V33.7851V33.7816V33.7781V33.7746V33.7711V33.7676V33.7641V33.7606V33.757V33.7535V33.7499V33.7464V33.7428V33.7393V33.7357V33.7321V33.7286V33.725V33.7214V33.7178V33.7142V33.7106V33.707V33.7034V33.6997V33.6961V33.6925V33.6888V33.6852V33.6815V33.6779V33.6742V33.6705V33.6668V33.6631V33.6595V33.6558V33.652V33.6483V33.6446V33.6409V33.6372V33.6334V33.6297V33.6259V33.6222V33.6184V33.6146V33.6109V33.6071V33.6033V33.5995V33.5957V33.5919V33.5881V33.5843V33.5804V33.5766V33.5728V33.5689V33.565V33.5612V33.5573V33.5534V33.5496V33.5457V33.5418V33.5379V33.534V33.53V33.5261V33.5222V33.5183V33.5143V33.5104V33.5064V33.5024V33.4985V33.4945V33.4905V33.4865V33.4825V33.4785V33.4745V33.4704V33.4664V33.4624V33.4583V33.4543V33.4502V33.4461V33.4421V33.438V33.4339V33.4298V33.4257V33.4216V33.4175V33.4133V33.4092V33.4051V33.4009V33.3968V33.3926V33.3884V33.3842V33.38V33.3759V33.3716V33.3674V33.3632V33.359V33.3548V33.3505V33.3463V33.342V33.3377V33.3335V33.3292V33.3249V33.3206V33.3163V33.312V33.3076V33.3033V33.299V33.2946V33.2903V33.2859V33.2815V33.2771V33.2728V33.2684V33.264V33.2595V33.2551V33.2507V33.2463V33.2418V33.2373V33.2329V33.2284V33.2239V33.2194V33.2149V33.2104V33.2059V33.2014V33.1969V33.1923V33.1878V33.1832V33.1786V33.1741V33.1695V33.1649V33.1603V33.1557V33.1511V33.1464V33.1418V33.1371V33.1325V33.1278V33.1232V33.1185V33.1138V33.1091V33.1044V33.0997V33.0949V33.0902V33.0854V33.0807V33.0759V33.0712V33.0664V33.0616V33.0568V33.052V33.0472V33.0423V33.0375V33.0326V33.0278V33.0229V33.018V33.0132V33.0083V33.0034V32.9984V32.9935V32.9886V32.9837V32.9787V32.9737V32.9688V32.9638V32.9588V32.9538V32.9488V32.9438V32.9387V32.9337V32.9287V32.9236V32.9185V32.9134V32.9084V32.9033V32.8982V32.893V32.8879V32.8828V32.8776V32.8725V32.8673V32.8621V32.8569V32.8517V32.8465V32.8413V32.8361V32.8308V32.8256V32.8203V32.8151V32.8098V32.8045V32.7992V32.7939V32.7886V32.7832V32.7779V32.7725V32.7672V32.7618V32.7564V32.751V32.7456V32.7402V32.7348V32.7293V32.7239V32.7184V32.713V32.7075V32.702V32.6965V32.691V32.6855V32.6799V32.6744V32.639L69.8712 32.6039C69.6239 30.8672 69.0057 29.5021 68.4485 28.5702C68.4036 28.4952 68.3591 28.4229 68.3152 28.3534C68.411 28.3773 68.5102 28.4015 68.6124 28.4256C69.6295 28.6657 70.971 28.9125 72.2079 28.9125C73.4941 28.9125 74.9882 28.4038 76.1191 27.926C76.3321 27.836 76.5347 27.746 76.7233 27.6592C76.6544 27.8217 76.5849 27.996 76.517 28.181C76.0896 29.3451 75.7132 30.9591 75.9561 32.7141C75.9677 33.0564 76.1254 33.3711 76.227 33.5739C76.2328 33.5856 76.2385 33.5968 76.2439 33.6077C76.3763 33.8734 76.4274 33.9988 76.4274 34.095V34.7359L77.049 34.58C86.6337 32.1757 92.7342 26.6406 98.3068 20.2164C99.7983 18.497 101.249 16.7192 102.716 14.9203C106.694 10.0444 110.798 5.01377 116.19 0.571566L140.436 9.96133ZM76.4505 62.4811C76.4521 62.481 76.4538 62.4811 76.4554 62.4811H76.4505Z" stroke="url(#paint0_linear_14_57384)"/>
<defs>
<linearGradient id="paint0_linear_14_57384" x1="-4.57078" y1="-1.20574" x2="49.3471" y2="108.873" gradientUnits="userSpaceOnUse">
<stop stop-color="#51EEDA"/>
<stop offset="1" stop-color="#4AFEBF"/>
</linearGradient>
</defs>
</svg>
