<svg width="174" height="181" viewBox="0 0 174 181" fill="none" xmlns="http://www.w3.org/2000/svg">
<path d="M19.173 21.6818C16.2776 19.5907 12.7388 17.017 9.52169 19.5907C7.10886 21.0384 4.53514 23.4513 5.66113 26.6684C5.98284 28.1161 7.10886 29.5637 6.30459 31.3331C1.96151 34.2285 -1.09476 39.8584 2.76576 44.845C5.66115 49.188 10.9694 50.9574 13.0605 55.4613C18.6904 65.4343 24.8029 75.4074 31.5588 84.5761C33.3282 87.7932 36.5453 88.4366 39.7624 89.2409C44.7489 96.6402 48.9312 105.166 53.2742 113.369C58.5825 124.79 68.2337 133.315 73.5419 144.575C78.5284 154.548 84.1584 163.717 90.2709 173.368C92.6837 177.711 97.3484 181.893 102.657 179.481C111.182 175.62 111.825 164.843 107 158.087C100.887 148.114 96.7051 136.693 87.8581 128.65C84.9627 126.238 82.5498 123.02 80.7804 119.482C73.3811 105.648 64.3732 92.7798 56.3304 79.2679C56.6521 77.8203 56.9739 76.3725 57.4564 74.9248C57.7781 73.4771 56.3305 71.7077 57.7782 69.9383C73.0594 54.6571 93.3271 43.2364 114.56 38.2499C134.023 33.2634 153.648 38.8933 170.698 48.2229C173.915 47.9012 173.111 43.8798 172.146 41.7887C157.508 8.33085 118.099 -2.2855 84.8018 1.25331C65.3383 3.34442 44.2663 9.13518 29.3068 22.647C23.8378 20.2342 23.8378 20.2341 19.173 21.6818ZM86.7321 40.1801C83.8367 41.3061 85.2843 44.5232 82.0672 44.845C80.9412 43.3973 82.0672 40.5018 79.6544 40.1801C79.011 40.1801 78.2067 40.5019 77.885 40.8236C76.1156 43.719 76.4373 47.5795 73.2202 49.3489C66.4643 39.0542 68.5554 57.5525 62.6038 57.2308C61.4778 56.5874 62.2821 55.1397 61.9604 54.0137C61.9604 52.566 61.6387 51.1183 60.191 50.7966C59.5476 50.4749 58.0999 51.1183 58.0999 51.9226C56.9739 55.7831 56.9739 59.8045 55.6871 63.3433C55.0437 65.4344 51.8266 68.3298 50.0571 65.7561C45.0706 57.2308 41.21 48.062 35.0976 40.1801C32.2022 36.3196 31.2371 31.9765 30.1111 27.3117C42.1752 13.7999 61.317 9.93939 78.3676 6.40059C95.0965 4.95289 111.825 4.95293 127.428 10.2611C141.584 14.6042 153.326 22.647 161.851 35.5154C162.495 36.6414 162.977 37.6065 163.299 38.7325C163.299 39.0542 162.977 39.3759 162.656 39.8585C139.492 31.0115 133.541 31.3331 116.812 32.7808C116.812 32.4591 116.49 31.6548 116.812 31.6548C118.581 31.0114 120.029 30.2072 121.798 29.5637C123.568 27.7943 124.694 25.7032 125.659 23.4513C126.302 22.3253 125.659 21.3602 125.015 20.2342C124.372 19.9125 123.568 19.9125 123.246 20.2342C121.798 21.6819 120.833 23.4512 119.386 25.2206C117.616 26.3466 114.721 26.3466 113.273 28.4377C112.147 30.2071 111.182 31.9765 110.056 33.7459C103.3 36.1587 96.8659 38.7325 89.7882 41.1453C88.5014 40.8236 87.3755 40.5018 86.7321 40.1801ZM59.7084 102.592C60.3519 102.27 61.4778 101.948 62.9255 101.466C62.9255 105.005 62.6038 108.543 63.5689 111.761C65.3383 114.978 67.912 112.082 68.2337 109.669C72.5768 112.887 67.5903 119.321 71.7726 121.734C72.8985 121.734 73.8637 121.734 74.9897 121.412C78.5285 126.72 82.8715 131.385 87.3754 136.05C93.4879 143.449 97.3485 151.974 102.013 160.178C102.657 161.304 103.139 162.269 103.461 163.395C105.23 167.256 103.783 171.92 101.37 174.011C99.9221 175.459 97.831 175.459 96.3833 174.011C88.5015 164.36 83.1932 153.1 76.9198 142.001C72.5768 132.833 65.4992 125.272 59.8693 116.747C54.8828 107.096 49.2528 97.9271 44.588 88.2758C46.0357 85.863 49.2529 85.3804 51.6657 83.9327C54.8828 86.0238 56.3304 89.5626 58.4215 92.7797C58.2607 97.2836 56.1696 100.179 59.7084 102.592ZM10.6477 24.0946C12.0954 22.6469 13.0604 22.9687 14.9907 24.4164C17.0818 26.1858 14.3473 27.9552 12.5779 28.7595C10.3259 27.9552 9.2 25.2206 10.6477 24.0946Z" stroke="url(#paint0_linear_34_4050)" stroke-miterlimit="10"/>
<path d="M53.5958 27.9552C47.9659 26.8292 47.966 21.8427 52.1482 18.7865C56.0087 14.926 67.7511 15.8911 63.0863 23.1296C61.1561 26.6684 57.4564 27.6335 53.5958 27.9552Z" stroke="url(#paint1_linear_34_4050)" stroke-miterlimit="10"/>
<path d="M37.993 71.0644C37.3496 78.4637 27.3766 73.1554 30.1111 67.5255C32.6848 63.1824 37.993 67.5255 37.993 71.0644Z" stroke="url(#paint2_linear_34_4050)" stroke-miterlimit="10"/>
<defs>
<linearGradient id="paint0_linear_34_4050" x1="-4.49772" y1="-2.83115" x2="187.89" y2="162.904" gradientUnits="userSpaceOnUse">
<stop stop-color="#51EEDA"/>
<stop offset="1" stop-color="#4AFEBF"/>
</linearGradient>
<linearGradient id="paint1_linear_34_4050" x1="48.6931" y1="16.3372" x2="60.8697" y2="30.7409" gradientUnits="userSpaceOnUse">
<stop stop-color="#51EEDA"/>
<stop offset="1" stop-color="#4AFEBF"/>
</linearGradient>
<linearGradient id="paint2_linear_34_4050" x1="29.3705" y1="65.5337" x2="38.9536" y2="73.5458" gradientUnits="userSpaceOnUse">
<stop stop-color="#51EEDA"/>
<stop offset="1" stop-color="#4AFEBF"/>
</linearGradient>
</defs>
</svg>
