<svg width="118" height="96" viewBox="0 0 118 96" fill="none" xmlns="http://www.w3.org/2000/svg">
<path d="M108.657 45.942C108.481 45.8787 108.286 45.811 108.073 45.7409C107.053 45.4054 105.621 45.0141 103.971 44.7925C100.68 44.3506 96.4519 44.5754 92.9303 47.3531L92.9234 47.3585L92.9167 47.3642C89.7028 50.0866 88.3869 54.4419 87.8578 58.0292C87.5915 59.8345 87.5206 61.4725 87.5161 62.6589C87.5149 62.9809 87.5185 63.27 87.5245 63.5205C87.3945 63.4337 87.2504 63.3413 87.0925 63.2449C86.2426 62.7267 84.9889 62.0941 83.3592 61.6246C80.0907 60.6829 75.3407 60.4063 69.3503 62.9695C63.305 65.5562 60.4359 70.1769 59.0848 74.1301C58.4101 76.1042 58.112 77.9155 57.9822 79.2337C57.9173 79.8934 57.8943 80.4312 57.8877 80.806C57.8868 80.8606 57.8862 80.9116 57.8858 80.9591C57.6511 81.002 57.3267 81.0644 56.9296 81.1492C56.0705 81.3324 54.8693 81.6201 53.4967 82.0385C50.7598 82.8729 47.3051 84.2378 44.5282 86.3574L44.5281 86.3573L44.5191 86.3646C42.1707 88.2452 40.3503 90.7333 39.0054 92.6165C38.9347 92.7155 38.8656 92.8125 38.7978 92.9075C38.2108 93.7308 37.7328 94.4012 37.3379 94.8492C37.1148 95.1023 36.9535 95.2424 36.8466 95.3035C36.8437 95.3052 36.841 95.3067 36.8384 95.3081L36.8058 95.2859L36.7687 95.281C36.734 95.2098 36.6924 95.0785 36.6524 94.8578C36.5794 94.4557 36.534 93.8992 36.4749 93.1739C36.4649 93.0506 36.4544 92.9223 36.4433 92.7891C36.2938 90.9877 36.0438 88.4396 35.1611 85.4591C34.1567 81.051 31.9256 77.6763 29.9523 75.4073C28.9638 74.2706 28.037 73.4079 27.3554 72.828C27.0553 72.5727 26.8023 72.3719 26.6122 72.2264C26.6309 72.1952 26.6505 72.1623 26.6708 72.1277C26.8613 71.8042 27.123 71.3327 27.413 70.7344C27.9924 69.5387 28.687 67.8307 29.1481 65.779C30.0714 61.6704 30.059 56.1686 26.2999 50.6713C22.5723 45.22 18.3982 42.9018 15.1272 41.9594C13.4963 41.4895 12.0984 41.364 11.1035 41.3568C10.9175 41.3555 10.7455 41.3583 10.5886 41.3637C10.7343 41.139 10.901 40.8754 11.0825 40.5771C11.7185 39.5318 12.539 38.057 13.2753 36.3403C14.7361 32.9341 15.9136 28.4634 14.5096 24.5025C13.2776 20.6443 9.90659 18.3849 6.94172 17.0978C5.44901 16.4497 4.03348 16.0365 2.99201 15.7851C2.80628 15.7403 2.63226 15.7006 2.47159 15.6656C2.80021 15.3959 3.17566 15.0448 3.5496 14.6042C4.59599 13.3712 5.62278 11.4445 5.58513 8.67766C5.60471 6.19294 4.44687 4.04594 3.32322 2.54614C3.19066 2.36921 3.05807 2.20061 2.92727 2.0408C3.36171 2.2412 3.84467 2.46677 4.36712 2.71499C6.66944 3.80884 9.73433 5.34041 12.791 7.09362C15.8519 8.84924 18.8851 10.8161 21.1353 12.778C22.2607 13.7591 23.1745 14.7256 23.7983 15.6501C24.4245 16.5781 24.7319 17.424 24.7128 18.1765C24.5353 24.6868 26.902 32.0854 30.1459 38.8683C33.3943 45.6607 37.5486 51.89 41.006 56.0768L41.8826 55.6646C41.4798 53.5566 41.3884 50.4865 43.1306 47.8536C43.2402 48.1007 43.3954 48.3724 43.614 48.6586C44.4268 49.7225 46.0832 50.947 49.4247 51.891C52.758 52.8327 54.7829 52.7225 56.0076 52.3156C56.3519 52.2012 56.6307 52.064 56.8549 51.9223C57.0895 54.9065 55.7061 57.5048 53.9018 59.4852L54.4445 60.291C59.6961 58.354 66.4848 55.1115 72.7573 50.9919C79.0202 46.8787 84.8176 41.8593 88.0309 36.3511C88.4297 35.6844 89.1548 35.1133 90.1886 34.6415C91.2201 34.1708 92.5183 33.8176 94.0018 33.5637C96.9686 33.0559 100.597 32.9579 104.134 33.0574C107.666 33.1567 111.084 33.4521 113.62 33.7231C114.304 33.7962 114.924 33.8674 115.464 33.9325C115.214 34.025 114.952 34.1283 114.681 34.2433C112.995 34.9607 110.939 36.1562 109.649 38.0545L109.637 38.0717L109.627 38.0899C108.29 40.4596 108.143 42.6912 108.334 44.3299C108.408 44.9644 108.532 45.5102 108.657 45.942Z" stroke="url(#paint0_linear_34_4088)"/>
<defs>
<linearGradient id="paint0_linear_34_4088" x1="20.2668" y1="-34.8336" x2="43.5838" y2="117.299" gradientUnits="userSpaceOnUse">
<stop stop-color="#51EEDA"/>
<stop offset="1" stop-color="#4AFEBF"/>
</linearGradient>
</defs>
</svg>
