<svg width="249" height="183" viewBox="0 0 249 183" fill="none" xmlns="http://www.w3.org/2000/svg">
<path d="M230.733 127.366C220.978 157.025 188.811 172.852 158.786 162.764L55.3512 128.011C25.3263 117.923 8.93596 85.7826 18.6912 56.1227C28.4464 26.4628 60.6132 10.6367 90.6381 20.7246L194.073 55.4772C224.098 65.5651 240.488 97.7057 230.733 127.366Z" stroke="url(#paint0_linear_14_57226)" stroke-miterlimit="10" stroke-linecap="round" stroke-linejoin="round"/>
<path d="M86.4188 51.7406C101.075 37.2641 123.444 31.3743 144.717 38.5248" stroke="url(#paint1_linear_14_57226)" stroke-miterlimit="10" stroke-linecap="round" stroke-linejoin="round"/>
<path d="M179.388 82.8334C176.22 62.3659 161.791 44.1076 140.517 36.957L130.803 66.5031" stroke="url(#paint2_linear_14_57226)" stroke-miterlimit="10" stroke-linecap="round" stroke-linejoin="round"/>
<path d="M53.0594 41.5956C67.7598 26.5011 90.5108 20.4232 112.073 27.6711" stroke="url(#paint3_linear_14_57226)" stroke-miterlimit="10" stroke-linecap="round" stroke-linejoin="round"/>
<path d="M76.3382 135.817C46.2408 125.696 29.8113 93.4514 39.5905 63.6958" stroke="url(#paint4_linear_14_57226)" stroke-miterlimit="10" stroke-linecap="round" stroke-linejoin="round"/>
<path d="M212.277 94.8837C209.44 73.8941 194.862 55.1109 173.156 47.8146" stroke="url(#paint5_linear_14_57226)" stroke-miterlimit="10" stroke-linecap="round" stroke-linejoin="round"/>
<path d="M137.304 155.894C167.401 166.015 199.645 150.139 209.425 120.383" stroke="url(#paint6_linear_14_57226)" stroke-miterlimit="10" stroke-linecap="round" stroke-linejoin="round"/>
<defs>
<linearGradient id="paint0_linear_14_57226" x1="30.2324" y1="-1.851" x2="70.4063" y2="208.287" gradientUnits="userSpaceOnUse">
<stop stop-color="#51EEDA"/>
<stop offset="1" stop-color="#4AFEBF"/>
</linearGradient>
<linearGradient id="paint1_linear_14_57226" x1="94.766" y1="21.1071" x2="109.782" y2="75.0868" gradientUnits="userSpaceOnUse">
<stop stop-color="#51EEDA"/>
<stop offset="1" stop-color="#4AFEBF"/>
</linearGradient>
<linearGradient id="paint2_linear_14_57226" x1="139.15" y1="35.8696" x2="154.166" y2="89.8493" gradientUnits="userSpaceOnUse">
<stop stop-color="#51EEDA"/>
<stop offset="1" stop-color="#4AFEBF"/>
</linearGradient>
<linearGradient id="paint3_linear_14_57226" x1="61.679" y1="10.0856" x2="77.5402" y2="65.1417" gradientUnits="userSpaceOnUse">
<stop stop-color="#51EEDA"/>
<stop offset="1" stop-color="#4AFEBF"/>
</linearGradient>
<linearGradient id="paint4_linear_14_57226" x1="38.189" y1="62.0807" x2="78.755" y2="134.462" gradientUnits="userSpaceOnUse">
<stop stop-color="#51EEDA"/>
<stop offset="1" stop-color="#4AFEBF"/>
</linearGradient>
<linearGradient id="paint5_linear_14_57226" x1="171.777" y1="46.7018" x2="187.748" y2="101.972" gradientUnits="userSpaceOnUse">
<stop stop-color="#51EEDA"/>
<stop offset="1" stop-color="#4AFEBF"/>
</linearGradient>
<linearGradient id="paint6_linear_14_57226" x1="153.589" y1="100.463" x2="194.155" y2="172.845" gradientUnits="userSpaceOnUse">
<stop stop-color="#51EEDA"/>
<stop offset="1" stop-color="#4AFEBF"/>
</linearGradient>
</defs>
</svg>
