<svg width="347" height="754" viewBox="0 0 347 754" fill="none" xmlns="http://www.w3.org/2000/svg">
<path d="M432.364 572.02L344.642 377.463" stroke="url(#paint0_linear_211_9)" stroke-miterlimit="10" stroke-linecap="round" stroke-linejoin="round"/>
<path d="M344.668 377.463C308.66 452.545 294.418 543.02 292.474 626.568" stroke="url(#paint1_linear_211_9)" stroke-miterlimit="10" stroke-linecap="round" stroke-linejoin="round"/>
<path d="M342.463 378.12C275.406 382.326 209.662 404.604 154.04 441.787" stroke="url(#paint2_linear_211_9)" stroke-miterlimit="10" stroke-linecap="round" stroke-linejoin="round"/>
<path d="M345.173 377.798C277.222 326.271 191.255 299.251 106.408 302.735" stroke="url(#paint3_linear_211_9)" stroke-miterlimit="10" stroke-linecap="round" stroke-linejoin="round"/>
<path d="M345.737 377.463C346.72 292.019 304.09 209.478 238.712 153.647" stroke="url(#paint4_linear_211_9)" stroke-miterlimit="10" stroke-linecap="round" stroke-linejoin="round"/>
<path d="M366.82 425.642C366.82 425.642 351.242 404.244 326.3 423.221C326.3 423.221 332.648 381.434 291.415 384.25C291.415 384.25 311.659 367.399 295.169 345.502C295.169 345.502 331.487 358.292 338.732 317.464" stroke="url(#paint5_linear_211_9)" stroke-miterlimit="10"/>
<path d="M389.923 475.704C389.923 475.704 374.72 435.763 320.77 439.834C320.77 439.834 324.746 396.767 281.234 386.377C281.234 386.377 309.697 357.848 279.627 337.919C279.627 337.919 324.11 328.213 329.025 284.721" stroke="url(#paint6_linear_211_9)" stroke-miterlimit="10"/>
<path d="M404.581 505.318C404.581 505.318 382.203 457.233 311.557 473.768C311.557 473.768 310.656 407.865 237.333 399.26C237.333 399.26 287.917 365.679 262.839 330.422C262.839 330.422 322.819 298.688 314.255 250.406" stroke="url(#paint7_linear_211_9)" stroke-miterlimit="10"/>
<path d="M419.838 543.38C419.838 543.38 385.204 474.789 307.723 491.326C307.723 491.326 280.958 401.249 200.602 414.81C200.602 414.81 272.339 348.732 226.297 317.741C226.297 317.741 299.022 296.03 294.975 217.649" stroke="url(#paint8_linear_211_9)" stroke-miterlimit="10"/>
<path d="M427.121 559.837C427.121 559.837 360.904 508.925 294.428 590.564C294.428 590.564 294.192 449.771 171.993 430.195C171.993 430.195 228.271 311.574 149.004 303.474C149.004 303.474 276.027 264.027 268.95 184.674" stroke="url(#paint9_linear_211_9)" stroke-miterlimit="10"/>
<path d="M3.49128 68.2504C3.1228 67.6362 2.99994 67.2677 2.99994 67.2677C4.47389 53.0196 12.9491 40.7367 22.6526 30.7876C36.4094 18.259 55.5707 13.223 73.5038 8.92399C78.0484 8.06419 82.8388 6.7131 87.015 4.50218C95.9815 0.0803374 106.422 0.694467 115.88 1.79993C121.039 3.64236 126.443 6.59027 131.97 8.18705C138.849 10.7665 145.604 13.8372 151.377 19.1188C159.484 27.7168 164.397 39.0171 172.258 48.1065C180.611 60.3893 182.944 79.305 175.575 92.6933C171.767 97.238 168.451 102.888 170.539 108.907C172.872 118.61 179.382 128.068 175.575 138.14C175.083 139.614 173.241 141.579 171.89 139.737C170.293 137.649 168.819 135.561 165.871 134.946C160.712 133.964 156.29 136.789 151.746 138.386C146.833 136.42 143.271 135.929 138.357 137.772C134.795 138.877 132.707 141.334 130.005 143.176C123.372 138.754 117.477 140.351 111.335 144.527C107.036 143.545 103.351 143.053 99.4206 146.001C94.5075 148.703 93.7705 154.108 93.6477 159.267C87.0149 162.46 76.9429 159.512 73.3809 153.002C69.8189 146.492 65.7655 139.86 57.6588 138.017C43.2878 133.227 28.3027 128.314 18.9677 115.785C15.16 111.118 10.861 105.468 13.1947 99.0805C13.9317 96.6239 15.2828 93.676 15.897 90.8509C15.897 89.9911 15.5285 89.377 15.0372 89.2541C11.8436 88.0259 10.7382 94.5358 8.77291 94.7814C6.19351 90.7281 9.87837 85.3236 11.2295 81.6387C11.4751 80.6561 11.9664 79.1822 10.7381 78.568C7.66742 76.8484 6.93051 81.5159 4.96525 82.6214C4.59676 82.7442 4.10538 82.6214 3.98256 82.3757C1.77163 77.7082 7.79027 73.1635 9.75553 69.1102C10.7382 67.7591 9.01859 66.1623 7.7903 66.408C6.68484 66.5308 5.45655 67.2678 3.49128 68.2504ZM140.077 141.948C145.85 140.105 148.798 140.965 150.149 147.352C150.886 151.16 151.254 154.722 151.746 158.653C151.991 159.758 151.377 160.986 150.026 161.723C145.973 164.303 137.375 165.654 136.269 159.635C135.41 155.09 135.164 150.546 135.655 146.124C135.778 143.913 138.48 142.808 140.077 141.948ZM115.388 161.355C114.529 156.81 112.195 149.195 117.231 146.861C122.39 144.036 129.514 146.861 130.374 153.125C130.865 156.196 131.233 159.389 131.479 162.215C131.479 163.074 131.233 164.057 130.251 164.548C125.706 167.128 116.74 167.742 115.388 161.355ZM168.942 146.861C171.644 152.511 168.205 159.512 161.449 158.53C154.202 158.284 154.571 147.475 156.045 142.562C159.73 140.105 163.046 138.386 166.362 140.719C167.099 141.211 167.591 142.193 167.222 143.176C166.608 143.545 165.257 143.422 164.397 144.281C163.169 145.755 163.414 147.844 165.503 147.844C167.099 147.352 167.714 146.984 168.942 146.861ZM99.912 164.671C98.1924 159.267 97.2098 150.546 104.825 148.949C106.299 148.58 108.019 149.317 108.142 150.423C109.615 154.722 110.107 158.653 110.721 162.952C111.089 165.285 110.475 166.391 108.019 167.373C104.825 168.356 100.895 168.847 99.912 164.671Z" stroke="url(#paint10_linear_211_9)" stroke-miterlimit="10"/>
<path d="M141.797 118.733C153.097 116.399 154.571 111.363 149.903 101.291C144.867 90.6053 138.726 80.9018 131.725 71.1983C130.742 70.0928 129.514 68.6189 128.163 67.6363C125.583 65.3025 121.039 67.7591 122.021 70.9526C125.092 79.7963 124.478 89.377 120.793 98.0978C119.073 104.116 113.669 119.716 122.635 121.558C129.514 122.418 136.024 121.435 141.797 118.733ZM129.882 77.5854C130.374 77.7082 130.865 77.8311 131.111 78.1995C135.778 85.3236 141.06 92.5705 144.499 100.432C145.973 107.678 130.251 108.17 125.092 108.047C123.127 105.345 126.32 101.046 126.689 97.8522C128.9 91.2194 128.9 84.4638 129.882 77.5854Z" stroke="url(#paint11_linear_211_9)" stroke-miterlimit="10"/>
<path d="M82.7159 96.1325C81.1192 90.2367 78.1713 83.8496 83.0844 79.9191C93.7705 73.2863 106.668 77.5853 108.756 90.728C109.001 97.3608 103.351 102.52 97.3325 104.485C91.6824 106.45 83.6986 101.905 82.7159 96.1325Z" stroke="url(#paint12_linear_211_9)" stroke-miterlimit="10"/>
<path d="M157.273 53.7565C168.082 50.4402 172.749 64.3198 168.205 72.1809C166.362 75.7429 164.151 78.568 161.204 81.0246C153.957 86.3062 145.727 77.3397 143.148 71.0754C139.954 62.8459 149.781 57.0729 157.273 53.7565Z" stroke="url(#paint13_linear_211_9)" stroke-miterlimit="10"/>
<path d="M122.881 23.295C125.338 27.8397 131.233 30.0506 136.146 29.9278C139.094 29.9278 141.305 26.2429 139.831 23.6635C137.006 18.5047 130.988 15.9253 125.338 17.2764C123.249 18.5047 121.775 20.4699 122.881 23.295Z" stroke="url(#paint14_linear_211_9)" stroke-miterlimit="10"/>
<path d="M56.0621 23.5406C56.4306 23.4178 58.5187 22.6808 60.6068 21.9438C61.2209 21.5754 61.7122 20.1014 61.3437 19.4873C60.9752 18.8731 60.3611 18.3818 59.8697 18.259C56.5534 18.3818 53.1141 18.996 50.0434 20.2242C46.9727 21.4525 35.5496 26.857 38.9888 30.9104C40.8313 32.0158 42.7965 30.1734 43.902 29.0679C47.3412 26.6114 50.6576 25.2602 56.0621 23.5406Z" stroke="url(#paint15_linear_211_9)" stroke-miterlimit="10"/>
<path d="M72.5212 143.053C79.0311 138.631 54.4653 123.892 57.2903 133.718C57.4132 134.087 58.1502 134.455 58.1502 134.455C62.8177 136.052 66.7481 138.631 69.696 142.439C70.5558 143.299 71.2929 143.299 72.5212 143.053Z" stroke="url(#paint16_linear_211_9)" stroke-miterlimit="10"/>
<path d="M111.335 18.259C112.441 22.6808 121.039 21.3297 118.336 16.5394C116.248 13.4687 110.844 14.3285 111.335 18.259Z" stroke="url(#paint17_linear_211_9)" stroke-miterlimit="10"/>
<path d="M53.237 26.7342C51.8859 27.4711 50.6575 28.2081 50.0434 29.3136C49.3064 31.0332 50.6575 32.7528 52.5 32.2615C53.8511 31.5245 55.4479 30.6647 56.6762 29.9277C59.0099 27.3483 55.3251 25.9972 53.237 26.7342Z" stroke="url(#paint18_linear_211_9)" stroke-miterlimit="10"/>
<path d="M62.4492 124.506C62.8176 126.84 65.5199 127.085 67.3623 128.191C68.8363 128.682 69.9417 126.717 69.2047 125.489C68.3449 123.032 63.5546 121.312 62.4492 124.506Z" stroke="url(#paint19_linear_211_9)" stroke-miterlimit="10"/>
<path d="M47.2184 130.77C48.4467 132.981 52.5001 133.35 53.4827 130.648C54.2197 127.331 46.1129 127.085 47.2184 130.77Z" stroke="url(#paint20_linear_211_9)" stroke-miterlimit="10"/>
<path d="M18.5992 60.5121C20.933 60.1436 20.3189 56.7045 17.8623 56.7045C15.16 57.3186 15.6513 61.2491 18.5992 60.5121Z" stroke="url(#paint21_linear_211_9)" stroke-miterlimit="10"/>
<path d="M14.9144 66.1623C17.2481 65.7938 16.8796 62.1089 14.6687 62.4774C11.598 63.0915 12.2121 66.5308 14.9144 66.1623Z" stroke="url(#paint22_linear_211_9)" stroke-miterlimit="10"/>
<path d="M119.565 162.829C120.302 164.917 123.864 163.811 123.004 161.355C122.267 159.267 118.828 160.741 119.565 162.829Z" stroke="url(#paint23_linear_211_9)" stroke-miterlimit="10"/>
<path d="M230.267 698.366C220.512 728.025 188.345 743.852 158.32 733.764L54.8853 699.011C24.8604 688.923 8.47008 656.783 18.2253 627.123C27.9806 597.463 60.1473 581.637 90.1722 591.725L193.607 626.477C223.632 636.565 240.023 668.706 230.267 698.366Z" stroke="url(#paint24_linear_211_9)" stroke-miterlimit="10" stroke-linecap="round" stroke-linejoin="round"/>
<path d="M85.9529 622.741C100.609 608.264 122.978 602.374 144.251 609.525" stroke="url(#paint25_linear_211_9)" stroke-miterlimit="10" stroke-linecap="round" stroke-linejoin="round"/>
<path d="M178.922 653.833C175.754 633.366 161.325 615.108 140.052 607.957L130.337 637.503" stroke="url(#paint26_linear_211_9)" stroke-miterlimit="10" stroke-linecap="round" stroke-linejoin="round"/>
<path d="M52.5935 612.596C67.294 597.501 90.0449 591.423 111.607 598.671" stroke="url(#paint27_linear_211_9)" stroke-miterlimit="10" stroke-linecap="round" stroke-linejoin="round"/>
<path d="M75.8723 706.817C45.775 696.696 29.3454 664.451 39.1246 634.696" stroke="url(#paint28_linear_211_9)" stroke-miterlimit="10" stroke-linecap="round" stroke-linejoin="round"/>
<path d="M211.811 665.884C208.974 644.894 194.396 626.111 172.69 618.815" stroke="url(#paint29_linear_211_9)" stroke-miterlimit="10" stroke-linecap="round" stroke-linejoin="round"/>
<path d="M136.838 726.894C166.935 737.015 199.18 721.139 208.959 691.383" stroke="url(#paint30_linear_211_9)" stroke-miterlimit="10" stroke-linecap="round" stroke-linejoin="round"/>
<path d="M159.822 705.106C144.26 709.815 127.003 710.026 110.38 704.473C93.7571 698.919 80.1572 688.557 70.498 675.422" stroke="url(#paint31_linear_211_9)" stroke-miterlimit="10" stroke-linecap="round" stroke-linejoin="round"/>
<path d="M110.908 696.631L106.575 709.66" stroke="url(#paint32_linear_211_9)" stroke-miterlimit="10" stroke-linecap="round" stroke-linejoin="round"/>
<path d="M94.9195 689.748L86.672 700.628" stroke="url(#paint33_linear_211_9)" stroke-miterlimit="10" stroke-linecap="round" stroke-linejoin="round"/>
<path d="M82.5546 679.607L72.0154 688.266" stroke="url(#paint34_linear_211_9)" stroke-miterlimit="10" stroke-linecap="round" stroke-linejoin="round"/>
<path d="M147.504 701.187L150.958 714.545" stroke="url(#paint35_linear_211_9)" stroke-miterlimit="10" stroke-linecap="round" stroke-linejoin="round"/>
<path d="M127.518 700.58L127.665 714.274" stroke="url(#paint36_linear_211_9)" stroke-miterlimit="10" stroke-linecap="round" stroke-linejoin="round"/>
<path d="M100.171 651.572C89.8186 648.094 82.8223 639.268 81.0281 629.189C79.0827 631.22 77.6188 633.729 76.6365 636.716C73.0814 647.524 79.0954 659.336 90.0224 663.007C100.087 666.389 110.905 661.653 115.236 652.37C110.415 653.435 105.346 653.311 100.171 651.572Z" stroke="url(#paint37_linear_211_9)" stroke-miterlimit="10" stroke-linecap="round" stroke-linejoin="round"/>
<path d="M150.234 668.184C160.586 671.662 171.418 668.826 178.681 661.792C179.036 664.596 178.722 667.491 177.74 670.477C174.185 681.285 162.371 687.107 151.444 683.435C141.38 680.054 135.52 669.715 137.407 659.61C140.925 663.477 145.202 666.493 150.234 668.184Z" stroke="url(#paint38_linear_211_9)" stroke-miterlimit="10" stroke-linecap="round" stroke-linejoin="round"/>
<path d="M118.718 672.709L110.085 677.556" stroke="url(#paint39_linear_211_9)" stroke-miterlimit="10" stroke-linecap="round" stroke-linejoin="round"/>
<path d="M118.678 672.672L122.724 681.783" stroke="url(#paint40_linear_211_9)" stroke-miterlimit="10" stroke-linecap="round" stroke-linejoin="round"/>
<path d="M156.9 585.712C158.032 582.282 156.09 578.458 152.627 577.299C149.164 576.139 145.335 578.031 144.203 581.46L135.947 606.468L148.645 610.719L156.9 585.712V585.712Z" stroke="url(#paint41_linear_211_9)" stroke-miterlimit="10" stroke-linecap="round" stroke-linejoin="round"/>
<defs>
<linearGradient id="paint0_linear_211_9" x1="498.544" y1="456.777" x2="314.319" y2="551.208" gradientUnits="userSpaceOnUse">
<stop stop-color="#51EEDA"/>
<stop offset="1" stop-color="#4AFEBF"/>
</linearGradient>
<linearGradient id="paint1_linear_211_9" x1="413.666" y1="406.209" x2="266.098" y2="379.943" gradientUnits="userSpaceOnUse">
<stop stop-color="#51EEDA"/>
<stop offset="1" stop-color="#4AFEBF"/>
</linearGradient>
<linearGradient id="paint2_linear_211_9" x1="346.962" y1="375.253" x2="152.187" y2="435.829" gradientUnits="userSpaceOnUse">
<stop stop-color="#51EEDA"/>
<stop offset="1" stop-color="#4AFEBF"/>
</linearGradient>
<linearGradient id="paint3_linear_211_9" x1="352.037" y1="375.008" x2="288.262" y2="452.466" gradientUnits="userSpaceOnUse">
<stop stop-color="#51EEDA"/>
<stop offset="1" stop-color="#4AFEBF"/>
</linearGradient>
<linearGradient id="paint4_linear_211_9" x1="420.521" y1="247.593" x2="212.136" y2="360.173" gradientUnits="userSpaceOnUse">
<stop stop-color="#51EEDA"/>
<stop offset="1" stop-color="#4AFEBF"/>
</linearGradient>
<linearGradient id="paint5_linear_211_9" x1="408.869" y1="352.149" x2="273.273" y2="401.924" gradientUnits="userSpaceOnUse">
<stop stop-color="#51EEDA"/>
<stop offset="1" stop-color="#4AFEBF"/>
</linearGradient>
<linearGradient id="paint6_linear_211_9" x1="460.784" y1="351.536" x2="263.389" y2="438.036" gradientUnits="userSpaceOnUse">
<stop stop-color="#51EEDA"/>
<stop offset="1" stop-color="#4AFEBF"/>
</linearGradient>
<linearGradient id="paint7_linear_211_9" x1="497.1" y1="343.021" x2="224.332" y2="447.506" gradientUnits="userSpaceOnUse">
<stop stop-color="#51EEDA"/>
<stop offset="1" stop-color="#4AFEBF"/>
</linearGradient>
<linearGradient id="paint8_linear_211_9" x1="535.83" y1="340.589" x2="204.872" y2="489.737" gradientUnits="userSpaceOnUse">
<stop stop-color="#51EEDA"/>
<stop offset="1" stop-color="#4AFEBF"/>
</linearGradient>
<linearGradient id="paint9_linear_211_9" x1="559.358" y1="330.656" x2="82.5771" y2="516.327" gradientUnits="userSpaceOnUse">
<stop stop-color="#51EEDA"/>
<stop offset="1" stop-color="#4AFEBF"/>
</linearGradient>
<linearGradient id="paint10_linear_211_9" x1="-2.6576" y1="-2.19716" x2="178.09" y2="170.056" gradientUnits="userSpaceOnUse">
<stop stop-color="#51EEDA"/>
<stop offset="1" stop-color="#4AFEBF"/>
</linearGradient>
<linearGradient id="paint11_linear_211_9" x1="116.492" y1="65.658" x2="167.771" y2="94.7507" gradientUnits="userSpaceOnUse">
<stop stop-color="#51EEDA"/>
<stop offset="1" stop-color="#4AFEBF"/>
</linearGradient>
<linearGradient id="paint12_linear_211_9" x1="79.4631" y1="76.3018" x2="109.773" y2="103.838" gradientUnits="userSpaceOnUse">
<stop stop-color="#51EEDA"/>
<stop offset="1" stop-color="#4AFEBF"/>
</linearGradient>
<linearGradient id="paint13_linear_211_9" x1="141.652" y1="52.6916" x2="172.986" y2="78.9902" gradientUnits="userSpaceOnUse">
<stop stop-color="#51EEDA"/>
<stop offset="1" stop-color="#4AFEBF"/>
</linearGradient>
<linearGradient id="paint14_linear_211_9" x1="121.935" y1="16.6718" x2="135.732" y2="33.646" gradientUnits="userSpaceOnUse">
<stop stop-color="#51EEDA"/>
<stop offset="1" stop-color="#4AFEBF"/>
</linearGradient>
<linearGradient id="paint15_linear_211_9" x1="37.611" y1="18.0103" x2="50.2593" y2="38.2556" gradientUnits="userSpaceOnUse">
<stop stop-color="#51EEDA"/>
<stop offset="1" stop-color="#4AFEBF"/>
</linearGradient>
<linearGradient id="paint16_linear_211_9" x1="56.5337" y1="130.161" x2="70.2273" y2="146.11" gradientUnits="userSpaceOnUse">
<stop stop-color="#51EEDA"/>
<stop offset="1" stop-color="#4AFEBF"/>
</linearGradient>
<linearGradient id="paint17_linear_211_9" x1="111.062" y1="14.5654" x2="117.824" y2="21.9024" gradientUnits="userSpaceOnUse">
<stop stop-color="#51EEDA"/>
<stop offset="1" stop-color="#4AFEBF"/>
</linearGradient>
<linearGradient id="paint18_linear_211_9" x1="49.596" y1="26.4228" x2="55.8125" y2="33.7197" gradientUnits="userSpaceOnUse">
<stop stop-color="#51EEDA"/>
<stop offset="1" stop-color="#4AFEBF"/>
</linearGradient>
<linearGradient id="paint19_linear_211_9" x1="62.2257" y1="122.658" x2="68.136" y2="129.409" gradientUnits="userSpaceOnUse">
<stop stop-color="#51EEDA"/>
<stop offset="1" stop-color="#4AFEBF"/>
</linearGradient>
<linearGradient id="paint20_linear_211_9" x1="46.9096" y1="127.998" x2="51.597" y2="134.05" gradientUnits="userSpaceOnUse">
<stop stop-color="#51EEDA"/>
<stop offset="1" stop-color="#4AFEBF"/>
</linearGradient>
<linearGradient id="paint21_linear_211_9" x1="15.96" y1="56.6298" x2="20.1681" y2="60.4886" gradientUnits="userSpaceOnUse">
<stop stop-color="#51EEDA"/>
<stop offset="1" stop-color="#4AFEBF"/>
</linearGradient>
<linearGradient id="paint22_linear_211_9" x1="12.4904" y1="62.38" x2="16.531" y2="66.1605" gradientUnits="userSpaceOnUse">
<stop stop-color="#51EEDA"/>
<stop offset="1" stop-color="#4AFEBF"/>
</linearGradient>
<linearGradient id="paint23_linear_211_9" x1="119.344" y1="160.276" x2="123.214" y2="163.845" gradientUnits="userSpaceOnUse">
<stop stop-color="#51EEDA"/>
<stop offset="1" stop-color="#4AFEBF"/>
</linearGradient>
<linearGradient id="paint24_linear_211_9" x1="29.7665" y1="569.149" x2="69.9404" y2="779.287" gradientUnits="userSpaceOnUse">
<stop stop-color="#51EEDA"/>
<stop offset="1" stop-color="#4AFEBF"/>
</linearGradient>
<linearGradient id="paint25_linear_211_9" x1="94.3001" y1="592.107" x2="109.316" y2="646.087" gradientUnits="userSpaceOnUse">
<stop stop-color="#51EEDA"/>
<stop offset="1" stop-color="#4AFEBF"/>
</linearGradient>
<linearGradient id="paint26_linear_211_9" x1="138.685" y1="606.87" x2="153.7" y2="660.849" gradientUnits="userSpaceOnUse">
<stop stop-color="#51EEDA"/>
<stop offset="1" stop-color="#4AFEBF"/>
</linearGradient>
<linearGradient id="paint27_linear_211_9" x1="61.2131" y1="581.086" x2="77.0744" y2="636.142" gradientUnits="userSpaceOnUse">
<stop stop-color="#51EEDA"/>
<stop offset="1" stop-color="#4AFEBF"/>
</linearGradient>
<linearGradient id="paint28_linear_211_9" x1="37.7232" y1="633.081" x2="78.2892" y2="705.462" gradientUnits="userSpaceOnUse">
<stop stop-color="#51EEDA"/>
<stop offset="1" stop-color="#4AFEBF"/>
</linearGradient>
<linearGradient id="paint29_linear_211_9" x1="171.311" y1="617.702" x2="187.282" y2="672.972" gradientUnits="userSpaceOnUse">
<stop stop-color="#51EEDA"/>
<stop offset="1" stop-color="#4AFEBF"/>
</linearGradient>
<linearGradient id="paint30_linear_211_9" x1="153.123" y1="671.463" x2="193.689" y2="743.845" gradientUnits="userSpaceOnUse">
<stop stop-color="#51EEDA"/>
<stop offset="1" stop-color="#4AFEBF"/>
</linearGradient>
<linearGradient id="paint31_linear_211_9" x1="67.7818" y1="674.054" x2="63.0974" y2="705.861" gradientUnits="userSpaceOnUse">
<stop stop-color="#51EEDA"/>
<stop offset="1" stop-color="#4AFEBF"/>
</linearGradient>
<linearGradient id="paint32_linear_211_9" x1="110.961" y1="696.371" x2="112.762" y2="697.104" gradientUnits="userSpaceOnUse">
<stop stop-color="#51EEDA"/>
<stop offset="1" stop-color="#4AFEBF"/>
</linearGradient>
<linearGradient id="paint33_linear_211_9" x1="90.6656" y1="688.061" x2="97.3975" y2="692.841" gradientUnits="userSpaceOnUse">
<stop stop-color="#51EEDA"/>
<stop offset="1" stop-color="#4AFEBF"/>
</linearGradient>
<linearGradient id="paint34_linear_211_9" x1="75.478" y1="676.997" x2="83.7965" y2="686.204" gradientUnits="userSpaceOnUse">
<stop stop-color="#51EEDA"/>
<stop offset="1" stop-color="#4AFEBF"/>
</linearGradient>
<linearGradient id="paint35_linear_211_9" x1="147.347" y1="700.901" x2="155.712" y2="710.327" gradientUnits="userSpaceOnUse">
<stop stop-color="#51EEDA"/>
<stop offset="1" stop-color="#4AFEBF"/>
</linearGradient>
<linearGradient id="paint36_linear_211_9" x1="127.462" y1="700.3" x2="134.194" y2="705.08" gradientUnits="userSpaceOnUse">
<stop stop-color="#51EEDA"/>
<stop offset="1" stop-color="#4AFEBF"/>
</linearGradient>
<linearGradient id="paint37_linear_211_9" x1="78.2182" y1="627.656" x2="94.953" y2="674.771" gradientUnits="userSpaceOnUse">
<stop stop-color="#51EEDA"/>
<stop offset="1" stop-color="#4AFEBF"/>
</linearGradient>
<linearGradient id="paint38_linear_211_9" x1="139.779" y1="648.131" x2="156.453" y2="695.34" gradientUnits="userSpaceOnUse">
<stop stop-color="#51EEDA"/>
<stop offset="1" stop-color="#4AFEBF"/>
</linearGradient>
<linearGradient id="paint39_linear_211_9" x1="112.22" y1="670.375" x2="117.631" y2="678.924" gradientUnits="userSpaceOnUse">
<stop stop-color="#51EEDA"/>
<stop offset="1" stop-color="#4AFEBF"/>
</linearGradient>
<linearGradient id="paint40_linear_211_9" x1="118.519" y1="672.471" x2="123.931" y2="681.019" gradientUnits="userSpaceOnUse">
<stop stop-color="#51EEDA"/>
<stop offset="1" stop-color="#4AFEBF"/>
</linearGradient>
<linearGradient id="paint41_linear_211_9" x1="146.07" y1="574.438" x2="165.31" y2="589.672" gradientUnits="userSpaceOnUse">
<stop stop-color="#51EEDA"/>
<stop offset="1" stop-color="#4AFEBF"/>
</linearGradient>
</defs>
</svg>
