<svg width="332" height="547" viewBox="0 0 332 547" fill="none" xmlns="http://www.w3.org/2000/svg">
<path d="M417.364 443.02L329.642 248.463" stroke="url(#paint0_linear_14_57179)" stroke-miterlimit="10" stroke-linecap="round" stroke-linejoin="round"/>
<path d="M329.668 248.463C293.66 323.545 279.418 414.02 277.474 497.568" stroke="url(#paint1_linear_14_57179)" stroke-miterlimit="10" stroke-linecap="round" stroke-linejoin="round"/>
<path d="M327.463 249.12C260.406 253.326 194.662 275.604 139.04 312.787" stroke="url(#paint2_linear_14_57179)" stroke-miterlimit="10" stroke-linecap="round" stroke-linejoin="round"/>
<path d="M330.173 248.798C262.222 197.271 176.255 170.251 91.4077 173.735" stroke="url(#paint3_linear_14_57179)" stroke-miterlimit="10" stroke-linecap="round" stroke-linejoin="round"/>
<path d="M330.737 248.463C331.72 163.019 289.09 80.4781 223.712 24.6468" stroke="url(#paint4_linear_14_57179)" stroke-miterlimit="10" stroke-linecap="round" stroke-linejoin="round"/>
<path d="M351.82 296.642C351.82 296.642 336.242 275.244 311.3 294.221C311.3 294.221 317.648 252.434 276.415 255.25C276.415 255.25 296.659 238.399 280.169 216.502C280.169 216.502 316.487 229.292 323.732 188.464" stroke="url(#paint5_linear_14_57179)" stroke-miterlimit="10"/>
<path d="M374.923 346.704C374.923 346.704 359.72 306.763 305.77 310.834C305.77 310.834 309.746 267.767 266.234 257.377C266.234 257.377 294.697 228.848 264.627 208.919C264.627 208.919 309.11 199.213 314.025 155.721" stroke="url(#paint6_linear_14_57179)" stroke-miterlimit="10"/>
<path d="M389.581 376.318C389.581 376.318 367.203 328.233 296.557 344.768C296.557 344.768 295.656 278.865 222.333 270.26C222.333 270.26 272.917 236.679 247.839 201.422C247.839 201.422 307.819 169.688 299.255 121.406" stroke="url(#paint7_linear_14_57179)" stroke-miterlimit="10"/>
<path d="M404.838 414.38C404.838 414.38 370.204 345.789 292.723 362.326C292.723 362.326 265.958 272.249 185.602 285.81C185.602 285.81 257.339 219.732 211.297 188.741C211.297 188.741 284.022 167.03 279.975 88.6493" stroke="url(#paint8_linear_14_57179)" stroke-miterlimit="10"/>
<path d="M412.121 430.837C412.121 430.837 345.904 379.925 279.428 461.564C279.428 461.564 279.192 320.771 156.993 301.195C156.993 301.195 213.271 182.574 134.004 174.474C134.004 174.474 261.027 135.027 253.95 55.6737" stroke="url(#paint9_linear_14_57179)" stroke-miterlimit="10"/>
<defs>
<linearGradient id="paint0_linear_14_57179" x1="483.544" y1="327.777" x2="299.319" y2="422.208" gradientUnits="userSpaceOnUse">
<stop stop-color="#51EEDA"/>
<stop offset="1" stop-color="#4AFEBF"/>
</linearGradient>
<linearGradient id="paint1_linear_14_57179" x1="398.666" y1="277.209" x2="251.098" y2="250.943" gradientUnits="userSpaceOnUse">
<stop stop-color="#51EEDA"/>
<stop offset="1" stop-color="#4AFEBF"/>
</linearGradient>
<linearGradient id="paint2_linear_14_57179" x1="331.962" y1="246.253" x2="137.187" y2="306.829" gradientUnits="userSpaceOnUse">
<stop stop-color="#51EEDA"/>
<stop offset="1" stop-color="#4AFEBF"/>
</linearGradient>
<linearGradient id="paint3_linear_14_57179" x1="337.037" y1="246.008" x2="273.262" y2="323.466" gradientUnits="userSpaceOnUse">
<stop stop-color="#51EEDA"/>
<stop offset="1" stop-color="#4AFEBF"/>
</linearGradient>
<linearGradient id="paint4_linear_14_57179" x1="405.521" y1="118.593" x2="197.136" y2="231.173" gradientUnits="userSpaceOnUse">
<stop stop-color="#51EEDA"/>
<stop offset="1" stop-color="#4AFEBF"/>
</linearGradient>
<linearGradient id="paint5_linear_14_57179" x1="393.869" y1="223.149" x2="258.273" y2="272.924" gradientUnits="userSpaceOnUse">
<stop stop-color="#51EEDA"/>
<stop offset="1" stop-color="#4AFEBF"/>
</linearGradient>
<linearGradient id="paint6_linear_14_57179" x1="445.784" y1="222.536" x2="248.389" y2="309.036" gradientUnits="userSpaceOnUse">
<stop stop-color="#51EEDA"/>
<stop offset="1" stop-color="#4AFEBF"/>
</linearGradient>
<linearGradient id="paint7_linear_14_57179" x1="482.1" y1="214.021" x2="209.332" y2="318.506" gradientUnits="userSpaceOnUse">
<stop stop-color="#51EEDA"/>
<stop offset="1" stop-color="#4AFEBF"/>
</linearGradient>
<linearGradient id="paint8_linear_14_57179" x1="520.83" y1="211.589" x2="189.872" y2="360.737" gradientUnits="userSpaceOnUse">
<stop stop-color="#51EEDA"/>
<stop offset="1" stop-color="#4AFEBF"/>
</linearGradient>
<linearGradient id="paint9_linear_14_57179" x1="544.358" y1="201.656" x2="67.5771" y2="387.327" gradientUnits="userSpaceOnUse">
<stop stop-color="#51EEDA"/>
<stop offset="1" stop-color="#4AFEBF"/>
</linearGradient>
</defs>
</svg>
