<svg width="150" height="149" viewBox="0 0 150 149" fill="none" xmlns="http://www.w3.org/2000/svg">
<path d="M19.3514 55.8606C13.5002 60.2414 10.0427 67.1447 6.45221 73.2513C0.999968 82.2785 1.26596 92.7659 1 102.722C1 108.298 2.06387 114.006 4.59052 119.184C9.51083 127.68 14.8301 136.309 23.8728 140.955C39.8306 149.452 51.9319 150.381 69.0865 144.54C86.5071 138.699 104.858 117.856 104.858 98.6071C104.593 90.1109 103.795 80.9509 97.4116 74.446C95.4168 72.4547 93.8211 70.0652 92.7572 67.2774C94.087 63.6931 95.8158 60.3743 98.3425 57.3209C104.726 58.1174 109.646 52.94 111.907 47.6299C113.901 43.78 110.843 39.9302 108.316 36.8769C104.726 32.4961 99.2733 29.9737 95.0179 26.6549C88.9008 22.0086 77.0654 18.6897 72.4111 26.9204C70.5493 30.5048 67.2248 34.3546 69.0865 38.47C69.3525 39.532 70.1504 40.3285 70.1504 41.5233C68.8205 43.7801 67.6237 46.7006 65.23 48.9574C49.1393 43.78 32.6496 46.3024 19.3514 55.8606ZM106.587 46.5679C96.0818 46.5679 86.5071 39.6647 79.0601 33.027C77.4644 31.434 74.6717 28.1152 77.7303 26.6549C84.1134 24.3981 90.0976 28.6462 95.1509 31.8323C98.2094 33.2926 114.167 44.3111 106.587 46.5679ZM102.864 49.6212C103.662 49.8867 104.46 49.8868 105.124 50.6833C103.795 56.5244 95.8158 53.7366 91.8263 52.6746C84.9113 50.4178 79.1931 46.0369 74.4058 40.8595C72.1451 38.6027 70.8153 35.9477 73.8738 33.1598C73.8738 33.1598 74.1398 33.1598 74.6718 33.1598C82.2517 40.7268 91.5603 47.8954 102.864 49.6212Z" stroke="url(#paint0_linear_34_4104)" stroke-miterlimit="10"/>
<path d="M95.2839 19.3535C101.135 22.4068 108.183 19.3535 110.976 13.7778C112.04 11.7865 112.306 9.39701 111.242 7.67122C107.385 -1.6215 97.1456 -0.559438 92.4912 6.87474C88.6348 11.9194 90.7625 16.8312 95.2839 19.3535Z" stroke="url(#paint1_linear_34_4104)" stroke-miterlimit="10"/>
<path d="M120.284 26.2567C123.609 21.6103 114.699 15.5036 111.508 21.0792C108.981 27.3186 116.162 31.1685 120.284 26.2567Z" stroke="url(#paint2_linear_34_4104)" stroke-miterlimit="10"/>
<path d="M42.6232 70.8616C40.7615 70.3306 39.0327 70.0652 37.7029 68.6049C32.2506 62.7637 26.3995 65.8171 20.8143 69.6669C7.51615 78.6941 5.92031 96.6157 9.77677 110.688C12.5694 121.972 21.6122 131.264 32.1177 136.043C50.0702 147.327 74.8048 140.955 86.1082 123.166C88.9008 119.051 90.7625 114.405 93.0232 109.891C97.6776 98.3415 87.571 105.776 82.5177 107.634C73.4749 110.157 64.0333 109.626 56.0544 104.581C49.9372 100.466 47.8095 93.828 46.6127 86.9248C50.6021 82.0129 50.0702 73.5167 42.6232 70.8616ZM31.5858 85.9955C33.8465 88.7833 36.5061 90.3764 40.3625 89.5799C41.4264 89.3144 42.2243 88.7833 43.1552 89.3143C44.219 90.3764 44.219 91.5712 44.751 92.8987C47.8095 106.174 58.847 111.351 71.4802 112.413C71.7462 112.944 71.7462 113.21 71.2142 113.475C54.3256 121.175 38.3678 114.006 29.0591 98.6071C24.1388 90.9074 21.6122 80.6854 24.9367 71.9237C26.5325 68.3394 32.1177 67.0118 34.3783 70.8616C31.5857 75.508 27.7293 80.9509 31.5858 85.9955Z" stroke="url(#paint3_linear_34_4104)" stroke-miterlimit="10"/>
<path d="M90.7625 77.1011C94.353 79.3579 96.3477 84.5353 95.4169 89.1817C94.8849 91.4385 92.3583 93.0315 89.9647 91.9695C85.0443 89.4471 82.7836 84.0043 83.8475 78.6941C84.5124 75.5081 87.8369 74.7115 90.7625 77.1011Z" stroke="url(#paint4_linear_34_4104)" stroke-miterlimit="10"/>
<path d="M57.7833 88.1196C63.3685 93.2969 71.8793 83.2077 64.9642 78.4286C59.379 74.5788 52.73 83.7387 57.7833 88.1196Z" stroke="url(#paint5_linear_34_4104)" stroke-miterlimit="10"/>
<path d="M37.8358 56.5243C37.5699 57.0553 37.5698 57.3208 37.3039 57.5863C35.3092 58.6483 32.9155 59.4449 30.9208 60.3742C28.9261 60.9052 28.3942 58.3829 29.8569 57.3209C31.8517 55.8606 36.772 53.2055 37.8358 56.5243Z" stroke="url(#paint6_linear_34_4104)" stroke-miterlimit="10"/>
<path d="M91.6933 98.3416C90.3634 100.864 86.507 99.9346 87.0389 97.0141C88.1028 93.297 93.821 93.9607 91.6933 98.3416Z" stroke="url(#paint7_linear_34_4104)" stroke-miterlimit="10"/>
<path d="M52.464 125.025C49.1394 131.663 58.8471 137.636 62.7036 131.132C67.0919 124.228 56.8523 117.856 52.464 125.025ZM56.0545 126.352C57.9162 123.83 61.9056 126.883 59.9109 129.406C58.0492 132.194 53.7938 128.609 56.0545 126.352Z" stroke="url(#paint8_linear_34_4104)" stroke-miterlimit="10"/>
<path d="M17.7557 105.776C18.0216 106.041 18.5536 106.307 18.5536 106.572C19.6175 109.626 21.0802 112.679 22.942 115.599C23.7399 116.661 22.676 118.653 21.3462 118.122C19.3515 116.794 13.1013 106.307 17.7557 105.776Z" stroke="url(#paint9_linear_34_4104)" stroke-miterlimit="10"/>
<path d="M44.2191 134.583C41.6924 132.592 44.2191 129.14 46.7457 130.733C49.4054 132.725 46.7457 136.309 44.2191 134.583Z" stroke="url(#paint10_linear_34_4104)" stroke-miterlimit="10"/>
<path d="M26.0005 121.175C24.4047 122.503 23.2079 119.582 24.6707 118.918C26.0005 118.387 27.0644 120.379 26.0005 121.175Z" stroke="url(#paint11_linear_34_4104)" stroke-miterlimit="10"/>
<path d="M148.875 73.3457C149.677 67.8212 146.601 60.8498 140.316 60.3237C133.362 59.7975 130.018 62.5598 128.146 68.2158C125.872 73.7403 130.954 81.6324 136.705 81.6324C142.455 81.5009 147.537 78.6071 148.875 73.3457Z" stroke="url(#paint12_linear_34_4104)" stroke-miterlimit="10"/>
<defs>
<linearGradient id="paint0_linear_34_4104" x1="-2.5655" y1="19.4744" x2="130.754" y2="125.329" gradientUnits="userSpaceOnUse">
<stop stop-color="#51EEDA"/>
<stop offset="1" stop-color="#4AFEBF"/>
</linearGradient>
<linearGradient id="paint1_linear_34_4104" x1="89.8003" y1="0.625613" x2="110.988" y2="21.5063" gradientUnits="userSpaceOnUse">
<stop stop-color="#51EEDA"/>
<stop offset="1" stop-color="#4AFEBF"/>
</linearGradient>
<linearGradient id="paint2_linear_34_4104" x1="110.661" y1="18.6701" x2="121.076" y2="28.4251" gradientUnits="userSpaceOnUse">
<stop stop-color="#51EEDA"/>
<stop offset="1" stop-color="#4AFEBF"/>
</linearGradient>
<linearGradient id="paint3_linear_34_4104" x1="5.18927" y1="63.8857" x2="87.8602" y2="147.929" gradientUnits="userSpaceOnUse">
<stop stop-color="#51EEDA"/>
<stop offset="1" stop-color="#4AFEBF"/>
</linearGradient>
<linearGradient id="paint4_linear_34_4104" x1="83.204" y1="75.3941" x2="99.6665" y2="86.151" gradientUnits="userSpaceOnUse">
<stop stop-color="#51EEDA"/>
<stop offset="1" stop-color="#4AFEBF"/>
</linearGradient>
<linearGradient id="paint5_linear_34_4104" x1="55.6184" y1="77.2748" x2="68.5351" y2="88.4218" gradientUnits="userSpaceOnUse">
<stop stop-color="#51EEDA"/>
<stop offset="1" stop-color="#4AFEBF"/>
</linearGradient>
<linearGradient id="paint6_linear_34_4104" x1="28.7424" y1="54.8219" x2="34.3498" y2="62.8743" gradientUnits="userSpaceOnUse">
<stop stop-color="#51EEDA"/>
<stop offset="1" stop-color="#4AFEBF"/>
</linearGradient>
<linearGradient id="paint7_linear_34_4104" x1="86.8235" y1="94.4956" x2="92.4312" y2="99.5056" gradientUnits="userSpaceOnUse">
<stop stop-color="#51EEDA"/>
<stop offset="1" stop-color="#4AFEBF"/>
</linearGradient>
<linearGradient id="paint8_linear_34_4104" x1="51.3987" y1="121.643" x2="64.3834" y2="133.255" gradientUnits="userSpaceOnUse">
<stop stop-color="#51EEDA"/>
<stop offset="1" stop-color="#4AFEBF"/>
</linearGradient>
<linearGradient id="paint9_linear_34_4104" x1="15.8418" y1="105.538" x2="26.8311" y2="111.219" gradientUnits="userSpaceOnUse">
<stop stop-color="#51EEDA"/>
<stop offset="1" stop-color="#4AFEBF"/>
</linearGradient>
<linearGradient id="paint10_linear_34_4104" x1="43.023" y1="130.235" x2="48.0965" y2="134.764" gradientUnits="userSpaceOnUse">
<stop stop-color="#51EEDA"/>
<stop offset="1" stop-color="#4AFEBF"/>
</linearGradient>
<linearGradient id="paint11_linear_34_4104" x1="23.9318" y1="118.778" x2="26.7808" y2="121.091" gradientUnits="userSpaceOnUse">
<stop stop-color="#51EEDA"/>
<stop offset="1" stop-color="#4AFEBF"/>
</linearGradient>
<linearGradient id="paint12_linear_34_4104" x1="126.907" y1="59.8513" x2="149.933" y2="80.5973" gradientUnits="userSpaceOnUse">
<stop stop-color="#51EEDA"/>
<stop offset="1" stop-color="#4AFEBF"/>
</linearGradient>
</defs>
</svg>
