<svg width="30" height="30" viewBox="0 0 30 30" fill="none" xmlns="http://www.w3.org/2000/svg">
<g clip-path="url(#clip0_102_4244)">
<mask id="mask0_102_4244" style="mask-type:luminance" maskUnits="userSpaceOnUse" x="0" y="0" width="30" height="30">
<path d="M30 0H0V30H30V0Z" fill="white"/>
</mask>
<g mask="url(#mask0_102_4244)">
<path d="M30 15.0917C30 6.75677 23.2843 0 15 0C6.71573 0 0 6.75677 0 15.0917C0 22.6243 5.48527 28.8678 12.6563 30V19.4542H8.84766V15.0917H12.6563V11.7668C12.6563 7.98443 14.8956 5.89519 18.322 5.89519C19.9631 5.89519 21.6797 6.18995 21.6797 6.18995V9.90391H19.7882C17.9249 9.90391 17.3437 11.0672 17.3437 12.2608V15.0917H21.5039L20.8388 19.4542H17.3437V30C24.5147 28.8678 30 22.6243 30 15.0917Z" fill="#4AFEBF"/>
</g>
</g>
<defs>
<clipPath id="clip0_102_4244">
<rect width="30" height="30" fill="white"/>
</clipPath>
</defs>
</svg>
