<svg width="245" height="188" viewBox="0 0 245 188" fill="none" xmlns="http://www.w3.org/2000/svg">
<path d="M243.453 143.679C241.591 141.674 238.583 140.957 236.148 140.241C230.705 138.809 225.978 136.803 221.251 133.939C212.8 128.496 203.489 123.769 193.319 124.198C183.293 124.055 173.123 124.628 163.239 123.482C161.95 123.196 161.091 122.766 158.656 120.904C158.656 120.761 158.656 120.474 158.656 120.331C142.47 127.636 115.684 135.371 98.2088 135.085C88.4686 134.368 70.7069 132.793 61.3964 129.785C61.3964 130.071 61.3964 130.214 61.3964 130.501C60.2505 132.077 59.2479 132.65 58.102 132.936C45.7834 137.09 33.0352 139.668 20.8599 144.252C13.2682 146.687 7.68196 152.273 2.81184 158.289C1.37946 159.722 -0.0529319 162.013 2.09565 163.589C3.3848 164.592 4.67389 164.878 6.24952 164.735C11.4061 164.305 16.706 165.451 21.7194 166.024C29.5975 166.884 36.1865 171.037 43.2052 174.475C51.3698 178.343 60.1073 180.348 69.2746 180.778C81.8796 182.067 94.4846 184.215 107.376 185.934C131.87 187.223 160.518 191.807 180.714 174.905C188.163 168.459 195.898 162.443 205.495 159.005C216.524 155.281 227.697 153.133 238.726 149.408C240.875 148.406 245.601 146.83 243.453 143.679ZM183.436 166.597C173.266 176.051 160.518 183.213 146.051 182.497C146.624 181.351 147.769 181.207 148.772 180.491C159.515 175.191 166.39 165.165 174.985 157.143C187.876 146.4 207.5 146.114 223.113 149.265C209.219 153.133 194.752 156.57 183.436 166.597ZM149.918 102.999C148.772 102.426 148.199 101.424 147.196 100.278C141.467 90.3941 142.899 77.7891 135.737 68.6218C130.581 60.7437 124.994 53.4385 122.559 44.4145C117.832 28.515 114.395 11.1831 93.9116 14.3343C79.0148 15.4802 63.6883 14.6208 50.5103 7.60214C46.4996 5.31032 43.2052 2.73201 38.908 1.01315C32.4623 0.440193 41.6296 18.7747 44.6376 20.6368C52.5157 28.2285 64.2612 31.3797 70.2772 41.4064C71.1367 42.5523 71.4232 44.128 71.1367 45.7036C68.1287 52.8655 66.6963 60.4572 66.8396 68.3353C66.9828 77.0729 69.1314 86.2401 65.1207 94.4048C61.8262 100.707 62.3991 107.726 61.5397 114.601C61.11 115.461 60.8235 116.464 60.6802 117.323C87.1794 119.758 129.148 119.328 154.072 106.294C152.926 105.148 151.494 104.002 149.918 102.999Z" stroke="url(#paint0_linear_34_4069)" stroke-miterlimit="10"/>
<path d="M45.2104 145.398C41.9159 145.541 39.9106 146.114 37.6188 147.833C33.1784 154.279 45.2104 155.424 48.6482 152.416C51.2265 150.841 50.7968 146.257 47.5023 145.828C46.6428 145.398 45.4969 145.541 45.2104 145.398Z" stroke="url(#paint1_linear_34_4069)" stroke-miterlimit="10"/>
<path d="M146.91 169.032C142.756 171.038 139.462 174.046 134.878 175.478C134.448 175.621 133.875 176.051 133.302 176.481C132.729 176.91 133.016 178.486 133.732 178.486C136.74 180.634 153.929 171.61 146.91 169.032Z" stroke="url(#paint2_linear_34_4069)" stroke-miterlimit="10"/>
<path d="M198.762 136.66C199.479 136.66 200.338 135.658 200.481 134.655C200.481 133.939 199.478 133.079 198.906 132.793C196.47 131.933 186.587 130.071 186.444 134.082C186.73 134.941 187.59 136.087 188.736 135.944C191.887 136.23 195.325 136.517 198.762 136.66Z" stroke="url(#paint3_linear_34_4069)" stroke-miterlimit="10"/>
<path d="M58.9613 141.53C57.0992 141.674 55.8101 142.103 55.0939 143.679C53.375 147.976 59.6775 148.406 61.6828 145.684C63.5449 143.679 61.3964 141.53 58.9613 141.53Z" stroke="url(#paint4_linear_34_4069)" stroke-miterlimit="10"/>
<path d="M137.17 169.032C137.743 169.319 138.029 170.178 138.459 170.035C139.748 170.321 142.326 169.319 142.04 167.743C141.324 165.594 138.745 166.454 137.456 167.743C137.313 168.029 137.456 168.459 137.17 169.032Z" stroke="url(#paint5_linear_34_4069)" stroke-miterlimit="10"/>
<path d="M74.0014 167.6C73.8581 170.035 77.4391 169.605 77.2959 167.457C77.1526 165.594 74.2879 165.594 74.0014 167.6Z" stroke="url(#paint6_linear_34_4069)" stroke-miterlimit="10"/>
<path d="M178.422 134.941C179.855 137.806 182.29 136.517 182.147 134.512C181.287 132.65 179.712 132.22 178.422 134.941Z" stroke="url(#paint7_linear_34_4069)" stroke-miterlimit="10"/>
<path d="M80.1608 165.881C80.877 166.597 82.1661 167.6 82.3093 165.881C82.7391 164.305 80.4472 163.876 80.1608 165.881Z" stroke="url(#paint8_linear_34_4069)" stroke-miterlimit="10"/>
<path d="M100.501 23.2151C90.474 24.5043 99.0682 35.3904 105.084 35.3904C107.09 35.6769 108.952 33.2419 108.522 31.2365C107.663 26.9394 104.368 23.5016 100.071 23.3584C99.6412 23.2152 99.2115 23.3584 100.501 23.2151Z" stroke="url(#paint9_linear_34_4069)" stroke-miterlimit="10"/>
<path d="M116.114 58.7384C118.262 60.1707 122.559 72.2028 125.567 66.0435C122.13 60.4572 120.124 54.1546 116.114 48.998C115.684 48.4251 114.252 48.4251 113.679 48.8548C113.392 49.4278 113.106 50.0008 112.819 50.5737C113.679 53.5817 115.254 56.1601 116.114 58.7384Z" stroke="url(#paint10_linear_34_4069)" stroke-miterlimit="10"/>
<path d="M89.1847 28.6582C95.344 26.9394 87.3226 19.9206 84.8876 24.0746C84.0281 26.9393 87.0361 28.6582 89.1847 28.6582Z" stroke="url(#paint11_linear_34_4069)" stroke-miterlimit="10"/>
<path d="M116.114 58.7384C114.681 57.306 111.96 56.0168 111.816 58.8816C112.246 60.1708 112.676 61.4599 113.249 62.7491C113.965 64.1815 116.114 63.4652 116.4 62.1761C116.4 61.3166 116.4 59.8843 116.114 58.7384Z" stroke="url(#paint12_linear_34_4069)" stroke-miterlimit="10"/>
<path d="M80.4473 83.9484C78.1555 83.5186 77.0096 87.3861 79.7311 87.5293C82.1661 87.959 82.7391 84.6646 80.4473 83.9484Z" stroke="url(#paint13_linear_34_4069)" stroke-miterlimit="10"/>
<path d="M85.4605 84.2349C87.3226 84.0916 87.4658 80.7971 85.3172 80.9404C82.8822 81.2269 83.3119 84.2349 85.4605 84.2349Z" stroke="url(#paint14_linear_34_4069)" stroke-miterlimit="10"/>
<path d="M135.594 121.763C135.737 121.477 135.881 120.474 136.31 120.331C139.032 118.469 142.326 116.75 144.905 115.031C152.496 116.464 136.454 126.777 135.594 121.763Z" stroke="url(#paint15_linear_34_4069)" stroke-miterlimit="10"/>
<path d="M153.929 106.58C129.005 119.615 87.0362 120.045 60.5371 117.609C59.6776 121.62 61.11 125.631 61.11 129.785C70.4206 132.793 88.1821 134.368 97.9223 135.085C115.397 135.371 142.183 127.636 158.369 120.331C158.083 115.318 156.937 110.304 153.929 106.58ZM130.151 125.917C127.286 125.917 127.859 121.62 130.438 121.477C133.302 121.334 132.443 125.488 130.151 125.917ZM135.594 121.763C135.737 121.477 135.881 120.474 136.31 120.331C139.032 118.469 142.326 116.75 144.905 115.031C152.496 116.464 136.454 126.777 135.594 121.763Z" stroke="url(#paint16_linear_34_4069)" stroke-miterlimit="10"/>
<path d="M130.151 125.917C127.286 125.917 127.859 121.62 130.438 121.477C133.302 121.334 132.443 125.488 130.151 125.917Z" stroke="url(#paint17_linear_34_4069)" stroke-miterlimit="10"/>
<defs>
<linearGradient id="paint0_linear_34_4069" x1="-6.76713" y1="-2.56893" x2="192.712" y2="231.235" gradientUnits="userSpaceOnUse">
<stop stop-color="#51EEDA"/>
<stop offset="1" stop-color="#4AFEBF"/>
</linearGradient>
<linearGradient id="paint1_linear_34_4069" x1="36.2107" y1="145.233" x2="44.9638" y2="157.745" gradientUnits="userSpaceOnUse">
<stop stop-color="#51EEDA"/>
<stop offset="1" stop-color="#4AFEBF"/>
</linearGradient>
<linearGradient id="paint2_linear_34_4069" x1="132.499" y1="168.845" x2="142.445" y2="183.095" gradientUnits="userSpaceOnUse">
<stop stop-color="#51EEDA"/>
<stop offset="1" stop-color="#4AFEBF"/>
</linearGradient>
<linearGradient id="paint3_linear_34_4069" x1="185.995" y1="131.508" x2="189.774" y2="140.947" gradientUnits="userSpaceOnUse">
<stop stop-color="#51EEDA"/>
<stop offset="1" stop-color="#4AFEBF"/>
</linearGradient>
<linearGradient id="paint4_linear_34_4069" x1="54.5577" y1="141.418" x2="60.8361" y2="148.726" gradientUnits="userSpaceOnUse">
<stop stop-color="#51EEDA"/>
<stop offset="1" stop-color="#4AFEBF"/>
</linearGradient>
<linearGradient id="paint5_linear_34_4069" x1="137.013" y1="166.364" x2="140.898" y2="171.049" gradientUnits="userSpaceOnUse">
<stop stop-color="#51EEDA"/>
<stop offset="1" stop-color="#4AFEBF"/>
</linearGradient>
<linearGradient id="paint6_linear_34_4069" x1="73.8916" y1="166.017" x2="77.3247" y2="169.227" gradientUnits="userSpaceOnUse">
<stop stop-color="#51EEDA"/>
<stop offset="1" stop-color="#4AFEBF"/>
</linearGradient>
<linearGradient id="paint7_linear_34_4069" x1="178.303" y1="132.939" x2="182.193" y2="136.564" gradientUnits="userSpaceOnUse">
<stop stop-color="#51EEDA"/>
<stop offset="1" stop-color="#4AFEBF"/>
</linearGradient>
<linearGradient id="paint8_linear_34_4069" x1="80.0904" y1="164.489" x2="82.5513" y2="166.611" gradientUnits="userSpaceOnUse">
<stop stop-color="#51EEDA"/>
<stop offset="1" stop-color="#4AFEBF"/>
</linearGradient>
<linearGradient id="paint9_linear_34_4069" x1="95.4902" y1="22.9817" x2="108.675" y2="35.3169" gradientUnits="userSpaceOnUse">
<stop stop-color="#51EEDA"/>
<stop offset="1" stop-color="#4AFEBF"/>
</linearGradient>
<linearGradient id="paint10_linear_34_4069" x1="112.412" y1="48.1803" x2="130.742" y2="59.1054" gradientUnits="userSpaceOnUse">
<stop stop-color="#51EEDA"/>
<stop offset="1" stop-color="#4AFEBF"/>
</linearGradient>
<linearGradient id="paint11_linear_34_4069" x1="84.5221" y1="22.6672" x2="90.8873" y2="29.2165" gradientUnits="userSpaceOnUse">
<stop stop-color="#51EEDA"/>
<stop offset="1" stop-color="#4AFEBF"/>
</linearGradient>
<linearGradient id="paint12_linear_34_4069" x1="111.67" y1="57.0491" x2="117.963" y2="61.1241" gradientUnits="userSpaceOnUse">
<stop stop-color="#51EEDA"/>
<stop offset="1" stop-color="#4AFEBF"/>
</linearGradient>
<linearGradient id="paint13_linear_34_4069" x1="78.0266" y1="83.8451" x2="81.9707" y2="87.4852" gradientUnits="userSpaceOnUse">
<stop stop-color="#51EEDA"/>
<stop offset="1" stop-color="#4AFEBF"/>
</linearGradient>
<linearGradient id="paint14_linear_34_4069" x1="83.5601" y1="80.8727" x2="87.105" y2="83.994" gradientUnits="userSpaceOnUse">
<stop stop-color="#51EEDA"/>
<stop offset="1" stop-color="#4AFEBF"/>
</linearGradient>
<linearGradient id="paint15_linear_34_4069" x1="135.232" y1="114.876" x2="143.772" y2="125.64" gradientUnits="userSpaceOnUse">
<stop stop-color="#51EEDA"/>
<stop offset="1" stop-color="#4AFEBF"/>
</linearGradient>
<linearGradient id="paint16_linear_34_4069" x1="57.1266" y1="106.034" x2="75.1991" y2="161.966" gradientUnits="userSpaceOnUse">
<stop stop-color="#51EEDA"/>
<stop offset="1" stop-color="#4AFEBF"/>
</linearGradient>
<linearGradient id="paint17_linear_34_4069" x1="128.112" y1="121.388" x2="132.823" y2="125.213" gradientUnits="userSpaceOnUse">
<stop stop-color="#51EEDA"/>
<stop offset="1" stop-color="#4AFEBF"/>
</linearGradient>
</defs>
</svg>
