<svg width="79" height="102" viewBox="0 0 79 102" fill="none" xmlns="http://www.w3.org/2000/svg">
<path d="M29.5488 70.6465C18.7294 65.2638 14.3626 52.1909 19.5852 41.603C24.8775 30.8739 37.9516 26.6535 48.6288 31.9654C59.4483 37.3481 63.815 50.421 58.5924 61.0089C53.5121 71.6676 40.3683 76.0292 29.5488 70.6465Z" stroke="url(#paint0_linear_14_57252)" stroke-miterlimit="10" stroke-linecap="round" stroke-linejoin="round"/>
<path d="M28.8113 45.9933C31.6664 40.2053 38.6623 37.8838 44.4991 40.7876" stroke="url(#paint1_linear_14_57252)" stroke-miterlimit="10" stroke-linecap="round" stroke-linejoin="round"/>
<path d="M22.3615 64.9846L3.6989 75.5381L18.8829 79.931L19.4747 90.9335L28.6924 84.8103L41.373 94.2776L38.4263 72.9754" stroke="url(#paint2_linear_14_57252)" stroke-miterlimit="10" stroke-linecap="round" stroke-linejoin="round"/>
<path d="M40.455 28.5729L37.4387 7.41211L50.1191 16.8792L59.1945 10.6854L59.9285 21.7584L75.1123 26.1512L56.5195 36.5636" stroke="url(#paint3_linear_14_57252)" stroke-miterlimit="10" stroke-linecap="round" stroke-linejoin="round"/>
<defs>
<linearGradient id="paint0_linear_14_57252" x1="28.2435" y1="20.9018" x2="51.2085" y2="79.5061" gradientUnits="userSpaceOnUse">
<stop stop-color="#51EEDA"/>
<stop offset="1" stop-color="#4AFEBF"/>
</linearGradient>
<linearGradient id="paint1_linear_14_57252" x1="33.7262" y1="35.1791" x2="39.9286" y2="51.0061" gradientUnits="userSpaceOnUse">
<stop stop-color="#51EEDA"/>
<stop offset="1" stop-color="#4AFEBF"/>
</linearGradient>
<linearGradient id="paint2_linear_14_57252" x1="10.5602" y1="58.5904" x2="15.6508" y2="102.947" gradientUnits="userSpaceOnUse">
<stop stop-color="#51EEDA"/>
<stop offset="1" stop-color="#4AFEBF"/>
</linearGradient>
<linearGradient id="paint3_linear_14_57252" x1="39.4309" y1="0.334095" x2="44.3685" y2="44.5039" gradientUnits="userSpaceOnUse">
<stop stop-color="#51EEDA"/>
<stop offset="1" stop-color="#4AFEBF"/>
</linearGradient>
</defs>
</svg>
