<svg width="63" height="50" viewBox="0 0 63 50" fill="none" xmlns="http://www.w3.org/2000/svg">
<path d="M18.6629 31.2104C15.4155 24.4308 18.3868 16.2931 25.1341 13.0315C31.9714 9.72643 40.1084 12.6044 43.313 19.2947C46.5604 26.0743 43.5891 34.212 36.8417 37.4736C30.1372 40.8244 21.9102 37.99 18.6629 31.2104Z" stroke="url(#paint0_linear_34_4117)" stroke-miterlimit="10" stroke-linecap="round" stroke-linejoin="round"/>
<path d="M27.9299 18.6978C31.6184 16.9148 35.9973 18.4235 37.7491 22.0809" stroke="url(#paint1_linear_34_4117)" stroke-miterlimit="10" stroke-linecap="round" stroke-linejoin="round"/>
<path d="M17.5264 25.564L4.09059 23.6961L9.90708 31.6659L5.86525 37.3592L12.8603 37.8292L15.4326 47.3666L22.3628 35.6575" stroke="url(#paint2_linear_34_4117)" stroke-miterlimit="10" stroke-linecap="round" stroke-linejoin="round"/>
<path d="M40.3728 14.5919L47.2131 2.92611L49.7855 12.4637L56.7379 12.8444L52.7388 18.6271L58.5554 26.597L45.2094 24.6855" stroke="url(#paint3_linear_34_4117)" stroke-miterlimit="10" stroke-linecap="round" stroke-linejoin="round"/>
<defs>
<linearGradient id="paint0_linear_34_4117" x1="37.5567" y1="6.06433" x2="26.6837" y2="44.0526" gradientUnits="userSpaceOnUse">
<stop stop-color="#51EEDA"/>
<stop offset="1" stop-color="#4AFEBF"/>
</linearGradient>
<linearGradient id="paint1_linear_34_4117" x1="34.6136" y1="15.2072" x2="31.6773" y2="25.4666" gradientUnits="userSpaceOnUse">
<stop stop-color="#51EEDA"/>
<stop offset="1" stop-color="#4AFEBF"/>
</linearGradient>
<linearGradient id="paint2_linear_34_4117" x1="14.1801" y1="17.8889" x2="-0.314653" y2="42.1443" gradientUnits="userSpaceOnUse">
<stop stop-color="#51EEDA"/>
<stop offset="1" stop-color="#4AFEBF"/>
</linearGradient>
<linearGradient id="paint3_linear_34_4117" x1="50.9929" y1="0.167868" x2="36.4914" y2="24.2722" gradientUnits="userSpaceOnUse">
<stop stop-color="#51EEDA"/>
<stop offset="1" stop-color="#4AFEBF"/>
</linearGradient>
</defs>
</svg>
