<svg width="394" height="725" viewBox="0 0 394 725" fill="none" xmlns="http://www.w3.org/2000/svg">
<path d="M-11.4717 67.6683L-14.656 390.855" stroke="url(#paint0_linear_14_57151)" stroke-miterlimit="10" stroke-linecap="round" stroke-linejoin="round"/>
<path d="M-14.1704 391.158L185.319 142.413" stroke="url(#paint1_linear_14_57151)" stroke-miterlimit="10" stroke-linecap="round" stroke-linejoin="round"/>
<path d="M81.5325 81.3136C74.2048 100.426 -7.3284 371.742 -14.5168 391.073" stroke="url(#paint2_linear_14_57151)" stroke-miterlimit="10" stroke-linecap="round" stroke-linejoin="round"/>
<path d="M276.775 302.887L-14.6559 390.855" stroke="url(#paint3_linear_14_57151)" stroke-miterlimit="10" stroke-linecap="round" stroke-linejoin="round"/>
<path d="M-14.6561 390.855L196.435 595.239" stroke="url(#paint4_linear_14_57151)" stroke-miterlimit="10" stroke-linecap="round" stroke-linejoin="round"/>
<path d="M-14.6559 390.855L-4.65094 723.728" stroke="url(#paint5_linear_14_57151)" stroke-miterlimit="10" stroke-linecap="round" stroke-linejoin="round"/>
<path d="M359.127 437.246L-14.6561 390.855" stroke="url(#paint6_linear_14_57151)" stroke-miterlimit="10" stroke-linecap="round" stroke-linejoin="round"/>
<path d="M293.813 527.183L-14.6561 390.855" stroke="url(#paint7_linear_14_57151)" stroke-miterlimit="10" stroke-linecap="round" stroke-linejoin="round"/>
<path d="M-12.0079 122.969C-12.0079 122.969 6.43654 165.528 63.3563 138.675C63.3563 138.675 86.1038 201.204 149.236 187.269C149.236 187.269 177.931 282.841 256.175 308.988C256.175 308.988 249.756 415.33 336.416 434.564C336.416 434.564 262.033 455.996 269.754 516.459C269.754 516.459 187.254 516.059 173.505 573.047C173.505 573.047 21.0135 584.518 -5.47073 692.321" stroke="url(#paint8_linear_14_57151)" stroke-miterlimit="10" stroke-linecap="round" stroke-linejoin="round"/>
<path d="M-6.66695 653.479C-6.66695 653.479 27.6344 527.785 156.065 556.251C156.065 556.251 168.553 495.463 239.316 503.056C239.316 503.056 213.605 443.649 281.643 427.807C281.643 427.807 190.76 374.121 242.489 313.128C242.489 313.128 126.66 286.127 136.151 203.305C136.151 203.305 59.4075 222.868 55.4296 163.697C55.4296 163.697 37.4911 194.502 -12.5327 164.139" stroke="url(#paint9_linear_14_57151)" stroke-miterlimit="10" stroke-linecap="round" stroke-linejoin="round"/>
<path d="M-12.7296 200.801C-12.7296 200.801 11.1601 220.845 48.9452 185.955C48.9452 185.955 60.4873 250.117 119.007 225.313C119.007 225.313 117.509 316.536 202.743 325.322C202.743 325.322 177.8 386.7 236.288 422.094C236.288 422.094 190.762 425.7 203.539 487.231C203.539 487.231 144.938 474.937 138.693 539.105C138.693 539.105 10.4661 492.701 -7.2007 624.345" stroke="url(#paint10_linear_14_57151)" stroke-miterlimit="10" stroke-linecap="round" stroke-linejoin="round"/>
<path d="M-13.1675 229.328C-13.1675 229.328 -7.39986 252.047 36.1683 226.664C36.1683 226.664 38.5424 282.868 89.671 261.558C89.671 261.558 97.7305 320.271 147.649 341.797C147.649 341.797 130.629 394.121 187.539 416.092C187.539 416.092 143.576 429.446 165.891 470.759C165.891 470.759 115.407 463.411 106.663 508.605C106.663 508.605 34.361 463.003 -10.2069 548.895" stroke="url(#paint11_linear_14_57151)" stroke-miterlimit="10" stroke-linecap="round" stroke-linejoin="round"/>
<path d="M-13.4887 269.447C-13.4887 269.447 1.55266 292.074 26.0615 260.141C26.0615 260.141 32.0357 299.614 67.4291 289.28C67.4291 289.28 76.7348 348.117 125.321 348.388C125.321 348.388 108.678 391.261 156.379 412.055C156.379 412.055 121.117 420.77 147.517 462.543C147.517 462.543 82.9818 454.655 90.6126 493.07C90.6126 493.07 29.0264 444.612 -11.7225 499.511" stroke="url(#paint12_linear_14_57151)" stroke-miterlimit="10" stroke-linecap="round" stroke-linejoin="round"/>
<path d="M-13.9151 300.729C-13.9151 300.729 -8.66682 314.876 15.2656 294.365C15.2656 294.365 30.6832 324.427 53.6554 306.064C53.6554 306.064 55.8753 358.375 100.644 355.867C100.644 355.867 86.4634 374.752 121.618 407.862C121.618 407.862 101.568 429.884 126.926 453.595C126.926 453.595 79.7858 434.591 69.3511 472.576C69.3511 472.576 18.0891 427.039 -12.6251 464.779" stroke="url(#paint13_linear_14_57151)" stroke-miterlimit="10" stroke-linecap="round" stroke-linejoin="round"/>
<path d="M-14.0779 328.773C-14.0779 328.773 3.24897 351.781 33.9626 330.928C33.9626 330.928 19.9695 378.862 79.7943 402.655C79.7943 402.655 38.2559 416.609 48.9217 452.471C48.9217 452.471 17.1294 412.301 -13.7497 426.505" stroke="url(#paint14_linear_14_57151)" stroke-miterlimit="10" stroke-linecap="round" stroke-linejoin="round"/>
<defs>
<linearGradient id="paint0_linear_14_57151" x1="-9.50114" y1="60.2628" x2="-144.282" y2="324.814" gradientUnits="userSpaceOnUse">
<stop stop-color="#51EEDA"/>
<stop offset="1" stop-color="#4AFEBF"/>
</linearGradient>
<linearGradient id="paint1_linear_14_57151" x1="192.401" y1="135.567" x2="235.352" y2="338.293" gradientUnits="userSpaceOnUse">
<stop stop-color="#51EEDA"/>
<stop offset="1" stop-color="#4AFEBF"/>
</linearGradient>
<linearGradient id="paint2_linear_14_57151" x1="86.0479" y1="73.6746" x2="25.0703" y2="398.504" gradientUnits="userSpaceOnUse">
<stop stop-color="#51EEDA"/>
<stop offset="1" stop-color="#4AFEBF"/>
</linearGradient>
<linearGradient id="paint3_linear_14_57151" x1="239.234" y1="226.745" x2="283.909" y2="391.926" gradientUnits="userSpaceOnUse">
<stop stop-color="#51EEDA"/>
<stop offset="1" stop-color="#4AFEBF"/>
</linearGradient>
<linearGradient id="paint4_linear_14_57151" x1="41.382" y1="348.555" x2="-50.6188" y2="439.355" gradientUnits="userSpaceOnUse">
<stop stop-color="#51EEDA"/>
<stop offset="1" stop-color="#4AFEBF"/>
</linearGradient>
<linearGradient id="paint5_linear_14_57151" x1="-13.0015" y1="383.305" x2="-155.899" y2="639.301" gradientUnits="userSpaceOnUse">
<stop stop-color="#51EEDA"/>
<stop offset="1" stop-color="#4AFEBF"/>
</linearGradient>
<linearGradient id="paint6_linear_14_57151" x1="235.046" y1="225.842" x2="168.009" y2="602.859" gradientUnits="userSpaceOnUse">
<stop stop-color="#51EEDA"/>
<stop offset="1" stop-color="#4AFEBF"/>
</linearGradient>
<linearGradient id="paint7_linear_14_57151" x1="144.655" y1="282.677" x2="5.01711" y2="561.769" gradientUnits="userSpaceOnUse">
<stop stop-color="#51EEDA"/>
<stop offset="1" stop-color="#4AFEBF"/>
</linearGradient>
<linearGradient id="paint8_linear_14_57151" x1="100.54" y1="40.0769" x2="-111.039" y2="656.06" gradientUnits="userSpaceOnUse">
<stop stop-color="#51EEDA"/>
<stop offset="1" stop-color="#4AFEBF"/>
</linearGradient>
<linearGradient id="paint9_linear_14_57151" x1="107.204" y1="78.0641" x2="-68.299" y2="637.997" gradientUnits="userSpaceOnUse">
<stop stop-color="#51EEDA"/>
<stop offset="1" stop-color="#4AFEBF"/>
</linearGradient>
<linearGradient id="paint10_linear_14_57151" x1="89.0987" y1="127.409" x2="-65.5431" y2="610.164" gradientUnits="userSpaceOnUse">
<stop stop-color="#51EEDA"/>
<stop offset="1" stop-color="#4AFEBF"/>
</linearGradient>
<linearGradient id="paint11_linear_14_57151" x1="53.4916" y1="179.924" x2="-85.2214" y2="538.232" gradientUnits="userSpaceOnUse">
<stop stop-color="#51EEDA"/>
<stop offset="1" stop-color="#4AFEBF"/>
</linearGradient>
<linearGradient id="paint12_linear_14_57151" x1="51.992" y1="221.942" x2="-65.4381" y2="511.847" gradientUnits="userSpaceOnUse">
<stop stop-color="#51EEDA"/>
<stop offset="1" stop-color="#4AFEBF"/>
</linearGradient>
<linearGradient id="paint13_linear_14_57151" x1="44.4552" y1="258.784" x2="-53.9437" y2="487.098" gradientUnits="userSpaceOnUse">
<stop stop-color="#51EEDA"/>
<stop offset="1" stop-color="#4AFEBF"/>
</linearGradient>
<linearGradient id="paint14_linear_14_57151" x1="20.1021" y1="303.795" x2="-48.5652" y2="440.954" gradientUnits="userSpaceOnUse">
<stop stop-color="#51EEDA"/>
<stop offset="1" stop-color="#4AFEBF"/>
</linearGradient>
</defs>
</svg>
