{   
    "1": {
        "chain_name": "Ethereum Mainnet",
        "wl_items": [
            "0x7728cd70b3dD86210e2bd321437F448231B81733", 
            "0x6b175474e89094c44da98b954eedeac495271d0f", 
            "0xdAC17F958D2ee523a2206206994597C13D831ec7", 
            "0xA0b86991c6218b36c1d19D4a2e9Eb0cE3606eB48"
        ]
    }, 

    "56":{
        "chain_name": "BSC Mainnet",
        "need_test_tx": "true",
        "erc20":[
            "0x7728cd70b3dD86210e2bd321437F448231B81733"
        ],
        "trusted_signers_list":[
            "0x7EC0BF0a4D535Ea220c6bD961e352B752906D568",
            "0x4b664eD07D19d0b192A037Cfb331644cA536029d"
        ],
        "status_to_set": "true",
          "factory": "0xBDb5201565925AE934A5622F0E7091aFFceed5EB",
          "myshch_factory": "0xf58208676a7b5a604df41ca25b5310f3cc997bF3",
          "legacy_wrapper": "0x21c23bA0ec49c9440CD259cCB48ff9D06CD16522",
          "impl_legacy": "0x653bce4d7A6CF5C4FdbBD5fc6B2bB41c8eAFC56A",
          "impl_native": "0x22bBBE241464AB67c9B4F0881fA45F7f2d26870F",
          "impl_myshch": "0x9C10eD902Ae7fD997D92eeD7535849f204b727b7",
          "impl_index": "0x28466e3e92CB6FB292618D0faEbB49624f4d6f0C",
          "impl_erc20": "0x7A3c8F45b809078da58d17fb6Cd059334622838F"
    },

    "97":{
        "wl_items": [
            "0xCEFe82aDEd5e1f8c2610256629d651840601EAa8" 
        ]
    },
    
    "137": {
        "chain_name": "Polygon Mainnet",
        "event_reg": "0x0C40D8C0BA6A8B97cF3a43Bf34C61e2b3299984b", 
        "wl_items": [
            "0x432cdbC749FD96AA35e1dC27765b23fDCc8F5cf1",
            "0x8f3Cf7ad23Cd3CaDbD9735AFf958023239c6A063", 
            "0xc2132D05D31c914a87C6611C10748AEb04B58e8F", 
            "0x2791bca1f2de4661ed88a30c99a7a9449aa84174", 
            "0x7ceB23fD6bC0adD59E62ac25578270cFf1b9f619"
        ]
    },
    
    "31337": {
        "need_test_tx": "true",
        "erc20": [
        ],
        "trusted_signers_list":[
            "0x7EC0BF0a4D535Ea220c6bD961e352B752906D568",
            "0x4b664eD07D19d0b192A037Cfb331644cA536029d"
        ],                 
        "myshch_factory": "0x0000000000000000000000000000000000000000"
    },

    "42161":{
        "chain_name": "Arbitrum",
        "event_reg": "0x33ec38185f213D6e75ba26F711ba309b8BcD211a", 
        "wl_items": [
            "", 
            "", 
            ""
        ]
    },

    "80001":{
        "wl_items": [
            "", 
            "", 
            "", 
            ""
        ]
    },

    "81457":{
        "chain_name": "Blast Mainnet",
        "event_reg": "0xBB990bAFA2BB5b733d2E4A2dB7F18760fe440980", 
        "wl_items": [
            "0x4300000000000000000000000000000000000003", 
            "0x4300000000000000000000000000000000000004"
        ]
    },

    "534352": {
        "wl_items": [
            "", 
            "", 
            "", 
            ""
        ]
    },

    "11155111": {
        "chain_name": "Sepolia",
        "need_test_tx": "true",
        "erc20": [
            "0x5dB9f4C9239345308614604e69258C0bba9b437f", 
            "0xB4615D8E576c01d73CC840C19413a3d388060AD3"
        ],
        "trusted_signers_list":[
            "0x7EC0BF0a4D535Ea220c6bD961e352B752906D568",
            "0x4b664eD07D19d0b192A037Cfb331644cA536029d"
        ],
        "status_to_set": "true",
        
        "factory": "0xa9A9B9d76c5449dCB4fF1B74E023bF3f6F8a30cf",
        "myshch_factory": "0xd804c5ccaA9Bf0AcFa635151049e8f785cC0767E",
        "legacy_wrapper": "0x0d8D18aB6ac0de433209DC9C23b3C5031e381480",
        "impl_legacy": "0xAe7B1d62440f357C3793d11417c7fE9201047940",
        "impl_native": "0xAcF48aa264fc4b2B890F0b132049E09620eBb826",
        "impl_myshch": "0x70c651fB62e88faaCEdF6829A1A1a2EFb37AB79d",
        "impl_index": "0x36013ECf61dBA5EAB01E4551360600440107b70D",
        "impl_erc20": "0x6178438A0BB1c6002B585a670AAa0f8c4D8b0aed"



    },

    "168587773": {
        "chain_name": "Blast Mainnet",
        "wl_items": [
        ]
    }
}