{
	"SWARM_BASE_URLS": [
		{ "prefix": "ipfs://", "baseUrl": "https://ipfs.io/ipfs/" },
		{ "prefix": "bzz://", "baseUrl": "https://swarm.envelop.is/bzz/" },
		{ "prefix": "https://swarm.envelop.is/bzz/ipfs://", "baseUrl": "https://ipfs.io/ipfs/" }
	],

	"thumbnailSizeWidth": 200
}