[
    {
        "inputs": [
            {
                "internalType": "address",
                "name": "_subscrRegistry",
                "type": "address"
            }
        ],
        "stateMutability": "nonpayable",
        "type": "constructor"
    },
    {
        "anonymous": false,
        "inputs": [
            {
                "indexed": true,
                "internalType": "address",
                "name": "previousOwner",
                "type": "address"
            },
            {
                "indexed": true,
                "internalType": "address",
                "name": "newOwner",
                "type": "address"
            }
        ],
        "name": "OwnershipTransferred",
        "type": "event"
    },
    {
        "inputs": [
            {
                "internalType": "address[]",
                "name": "_wNFTAddress",
                "type": "address[]"
            },
            {
                "internalType": "uint256[]",
                "name": "_wNFTTokenId",
                "type": "uint256[]"
            },
            {
                "components": [
                    {
                        "components": [
                            {
                                "internalType": "enum ETypes.AssetType",
                                "name": "assetType",
                                "type": "uint8"
                            },
                            {
                                "internalType": "address",
                                "name": "contractAddress",
                                "type": "address"
                            }
                        ],
                        "internalType": "struct ETypes.Asset",
                        "name": "asset",
                        "type": "tuple"
                    },
                    {
                        "internalType": "uint256",
                        "name": "tokenId",
                        "type": "uint256"
                    },
                    {
                        "internalType": "uint256",
                        "name": "amount",
                        "type": "uint256"
                    }
                ],
                "internalType": "struct ETypes.AssetItem[]",
                "name": "_collateralERC20",
                "type": "tuple[]"
            }
        ],
        "name": "addCollateralBatch",
        "outputs": [

        ],
        "stateMutability": "payable",
        "type": "function"
    },
    {
        "inputs": [
            {
                "internalType": "uint256",
                "name": "_tariffIndex",
                "type": "uint256"
            },
            {
                "internalType": "address",
                "name": "_paymentToken",
                "type": "address"
            },
            {
                "internalType": "uint256",
                "name": "_paymentAmount",
                "type": "uint256"
            },
            {
                "internalType": "uint16",
                "name": "_agentFeePercent",
                "type": "uint16"
            }
        ],
        "name": "addPayOption",
        "outputs": [
            {
                "internalType": "uint256",
                "name": "index",
                "type": "uint256"
            }
        ],
        "stateMutability": "nonpayable",
        "type": "function"
    },
    {
        "inputs": [
            {
                "internalType": "address",
                "name": "_agent",
                "type": "address"
            },
            {
                "internalType": "uint256[]",
                "name": "_serviceTariffIndexes",
                "type": "uint256[]"
            }
        ],
        "name": "authAgent",
        "outputs": [
            {
                "internalType": "uint256[]",
                "name": "actualTariffs",
                "type": "uint256[]"
            }
        ],
        "stateMutability": "nonpayable",
        "type": "function"
    },
    {
        "inputs": [
            {
                "internalType": "address",
                "name": "_user",
                "type": "address"
            }
        ],
        "name": "checUser",
        "outputs": [
            {
                "internalType": "bool",
                "name": "ok",
                "type": "bool"
            },
            {
                "internalType": "bool",
                "name": "needFix",
                "type": "bool"
            }
        ],
        "stateMutability": "view",
        "type": "function"
    },
    {
        "inputs": [
            {
                "internalType": "uint256",
                "name": "_tariffIndex",
                "type": "uint256"
            },
            {
                "internalType": "uint256",
                "name": "_payWithIndex",
                "type": "uint256"
            },
            {
                "internalType": "address",
                "name": "_paymentToken",
                "type": "address"
            },
            {
                "internalType": "uint256",
                "name": "_paymentAmount",
                "type": "uint256"
            },
            {
                "internalType": "uint16",
                "name": "_agentFeePercent",
                "type": "uint16"
            }
        ],
        "name": "editPayOption",
        "outputs": [

        ],
        "stateMutability": "nonpayable",
        "type": "function"
    },
    {
        "inputs": [
            {
                "internalType": "uint256",
                "name": "_tariffIndex",
                "type": "uint256"
            },
            {
                "internalType": "uint256",
                "name": "_timelockPeriod",
                "type": "uint256"
            },
            {
                "internalType": "uint256",
                "name": "_ticketValidPeriod",
                "type": "uint256"
            },
            {
                "internalType": "uint256",
                "name": "_counter",
                "type": "uint256"
            },
            {
                "internalType": "bool",
                "name": "_isAvailable",
                "type": "bool"
            },
            {
                "internalType": "address",
                "name": "_beneficiary",
                "type": "address"
            }
        ],
        "name": "editTariff",
        "outputs": [

        ],
        "stateMutability": "nonpayable",
        "type": "function"
    },
    {
        "inputs": [
            {
                "components": [
                    {
                        "components": [
                            {
                                "internalType": "uint256",
                                "name": "timelockPeriod",
                                "type": "uint256"
                            },
                            {
                                "internalType": "uint256",
                                "name": "ticketValidPeriod",
                                "type": "uint256"
                            },
                            {
                                "internalType": "uint256",
                                "name": "counter",
                                "type": "uint256"
                            },
                            {
                                "internalType": "bool",
                                "name": "isAvailable",
                                "type": "bool"
                            },
                            {
                                "internalType": "address",
                                "name": "beneficiary",
                                "type": "address"
                            }
                        ],
                        "internalType": "struct SubscriptionType",
                        "name": "subscription",
                        "type": "tuple"
                    },
                    {
                        "components": [
                            {
                                "internalType": "address",
                                "name": "paymentToken",
                                "type": "address"
                            },
                            {
                                "internalType": "uint256",
                                "name": "paymentAmount",
                                "type": "uint256"
                            },
                            {
                                "internalType": "uint16",
                                "name": "agentFeePercent",
                                "type": "uint16"
                            }
                        ],
                        "internalType": "struct PayOption[]",
                        "name": "payWith",
                        "type": "tuple[]"
                    }
                ],
                "internalType": "struct Tariff",
                "name": "_newTariff",
                "type": "tuple"
            }
        ],
        "name": "newTariff",
        "outputs": [
            {
                "internalType": "uint256",
                "name": "tariffIndex",
                "type": "uint256"
            }
        ],
        "stateMutability": "nonpayable",
        "type": "function"
    },
    {
        "inputs": [

        ],
        "name": "owner",
        "outputs": [
            {
                "internalType": "address",
                "name": "",
                "type": "address"
            }
        ],
        "stateMutability": "view",
        "type": "function"
    },
    {
        "inputs": [

        ],
        "name": "renounceOwnership",
        "outputs": [

        ],
        "stateMutability": "nonpayable",
        "type": "function"
    },
    {
        "inputs": [

        ],
        "name": "serviceProvider",
        "outputs": [
            {
                "internalType": "address",
                "name": "",
                "type": "address"
            }
        ],
        "stateMutability": "view",
        "type": "function"
    },
    {
        "inputs": [
            {
                "internalType": "address",
                "name": "_wrapper",
                "type": "address"
            }
        ],
        "name": "setTrustedWrapper",
        "outputs": [

        ],
        "stateMutability": "nonpayable",
        "type": "function"
    },
    {
        "inputs": [

        ],
        "name": "subscriptionRegistry",
        "outputs": [
            {
                "internalType": "contract ISubscriptionRegistry",
                "name": "",
                "type": "address"
            }
        ],
        "stateMutability": "view",
        "type": "function"
    },
    {
        "inputs": [
            {
                "internalType": "address",
                "name": "newOwner",
                "type": "address"
            }
        ],
        "name": "transferOwnership",
        "outputs": [

        ],
        "stateMutability": "nonpayable",
        "type": "function"
    },
    {
        "inputs": [

        ],
        "name": "trustedWrapper",
        "outputs": [
            {
                "internalType": "contract ITrustedWrapper",
                "name": "",
                "type": "address"
            }
        ],
        "stateMutability": "view",
        "type": "function"
    },
    {
        "inputs": [
            {
                "components": [
                    {
                        "components": [
                            {
                                "components": [
                                    {
                                        "internalType": "enum ETypes.AssetType",
                                        "name": "assetType",
                                        "type": "uint8"
                                    },
                                    {
                                        "internalType": "address",
                                        "name": "contractAddress",
                                        "type": "address"
                                    }
                                ],
                                "internalType": "struct ETypes.Asset",
                                "name": "asset",
                                "type": "tuple"
                            },
                            {
                                "internalType": "uint256",
                                "name": "tokenId",
                                "type": "uint256"
                            },
                            {
                                "internalType": "uint256",
                                "name": "amount",
                                "type": "uint256"
                            }
                        ],
                        "internalType": "struct ETypes.AssetItem",
                        "name": "inAsset",
                        "type": "tuple"
                    },
                    {
                        "internalType": "address",
                        "name": "unWrapDestination",
                        "type": "address"
                    },
                    {
                        "components": [
                            {
                                "internalType": "bytes1",
                                "name": "feeType",
                                "type": "bytes1"
                            },
                            {
                                "internalType": "uint256",
                                "name": "param",
                                "type": "uint256"
                            },
                            {
                                "internalType": "address",
                                "name": "token",
                                "type": "address"
                            }
                        ],
                        "internalType": "struct ETypes.Fee[]",
                        "name": "fees",
                        "type": "tuple[]"
                    },
                    {
                        "components": [
                            {
                                "internalType": "bytes1",
                                "name": "lockType",
                                "type": "bytes1"
                            },
                            {
                                "internalType": "uint256",
                                "name": "param",
                                "type": "uint256"
                            }
                        ],
                        "internalType": "struct ETypes.Lock[]",
                        "name": "locks",
                        "type": "tuple[]"
                    },
                    {
                        "components": [
                            {
                                "internalType": "address",
                                "name": "beneficiary",
                                "type": "address"
                            },
                            {
                                "internalType": "uint16",
                                "name": "percent",
                                "type": "uint16"
                            }
                        ],
                        "internalType": "struct ETypes.Royalty[]",
                        "name": "royalties",
                        "type": "tuple[]"
                    },
                    {
                        "internalType": "enum ETypes.AssetType",
                        "name": "outType",
                        "type": "uint8"
                    },
                    {
                        "internalType": "uint256",
                        "name": "outBalance",
                        "type": "uint256"
                    },
                    {
                        "internalType": "bytes2",
                        "name": "rules",
                        "type": "bytes2"
                    }
                ],
                "internalType": "struct ETypes.INData[]",
                "name": "_inDataS",
                "type": "tuple[]"
            },
            {
                "components": [
                    {
                        "components": [
                            {
                                "internalType": "enum ETypes.AssetType",
                                "name": "assetType",
                                "type": "uint8"
                            },
                            {
                                "internalType": "address",
                                "name": "contractAddress",
                                "type": "address"
                            }
                        ],
                        "internalType": "struct ETypes.Asset",
                        "name": "asset",
                        "type": "tuple"
                    },
                    {
                        "internalType": "uint256",
                        "name": "tokenId",
                        "type": "uint256"
                    },
                    {
                        "internalType": "uint256",
                        "name": "amount",
                        "type": "uint256"
                    }
                ],
                "internalType": "struct ETypes.AssetItem[]",
                "name": "_collateralERC20",
                "type": "tuple[]"
            },
            {
                "internalType": "address[]",
                "name": "_receivers",
                "type": "address[]"
            }
        ],
        "name": "wrapBatch",
        "outputs": [

        ],
        "stateMutability": "payable",
        "type": "function"
    }
]