[
  {
    "inputs": [
      {
        "internalType": "address",
        "name": "_subscrRegistry",
        "type": "address"
      }
    ],
    "stateMutability": "nonpayable",
    "type": "constructor"
  },
  {
    "anonymous": false,
    "inputs": [
      {
        "indexed": true,
        "internalType": "address",
        "name": "previousOwner",
        "type": "address"
      },
      {
        "indexed": true,
        "internalType": "address",
        "name": "newOwner",
        "type": "address"
      }
    ],
    "name": "OwnershipTransferred",
    "type": "event"
  },
  {
    "inputs": [
      {
        "internalType": "uint256",
        "name": "_tariffIndex",
        "type": "uint256"
      },
      {
        "internalType": "address",
        "name": "_paymentToken",
        "type": "address"
      },
      {
        "internalType": "uint256",
        "name": "_paymentAmount",
        "type": "uint256"
      },
      {
        "internalType": "uint16",
        "name": "_agentFeePercent",
        "type": "uint16"
      }
    ],
    "name": "addPayOption",
    "outputs": [
      {
        "internalType": "uint256",
        "name": "index",
        "type": "uint256"
      }
    ],
    "stateMutability": "nonpayable",
    "type": "function"
  },
  {
    "inputs": [
      {
        "internalType": "address",
        "name": "_agent",
        "type": "address"
      },
      {
        "internalType": "uint256[]",
        "name": "_serviceTariffIndexes",
        "type": "uint256[]"
      }
    ],
    "name": "authorizeAgentForService",
    "outputs": [
      {
        "internalType": "uint256[]",
        "name": "actualTariffs",
        "type": "uint256[]"
      }
    ],
    "stateMutability": "nonpayable",
    "type": "function"
  },
  {
    "inputs": [
      {
        "internalType": "uint256",
        "name": "_tariffIndex",
        "type": "uint256"
      },
      {
        "internalType": "uint256",
        "name": "_payWithIndex",
        "type": "uint256"
      },
      {
        "internalType": "address",
        "name": "_paymentToken",
        "type": "address"
      },
      {
        "internalType": "uint256",
        "name": "_paymentAmount",
        "type": "uint256"
      },
      {
        "internalType": "uint16",
        "name": "_agentFeePercent",
        "type": "uint16"
      }
    ],
    "name": "editPayOption",
    "outputs": [],
    "stateMutability": "nonpayable",
    "type": "function"
  },
  {
    "inputs": [
      {
        "internalType": "uint256",
        "name": "_tariffIndex",
        "type": "uint256"
      },
      {
        "internalType": "uint256",
        "name": "_timelockPeriod",
        "type": "uint256"
      },
      {
        "internalType": "uint256",
        "name": "_ticketValidPeriod",
        "type": "uint256"
      },
      {
        "internalType": "uint256",
        "name": "_counter",
        "type": "uint256"
      },
      {
        "internalType": "bool",
        "name": "_isAvailable",
        "type": "bool"
      },
      {
        "internalType": "address",
        "name": "_beneficiary",
        "type": "address"
      }
    ],
    "name": "editServiceTariff",
    "outputs": [],
    "stateMutability": "nonpayable",
    "type": "function"
  },
  {
    "inputs": [
      {
        "components": [
          {
            "components": [
              {
                "internalType": "uint256",
                "name": "timelockPeriod",
                "type": "uint256"
              },
              {
                "internalType": "uint256",
                "name": "ticketValidPeriod",
                "type": "uint256"
              },
              {
                "internalType": "uint256",
                "name": "counter",
                "type": "uint256"
              },
              {
                "internalType": "bool",
                "name": "isAvailable",
                "type": "bool"
              },
              {
                "internalType": "address",
                "name": "beneficiary",
                "type": "address"
              }
            ],
            "internalType": "struct SubscriptionType",
            "name": "subscription",
            "type": "tuple"
          },
          {
            "components": [
              {
                "internalType": "address",
                "name": "paymentToken",
                "type": "address"
              },
              {
                "internalType": "uint256",
                "name": "paymentAmount",
                "type": "uint256"
              },
              {
                "internalType": "uint16",
                "name": "agentFeePercent",
                "type": "uint16"
              }
            ],
            "internalType": "struct PayOption[]",
            "name": "payWith",
            "type": "tuple[]"
          }
        ],
        "internalType": "struct Tariff",
        "name": "_newTariff",
        "type": "tuple"
      }
    ],
    "name": "newTariff",
    "outputs": [
      {
        "internalType": "uint256",
        "name": "tariffIndex",
        "type": "uint256"
      }
    ],
    "stateMutability": "nonpayable",
    "type": "function"
  },
  {
    "inputs": [],
    "name": "owner",
    "outputs": [
      {
        "internalType": "address",
        "name": "",
        "type": "address"
      }
    ],
    "stateMutability": "view",
    "type": "function"
  },
  {
    "inputs": [
      {
        "components": [
          {
            "components": [
              {
                "internalType": "uint256",
                "name": "timelockPeriod",
                "type": "uint256"
              },
              {
                "internalType": "uint256",
                "name": "ticketValidPeriod",
                "type": "uint256"
              },
              {
                "internalType": "uint256",
                "name": "counter",
                "type": "uint256"
              },
              {
                "internalType": "bool",
                "name": "isAvailable",
                "type": "bool"
              },
              {
                "internalType": "address",
                "name": "beneficiary",
                "type": "address"
              }
            ],
            "internalType": "struct SubscriptionType",
            "name": "subscription",
            "type": "tuple"
          },
          {
            "components": [
              {
                "internalType": "address",
                "name": "paymentToken",
                "type": "address"
              },
              {
                "internalType": "uint256",
                "name": "paymentAmount",
                "type": "uint256"
              },
              {
                "internalType": "uint16",
                "name": "agentFeePercent",
                "type": "uint16"
              }
            ],
            "internalType": "struct PayOption[]",
            "name": "payWith",
            "type": "tuple[]"
          }
        ],
        "internalType": "struct Tariff",
        "name": "_newTariff",
        "type": "tuple"
      }
    ],
    "name": "registerServiceTariff",
    "outputs": [
      {
        "internalType": "uint256",
        "name": "",
        "type": "uint256"
      }
    ],
    "stateMutability": "nonpayable",
    "type": "function"
  },
  {
    "inputs": [],
    "name": "renounceOwnership",
    "outputs": [],
    "stateMutability": "nonpayable",
    "type": "function"
  },
  {
    "inputs": [],
    "name": "serviceProvider",
    "outputs": [
      {
        "internalType": "address",
        "name": "",
        "type": "address"
      }
    ],
    "stateMutability": "view",
    "type": "function"
  },
  {
    "inputs": [
      {
        "internalType": "address",
        "name": "_subscrRegistry",
        "type": "address"
      }
    ],
    "name": "setSubscriptionRegestry",
    "outputs": [],
    "stateMutability": "nonpayable",
    "type": "function"
  },
  {
    "inputs": [],
    "name": "subscriptionRegistry",
    "outputs": [
      {
        "internalType": "contract ISubscriptionRegistry",
        "name": "",
        "type": "address"
      }
    ],
    "stateMutability": "view",
    "type": "function"
  },
  {
    "inputs": [
      {
        "internalType": "address",
        "name": "newOwner",
        "type": "address"
      }
    ],
    "name": "transferOwnership",
    "outputs": [],
    "stateMutability": "nonpayable",
    "type": "function"
  }
]