[
    {
        "inputs": [
            {
                "internalType": "address",
                "name": "_kiosk",
                "type": "address"
            }
        ],
        "stateMutability": "nonpayable",
        "type": "constructor"
    },
    {
        "anonymous": false,
        "inputs": [
            {
                "indexed": true,
                "internalType": "bytes32",
                "name": "display",
                "type": "bytes32"
            },
            {
                "indexed": true,
                "internalType": "address",
                "name": "erc20Collateral",
                "type": "address"
            }
        ],
        "name": "CollateralPriceChanged",
        "type": "event"
    },
    {
        "anonymous": false,
        "inputs": [
            {
                "indexed": true,
                "internalType": "bytes32",
                "name": "display",
                "type": "bytes32"
            },
            {
                "indexed": true,
                "internalType": "address",
                "name": "payWithContract",
                "type": "address"
            },
            {
                "indexed": true,
                "internalType": "uint256",
                "name": "priceAmount",
                "type": "uint256"
            }
        ],
        "name": "DefaultPriceChanged",
        "type": "event"
    },
    {
        "anonymous": false,
        "inputs": [
            {
                "indexed": true,
                "internalType": "bytes32",
                "name": "display",
                "type": "bytes32"
            },
            {
                "indexed": true,
                "internalType": "uint8",
                "name": "DiscountType",
                "type": "uint8"
            },
            {
                "indexed": false,
                "internalType": "bytes32",
                "name": "DiscountParam",
                "type": "bytes32"
            },
            {
                "indexed": false,
                "internalType": "uint16",
                "name": "DiscountPercent",
                "type": "uint16"
            }
        ],
        "name": "DiscountChanged",
        "type": "event"
    },
    {
        "inputs": [
            {
                "internalType": "bytes32",
                "name": "",
                "type": "bytes32"
            },
            {
                "internalType": "uint256",
                "name": "",
                "type": "uint256"
            }
        ],
        "name": "defaultNFTPriceForDisplay",
        "outputs": [
            {
                "internalType": "address",
                "name": "payWith",
                "type": "address"
            },
            {
                "internalType": "uint256",
                "name": "amount",
                "type": "uint256"
            }
        ],
        "stateMutability": "view",
        "type": "function"
    },
    {
        "inputs": [
            {
                "internalType": "bytes32",
                "name": "_displayNameHash",
                "type": "bytes32"
            },
            {
                "internalType": "address",
                "name": "_erc20",
                "type": "address"
            },
            {
                "internalType": "uint256",
                "name": "_priceIndex",
                "type": "uint256"
            }
        ],
        "name": "deleteCollateralPriceRecordForDisplayByIndex",
        "outputs": [

        ],
        "stateMutability": "nonpayable",
        "type": "function"
    },
    {
        "inputs": [
            {
                "internalType": "bytes32",
                "name": "_displayNameHash",
                "type": "bytes32"
            },
            {
                "internalType": "uint256",
                "name": "_priceIndex",
                "type": "uint256"
            }
        ],
        "name": "deleteDefaultNFTPriceRecordForDisplayByIndex",
        "outputs": [

        ],
        "stateMutability": "nonpayable",
        "type": "function"
    },
    {
        "inputs": [
            {
                "internalType": "bytes32",
                "name": "_displayNameHash",
                "type": "bytes32"
            },
            {
                "internalType": "address",
                "name": "_erc20",
                "type": "address"
            },
            {
                "internalType": "uint256",
                "name": "_priceIndex",
                "type": "uint256"
            },
            {
                "components": [
                    {
                        "internalType": "address",
                        "name": "payWith",
                        "type": "address"
                    },
                    {
                        "internalType": "uint256",
                        "name": "amount",
                        "type": "uint256"
                    },
                    {
                        "internalType": "uint256",
                        "name": "denominator",
                        "type": "uint256"
                    }
                ],
                "internalType": "struct KTypes.DenominatedPrice",
                "name": "_price",
                "type": "tuple"
            }
        ],
        "name": "editCollateralPriceRecordForDisplay",
        "outputs": [

        ],
        "stateMutability": "nonpayable",
        "type": "function"
    },
    {
        "inputs": [
            {
                "internalType": "bytes32",
                "name": "_displayNameHash",
                "type": "bytes32"
            },
            {
                "internalType": "uint256",
                "name": "_priceIndex",
                "type": "uint256"
            },
            {
                "components": [
                    {
                        "internalType": "address",
                        "name": "payWith",
                        "type": "address"
                    },
                    {
                        "internalType": "uint256",
                        "name": "amount",
                        "type": "uint256"
                    }
                ],
                "internalType": "struct KTypes.Price",
                "name": "_price",
                "type": "tuple"
            }
        ],
        "name": "editDefaultNFTPriceRecordForDisplay",
        "outputs": [

        ],
        "stateMutability": "nonpayable",
        "type": "function"
    },
    {
        "inputs": [
            {
                "internalType": "bytes32",
                "name": "_displayNameHash",
                "type": "bytes32"
            },
            {
                "internalType": "uint256",
                "name": "_discountIndex",
                "type": "uint256"
            },
            {
                "components": [
                    {
                        "internalType": "uint256",
                        "name": "untilDate",
                        "type": "uint256"
                    },
                    {
                        "components": [
                            {
                                "internalType": "enum KTypes.DiscountType",
                                "name": "dsctType",
                                "type": "uint8"
                            },
                            {
                                "internalType": "uint16",
                                "name": "dsctPercent",
                                "type": "uint16"
                            }
                        ],
                        "internalType": "struct KTypes.Discount",
                        "name": "discount",
                        "type": "tuple"
                    }
                ],
                "internalType": "struct DefaultPriceModel.DiscountUntil",
                "name": "_discount",
                "type": "tuple"
            }
        ],
        "name": "editTimeDiscountsForDisplay",
        "outputs": [

        ],
        "stateMutability": "nonpayable",
        "type": "function"
    },
    {
        "inputs": [
            {
                "internalType": "bytes32",
                "name": "",
                "type": "bytes32"
            },
            {
                "internalType": "address",
                "name": "",
                "type": "address"
            },
            {
                "internalType": "uint256",
                "name": "",
                "type": "uint256"
            }
        ],
        "name": "erc20CollateralPricesForDisplays",
        "outputs": [
            {
                "internalType": "address",
                "name": "payWith",
                "type": "address"
            },
            {
                "internalType": "uint256",
                "name": "amount",
                "type": "uint256"
            },
            {
                "internalType": "uint256",
                "name": "denominator",
                "type": "uint256"
            }
        ],
        "stateMutability": "view",
        "type": "function"
    },
    {
        "inputs": [
            {
                "components": [
                    {
                        "components": [
                            {
                                "internalType": "enum ETypes.AssetType",
                                "name": "assetType",
                                "type": "uint8"
                            },
                            {
                                "internalType": "address",
                                "name": "contractAddress",
                                "type": "address"
                            }
                        ],
                        "internalType": "struct ETypes.Asset",
                        "name": "asset",
                        "type": "tuple"
                    },
                    {
                        "internalType": "uint256",
                        "name": "tokenId",
                        "type": "uint256"
                    },
                    {
                        "internalType": "uint256",
                        "name": "amount",
                        "type": "uint256"
                    }
                ],
                "internalType": "struct ETypes.AssetItem[]",
                "name": "_assetItemArray",
                "type": "tuple[]"
            },
            {
                "internalType": "address",
                "name": "_buyer",
                "type": "address"
            },
            {
                "internalType": "address",
                "name": "_referrer",
                "type": "address"
            },
            {
                "internalType": "bytes32",
                "name": "_promoHash",
                "type": "bytes32"
            }
        ],
        "name": "getBatchDiscounts",
        "outputs": [
            {
                "components": [
                    {
                        "internalType": "enum KTypes.DiscountType",
                        "name": "dsctType",
                        "type": "uint8"
                    },
                    {
                        "internalType": "uint16",
                        "name": "dsctPercent",
                        "type": "uint16"
                    }
                ],
                "internalType": "struct KTypes.Discount[]",
                "name": "",
                "type": "tuple[]"
            }
        ],
        "stateMutability": "view",
        "type": "function"
    },
    {
        "inputs": [
            {
                "components": [
                    {
                        "components": [
                            {
                                "internalType": "enum ETypes.AssetType",
                                "name": "assetType",
                                "type": "uint8"
                            },
                            {
                                "internalType": "address",
                                "name": "contractAddress",
                                "type": "address"
                            }
                        ],
                        "internalType": "struct ETypes.Asset",
                        "name": "asset",
                        "type": "tuple"
                    },
                    {
                        "internalType": "uint256",
                        "name": "tokenId",
                        "type": "uint256"
                    },
                    {
                        "internalType": "uint256",
                        "name": "amount",
                        "type": "uint256"
                    }
                ],
                "internalType": "struct ETypes.AssetItem[]",
                "name": "_assetItemArray",
                "type": "tuple[]"
            }
        ],
        "name": "getBatchPrices",
        "outputs": [
            {
                "components": [
                    {
                        "internalType": "address",
                        "name": "payWith",
                        "type": "address"
                    },
                    {
                        "internalType": "uint256",
                        "name": "amount",
                        "type": "uint256"
                    }
                ],
                "internalType": "struct KTypes.Price[]",
                "name": "",
                "type": "tuple[]"
            }
        ],
        "stateMutability": "view",
        "type": "function"
    },
    {
        "inputs": [
            {
                "internalType": "bytes32",
                "name": "_displayNameHash",
                "type": "bytes32"
            },
            {
                "internalType": "address",
                "name": "_erc20",
                "type": "address"
            }
        ],
        "name": "getCollateralUnitPrice",
        "outputs": [
            {
                "components": [
                    {
                        "internalType": "address",
                        "name": "payWith",
                        "type": "address"
                    },
                    {
                        "internalType": "uint256",
                        "name": "amount",
                        "type": "uint256"
                    },
                    {
                        "internalType": "uint256",
                        "name": "denominator",
                        "type": "uint256"
                    }
                ],
                "internalType": "struct KTypes.DenominatedPrice[]",
                "name": "",
                "type": "tuple[]"
            }
        ],
        "stateMutability": "view",
        "type": "function"
    },
    {
        "inputs": [
            {
                "components": [
                    {
                        "components": [
                            {
                                "internalType": "enum ETypes.AssetType",
                                "name": "assetType",
                                "type": "uint8"
                            },
                            {
                                "internalType": "address",
                                "name": "contractAddress",
                                "type": "address"
                            }
                        ],
                        "internalType": "struct ETypes.Asset",
                        "name": "asset",
                        "type": "tuple"
                    },
                    {
                        "internalType": "uint256",
                        "name": "tokenId",
                        "type": "uint256"
                    },
                    {
                        "internalType": "uint256",
                        "name": "amount",
                        "type": "uint256"
                    }
                ],
                "internalType": "struct ETypes.AssetItem",
                "name": "_assetItem",
                "type": "tuple"
            }
        ],
        "name": "getDefaultDisplayPrices",
        "outputs": [
            {
                "components": [
                    {
                        "internalType": "address",
                        "name": "payWith",
                        "type": "address"
                    },
                    {
                        "internalType": "uint256",
                        "name": "amount",
                        "type": "uint256"
                    }
                ],
                "internalType": "struct KTypes.Price[]",
                "name": "_prices",
                "type": "tuple[]"
            }
        ],
        "stateMutability": "view",
        "type": "function"
    },
    {
        "inputs": [
            {
                "internalType": "bytes32",
                "name": "_displayNameHash",
                "type": "bytes32"
            }
        ],
        "name": "getDefaultDisplayPricesForDisplay",
        "outputs": [
            {
                "components": [
                    {
                        "internalType": "address",
                        "name": "payWith",
                        "type": "address"
                    },
                    {
                        "internalType": "uint256",
                        "name": "amount",
                        "type": "uint256"
                    }
                ],
                "internalType": "struct KTypes.Price[]",
                "name": "_prices",
                "type": "tuple[]"
            }
        ],
        "stateMutability": "view",
        "type": "function"
    },
    {
        "inputs": [
            {
                "internalType": "bytes32",
                "name": "_displayNameHash",
                "type": "bytes32"
            }
        ],
        "name": "getDisplayTimeDiscounts",
        "outputs": [
            {
                "components": [
                    {
                        "internalType": "uint256",
                        "name": "untilDate",
                        "type": "uint256"
                    },
                    {
                        "components": [
                            {
                                "internalType": "enum KTypes.DiscountType",
                                "name": "dsctType",
                                "type": "uint8"
                            },
                            {
                                "internalType": "uint16",
                                "name": "dsctPercent",
                                "type": "uint16"
                            }
                        ],
                        "internalType": "struct KTypes.Discount",
                        "name": "discount",
                        "type": "tuple"
                    }
                ],
                "internalType": "struct DefaultPriceModel.DiscountUntil[]",
                "name": "",
                "type": "tuple[]"
            }
        ],
        "stateMutability": "view",
        "type": "function"
    },
    {
        "inputs": [
            {
                "components": [
                    {
                        "components": [
                            {
                                "internalType": "enum ETypes.AssetType",
                                "name": "assetType",
                                "type": "uint8"
                            },
                            {
                                "internalType": "address",
                                "name": "contractAddress",
                                "type": "address"
                            }
                        ],
                        "internalType": "struct ETypes.Asset",
                        "name": "asset",
                        "type": "tuple"
                    },
                    {
                        "internalType": "uint256",
                        "name": "tokenId",
                        "type": "uint256"
                    },
                    {
                        "internalType": "uint256",
                        "name": "amount",
                        "type": "uint256"
                    }
                ],
                "internalType": "struct ETypes.AssetItem",
                "name": "_assetItem",
                "type": "tuple"
            },
            {
                "internalType": "address",
                "name": "_buyer",
                "type": "address"
            },
            {
                "internalType": "address",
                "name": "_referrer",
                "type": "address"
            },
            {
                "internalType": "bytes32",
                "name": "_promoHash",
                "type": "bytes32"
            }
        ],
        "name": "getItemDiscounts",
        "outputs": [
            {
                "components": [
                    {
                        "internalType": "enum KTypes.DiscountType",
                        "name": "dsctType",
                        "type": "uint8"
                    },
                    {
                        "internalType": "uint16",
                        "name": "dsctPercent",
                        "type": "uint16"
                    }
                ],
                "internalType": "struct KTypes.Discount[]",
                "name": "",
                "type": "tuple[]"
            }
        ],
        "stateMutability": "view",
        "type": "function"
    },
    {
        "inputs": [
            {
                "components": [
                    {
                        "components": [
                            {
                                "internalType": "enum ETypes.AssetType",
                                "name": "assetType",
                                "type": "uint8"
                            },
                            {
                                "internalType": "address",
                                "name": "contractAddress",
                                "type": "address"
                            }
                        ],
                        "internalType": "struct ETypes.Asset",
                        "name": "asset",
                        "type": "tuple"
                    },
                    {
                        "internalType": "uint256",
                        "name": "tokenId",
                        "type": "uint256"
                    },
                    {
                        "internalType": "uint256",
                        "name": "amount",
                        "type": "uint256"
                    }
                ],
                "internalType": "struct ETypes.AssetItem",
                "name": "_assetItem",
                "type": "tuple"
            }
        ],
        "name": "getItemPrices",
        "outputs": [
            {
                "components": [
                    {
                        "internalType": "address",
                        "name": "payWith",
                        "type": "address"
                    },
                    {
                        "internalType": "uint256",
                        "name": "amount",
                        "type": "uint256"
                    }
                ],
                "internalType": "struct KTypes.Price[]",
                "name": "",
                "type": "tuple[]"
            }
        ],
        "stateMutability": "view",
        "type": "function"
    },
    {
        "inputs": [

        ],
        "name": "kiosk",
        "outputs": [
            {
                "internalType": "contract IEnvelopNFTKiosk",
                "name": "",
                "type": "address"
            }
        ],
        "stateMutability": "view",
        "type": "function"
    },
    {
        "inputs": [
            {
                "components": [
                    {
                        "components": [
                            {
                                "internalType": "enum ETypes.AssetType",
                                "name": "assetType",
                                "type": "uint8"
                            },
                            {
                                "internalType": "address",
                                "name": "contractAddress",
                                "type": "address"
                            }
                        ],
                        "internalType": "struct ETypes.Asset",
                        "name": "asset",
                        "type": "tuple"
                    },
                    {
                        "internalType": "uint256",
                        "name": "tokenId",
                        "type": "uint256"
                    },
                    {
                        "internalType": "uint256",
                        "name": "amount",
                        "type": "uint256"
                    }
                ],
                "internalType": "struct ETypes.AssetItem",
                "name": "_assetItem",
                "type": "tuple"
            },
            {
                "internalType": "address",
                "name": "_buyer",
                "type": "address"
            }
        ],
        "name": "makeActionInModel",
        "outputs": [

        ],
        "stateMutability": "nonpayable",
        "type": "function"
    },
    {
        "inputs": [
            {
                "internalType": "bytes32",
                "name": "",
                "type": "bytes32"
            },
            {
                "internalType": "bytes32",
                "name": "",
                "type": "bytes32"
            }
        ],
        "name": "promoDiscounts",
        "outputs": [
            {
                "internalType": "uint256",
                "name": "untilDate",
                "type": "uint256"
            },
            {
                "components": [
                    {
                        "internalType": "enum KTypes.DiscountType",
                        "name": "dsctType",
                        "type": "uint8"
                    },
                    {
                        "internalType": "uint16",
                        "name": "dsctPercent",
                        "type": "uint16"
                    }
                ],
                "internalType": "struct KTypes.Discount",
                "name": "discount",
                "type": "tuple"
            }
        ],
        "stateMutability": "view",
        "type": "function"
    },
    {
        "inputs": [
            {
                "internalType": "bytes32",
                "name": "",
                "type": "bytes32"
            },
            {
                "internalType": "bytes32",
                "name": "",
                "type": "bytes32"
            }
        ],
        "name": "referrerDiscounts",
        "outputs": [
            {
                "internalType": "uint256",
                "name": "untilDate",
                "type": "uint256"
            },
            {
                "components": [
                    {
                        "internalType": "enum KTypes.DiscountType",
                        "name": "dsctType",
                        "type": "uint8"
                    },
                    {
                        "internalType": "uint16",
                        "name": "dsctPercent",
                        "type": "uint16"
                    }
                ],
                "internalType": "struct KTypes.Discount",
                "name": "discount",
                "type": "tuple"
            }
        ],
        "stateMutability": "view",
        "type": "function"
    },
    {
        "inputs": [
            {
                "internalType": "bytes32",
                "name": "_displayNameHash",
                "type": "bytes32"
            },
            {
                "internalType": "address",
                "name": "_erc20",
                "type": "address"
            },
            {
                "components": [
                    {
                        "internalType": "address",
                        "name": "payWith",
                        "type": "address"
                    },
                    {
                        "internalType": "uint256",
                        "name": "amount",
                        "type": "uint256"
                    },
                    {
                        "internalType": "uint256",
                        "name": "denominator",
                        "type": "uint256"
                    }
                ],
                "internalType": "struct KTypes.DenominatedPrice[]",
                "name": "_prices",
                "type": "tuple[]"
            }
        ],
        "name": "setCollateralPriceForDisplay",
        "outputs": [

        ],
        "stateMutability": "nonpayable",
        "type": "function"
    },
    {
        "inputs": [
            {
                "internalType": "bytes32",
                "name": "_displayNameHash",
                "type": "bytes32"
            },
            {
                "components": [
                    {
                        "internalType": "address",
                        "name": "payWith",
                        "type": "address"
                    },
                    {
                        "internalType": "uint256",
                        "name": "amount",
                        "type": "uint256"
                    }
                ],
                "internalType": "struct KTypes.Price[]",
                "name": "_prices",
                "type": "tuple[]"
            }
        ],
        "name": "setDefaultNFTPriceForDisplay",
        "outputs": [

        ],
        "stateMutability": "nonpayable",
        "type": "function"
    },
    {
        "inputs": [
            {
                "internalType": "bytes32",
                "name": "_displayNameHash",
                "type": "bytes32"
            },
            {
                "internalType": "bytes32",
                "name": "_promoHash",
                "type": "bytes32"
            },
            {
                "components": [
                    {
                        "internalType": "uint256",
                        "name": "untilDate",
                        "type": "uint256"
                    },
                    {
                        "components": [
                            {
                                "internalType": "enum KTypes.DiscountType",
                                "name": "dsctType",
                                "type": "uint8"
                            },
                            {
                                "internalType": "uint16",
                                "name": "dsctPercent",
                                "type": "uint16"
                            }
                        ],
                        "internalType": "struct KTypes.Discount",
                        "name": "discount",
                        "type": "tuple"
                    }
                ],
                "internalType": "struct DefaultPriceModel.DiscountUntil",
                "name": "_discount",
                "type": "tuple"
            }
        ],
        "name": "setPromoDiscountForDisplay",
        "outputs": [

        ],
        "stateMutability": "nonpayable",
        "type": "function"
    },
    {
        "inputs": [
            {
                "internalType": "bytes32",
                "name": "_displayNameHash",
                "type": "bytes32"
            },
            {
                "internalType": "address",
                "name": "_referrer",
                "type": "address"
            },
            {
                "components": [
                    {
                        "internalType": "uint256",
                        "name": "untilDate",
                        "type": "uint256"
                    },
                    {
                        "components": [
                            {
                                "internalType": "enum KTypes.DiscountType",
                                "name": "dsctType",
                                "type": "uint8"
                            },
                            {
                                "internalType": "uint16",
                                "name": "dsctPercent",
                                "type": "uint16"
                            }
                        ],
                        "internalType": "struct KTypes.Discount",
                        "name": "discount",
                        "type": "tuple"
                    }
                ],
                "internalType": "struct DefaultPriceModel.DiscountUntil",
                "name": "_discount",
                "type": "tuple"
            }
        ],
        "name": "setRefereerDiscountForDisplay",
        "outputs": [

        ],
        "stateMutability": "nonpayable",
        "type": "function"
    },
    {
        "inputs": [
            {
                "internalType": "bytes32",
                "name": "_displayNameHash",
                "type": "bytes32"
            },
            {
                "components": [
                    {
                        "internalType": "uint256",
                        "name": "untilDate",
                        "type": "uint256"
                    },
                    {
                        "components": [
                            {
                                "internalType": "enum KTypes.DiscountType",
                                "name": "dsctType",
                                "type": "uint8"
                            },
                            {
                                "internalType": "uint16",
                                "name": "dsctPercent",
                                "type": "uint16"
                            }
                        ],
                        "internalType": "struct KTypes.Discount",
                        "name": "discount",
                        "type": "tuple"
                    }
                ],
                "internalType": "struct DefaultPriceModel.DiscountUntil[]",
                "name": "_discounts",
                "type": "tuple[]"
            }
        ],
        "name": "setTimeDiscountsForDisplay",
        "outputs": [

        ],
        "stateMutability": "nonpayable",
        "type": "function"
    },
    {
        "inputs": [
            {
                "internalType": "bytes32",
                "name": "",
                "type": "bytes32"
            },
            {
                "internalType": "uint256",
                "name": "",
                "type": "uint256"
            }
        ],
        "name": "timeDiscounts",
        "outputs": [
            {
                "internalType": "uint256",
                "name": "untilDate",
                "type": "uint256"
            },
            {
                "components": [
                    {
                        "internalType": "enum KTypes.DiscountType",
                        "name": "dsctType",
                        "type": "uint8"
                    },
                    {
                        "internalType": "uint16",
                        "name": "dsctPercent",
                        "type": "uint16"
                    }
                ],
                "internalType": "struct KTypes.Discount",
                "name": "discount",
                "type": "tuple"
            }
        ],
        "stateMutability": "view",
        "type": "function"
    }
]