<svg width="24" height="24" viewBox="0 0 24 24" fill="none" xmlns="http://www.w3.org/2000/svg">
<g clip-path="url(#clip0_8224_8124)">
<path d="M24 11.7717C17.4956 11.7717 12.2283 6.49912 12.2283 0H11.7717V11.7717H0V12.2283C6.50442 12.2283 11.7717 17.5009 11.7717 24H12.2283V12.2283H24V11.7717Z" fill="white"/>
</g>
<defs>
<clipPath id="clip0_8224_8124">
<rect width="24" height="24" fill="white"/>
</clipPath>
</defs>
</svg>
