<svg width="24" height="24" viewBox="0 0 24 24" fill="none" xmlns="http://www.w3.org/2000/svg">
<path d="M23.9177 4.85642C23.7452 4.55475 23.3613 4.45534 23.067 4.63627L7.27228 14.3573C6.8697 13.5954 6.64159 12.7248 6.64159 11.8002C6.64159 8.79833 9.04588 6.36473 12.0116 6.36473C13.2852 6.36473 14.4543 6.81465 15.3748 7.56416L12.0147 9.8987L20.7472 4.79588C20.9353 4.68615 20.9998 4.44227 20.8908 4.2524C20.7761 4.05152 20.5171 3.99201 20.3277 4.12341L18.1895 5.60903C16.6138 3.99786 14.4285 3 12.0116 3C7.20982 3 3.31706 6.93985 3.31706 11.8002C3.31706 13.3649 3.721 14.834 4.42841 16.1074L0 18.8327L4.54687 16.3134C6.06521 18.8808 8.83984 20.6 12.012 20.6C16.8138 20.6 20.7065 16.6601 20.7065 11.7998V10.749C20.7065 9.92587 21.0365 8.87263 22.2062 8.23834C22.3063 8.184 22.3426 8.05673 22.286 7.95663C22.2303 7.85929 22.1074 7.82558 22.0113 7.88199L11.643 13.9411C12.8005 13.443 13.6851 13.1403 14.8579 12.9019C17.3009 12.4052 17.363 13.584 16.4197 14.9138C15.788 15.804 14.3609 17.2339 12.0133 17.2339C10.0988 17.2339 8.41927 16.2202 7.46814 14.6944L23.6807 5.71187C23.9832 5.5447 24.0898 5.15808 23.9177 4.85607V4.85642Z" fill="white"/>
</svg>
