<svg width="24" height="24" viewBox="0 0 24 24" fill="none" xmlns="http://www.w3.org/2000/svg">
<g clip-path="url(#clip0_4390_951)">
<path d="M23.9638 23.996H20.2068L17.7668 14.9196L12.5208 23.997H8.32641L16.4347 9.94605L15.1297 5.06803L4.19638 24H0L13.8559 0H17.5295L19.1381 5.9628H22.9283L20.3405 10.4628L23.9638 23.996Z" fill="white"/>
</g>
<defs>
<clipPath id="clip0_4390_951">
<rect width="24" height="24" fill="white" transform="matrix(1 0 0 -1 0 24)"/>
</clipPath>
</defs>
</svg>
