<svg width="24" height="24" viewBox="0 0 24 24" fill="none" xmlns="http://www.w3.org/2000/svg">
<path d="M3.49381 14.5203L3.59066 16.2846C3.59699 16.4047 3.64203 16.5178 3.71803 16.6104C4.24929 17.2536 6.63111 19.4977 11.9985 19.4977C17.366 19.4977 19.719 17.2826 20.2699 16.6224C20.353 16.5228 20.4008 16.3991 20.4085 16.269L20.5046 14.5215C21.1436 14.1709 21.8032 13.7747 21.8032 13.7747C22.8404 13.2128 23.9979 14.02 24 15.2039C24.0035 17.1193 22.5069 19.0878 20.4881 20.3282C18.2118 21.7269 14.8139 22.3072 12 22.3072C9.18611 22.3072 5.78822 21.7269 3.51192 20.3282C1.49315 19.0878 -0.00351202 17.12 6.18974e-06 15.2039C0.00211713 14.02 1.15962 13.2128 2.19679 13.7747C2.19679 13.7747 2.85533 14.1699 3.49381 14.5203Z" fill="white"/>
<path d="M11.9993 2C16.3879 2 17.5778 2.10249 19.3622 2.30746H19.3615C20.1841 2.40217 20.8434 3.01426 20.7822 3.84334L20.1249 12.7974C19.9192 12.857 19.6949 12.9323 19.4433 13.0167C18.1249 13.4592 16.0581 14.1528 11.9992 14.1528C7.94041 14.1528 5.8736 13.4592 4.55514 13.0167C4.30335 12.9322 4.07882 12.8568 3.87295 12.7972L3.21566 3.84334C3.15515 3.01426 3.81236 2.38733 4.63632 2.30746C6.39895 2.13641 8.23408 2 11.9993 2ZM4.1879 17.0877L4.19022 17.1192L4.23557 17.1296C4.21934 17.1155 4.20346 17.1015 4.1879 17.0877ZM19.7668 17.1286L19.8077 17.1192L19.8098 17.0906C19.7957 17.1031 19.7814 17.1158 19.7668 17.1286Z" fill="white"/>
</svg>
