<svg width="24" height="24" viewBox="0 0 24 24" fill="none" xmlns="http://www.w3.org/2000/svg">
<path d="M2.36734 5.77783L1.78906 6.77948L21.5791 18.2048L22.1574 17.2031L2.36734 5.77783Z" fill="white"/>
<path d="M11.9649 18.2988C11.8649 18.2988 11.765 18.2729 11.6754 18.2211L1.78875 12.5033C1.60998 12.3999 1.4999 12.2091 1.5 12.0026C1.50007 11.796 1.61028 11.6052 1.78912 11.502L11.7034 5.77797C11.8824 5.6746 12.1028 5.6746 12.2817 5.77797L21.9198 11.3424C21.9249 11.3453 21.9298 11.3483 21.9347 11.3514L22.183 11.5048C22.3561 11.6118 22.4603 11.8019 22.4572 12.0054C22.4541 12.2089 22.3443 12.3958 22.1681 12.4975L12.254 18.2213C12.1645 18.273 12.0647 18.2988 11.9649 18.2988ZM3.2341 12.0031L11.9651 17.0527L20.7312 11.9916L11.9926 6.94644L3.2341 12.0031Z" fill="white"/>
<path d="M11.9649 24C11.8645 24 11.7641 23.9738 11.6742 23.9216L1.78759 18.173C1.60925 18.0693 1.49967 17.8785 1.5 17.6722C1.5003 17.4659 1.61048 17.2754 1.78912 17.1723L20.6722 6.2703L11.9521 1.24582L2.65654 6.61256V12.0027H1.5V6.27867C1.5 6.07206 1.61021 5.88113 1.78912 5.7779L11.6626 0.077461C11.8415 -0.0257761 12.0617 -0.0257761 12.2405 0.0771957L22.1183 5.76873C22.2974 5.8719 22.4077 6.06282 22.4079 6.2695C22.4079 6.47617 22.2977 6.66723 22.1187 6.77054L3.23175 17.6749L11.9659 22.7534L21.3007 17.364V11.9967H22.4573V17.6979C22.4573 17.9045 22.3471 18.0954 22.1681 18.1987L12.2541 23.9224C12.1645 23.9741 12.0647 24 11.9649 24Z" fill="white"/>
<path d="M12.5709 0.578125H11.4143V6.27856H12.5709V0.578125Z" fill="white"/>
<path d="M12.5432 17.7205H11.3867V23.4217H12.5432V17.7205Z" fill="white"/>
</svg>
