<svg width="24" height="24" viewBox="0 0 24 24" fill="none" xmlns="http://www.w3.org/2000/svg">
<g clip-path="url(#clip0_4390_962)">
<mask id="mask0_4390_962" style="mask-type:luminance" maskUnits="userSpaceOnUse" x="0" y="0" width="24" height="24">
<path d="M0 0H24V24H0V0Z" fill="white"/>
</mask>
<g mask="url(#mask0_4390_962)">
<path fill-rule="evenodd" clip-rule="evenodd" d="M12.0002 18.6C8.355 18.6 5.40024 15.6453 5.40024 12C5.40024 8.35474 8.355 5.40004 12.0002 5.40004V0C5.37263 0 0 5.37231 0 12C0 18.6273 5.37263 24 12.0002 24C18.6274 24 24 18.6273 24 12H18.5997C18.5997 15.6453 15.645 18.6 12.0002 18.6Z" fill="white"/>
</g>
<mask id="mask1_4390_962" style="mask-type:luminance" maskUnits="userSpaceOnUse" x="0" y="0" width="24" height="24">
<path d="M0 24H24V0H0V24Z" fill="white"/>
</mask>
<g mask="url(#mask1_4390_962)">
<path fill-rule="evenodd" clip-rule="evenodd" d="M12 12H18.72V5.28003H12V12Z" fill="white"/>
</g>
</g>
<defs>
<clipPath id="clip0_4390_962">
<rect width="24" height="24" fill="white" transform="matrix(1 0 0 -1 0 24)"/>
</clipPath>
</defs>
</svg>
