<svg width="24" height="24" viewBox="0 0 24 24" fill="none" xmlns="http://www.w3.org/2000/svg">
<path fill-rule="evenodd" clip-rule="evenodd" d="M19.824 6.3613H22.9068H22.9092V8.5525H19.9212C19.7556 9.3061 19.3848 10.0201 18.8028 10.6021L15.7344 13.6705C14.922 14.4829 13.8516 14.8873 12.774 14.8873C11.6664 14.8873 10.5516 14.4601 9.70077 13.6093C9.27357 13.1809 9.27357 12.4873 9.70077 12.0601C10.1292 11.6329 10.8228 11.6329 11.25 12.0601C12.0756 12.8857 13.3932 12.9133 14.1852 12.1213L17.2536 9.0529C18.0456 8.2609 18.018 6.9433 17.1924 6.1177C16.788 5.7133 16.2576 5.4865 15.6972 5.4793C15.1488 5.4733 14.6364 5.6773 14.2572 6.0565L12.798 7.5157C12.3696 7.9429 11.676 7.9429 11.2488 7.5157C10.8216 7.0873 10.8216 6.3937 11.2488 5.9665L12.708 4.5073C13.269 3.94408 13.9807 3.55488 14.7576 3.3865V0.4021H16.9476V3.4825C17.616 3.6889 18.2304 4.0585 18.7404 4.5685C19.2418 5.06927 19.6137 5.68459 19.824 6.3613ZM9.02641 17.28L10.4856 15.8208C10.5871 15.719 10.7077 15.6382 10.8405 15.5831C10.9733 15.5279 11.1156 15.4995 11.2594 15.4994C11.4031 15.4993 11.5455 15.5275 11.6784 15.5824C11.8112 15.6374 11.9319 15.718 12.0336 15.8196C12.4608 16.248 12.4608 16.9416 12.0336 17.3688L10.5744 18.828C9.99361 19.41 9.27961 19.782 8.52481 19.9464V22.9344H6.33481V19.8504C5.67961 19.6476 5.06161 19.2864 4.54201 18.7668C4.04062 18.266 3.66871 17.6507 3.45841 16.974H0.37561V14.784H3.36361C3.52921 14.0304 3.90001 13.3164 4.48201 12.7344L7.55041 9.666C9.19681 8.0196 11.9028 8.0472 13.5828 9.7272C14.01 10.1556 14.01 10.8492 13.5828 11.2764C13.1544 11.7036 12.4608 11.7036 12.0336 11.2764C11.208 10.4508 9.89041 10.4232 9.09841 11.2152L6.03001 14.2836C5.23801 15.0756 5.26561 16.3932 6.09121 17.2188C6.91801 18.0444 8.23441 18.072 9.02641 17.28Z" fill="white"/>
</svg>
