<svg width="24" height="24" viewBox="0 0 24 24" fill="none" xmlns="http://www.w3.org/2000/svg">
<g clip-path="url(#clip0_5901_1443)">
<path d="M23.9912 13.8446C23.9912 14.9971 23.9912 16.1498 23.9912 17.3024C23.8208 17.4547 23.6091 17.445 23.4032 17.4452C18.1001 17.448 12.7968 17.4491 7.49362 17.4443C6.78197 17.4437 6.65011 17.3064 6.64889 16.5742C6.64359 13.5754 6.64383 10.5767 6.64875 7.57795C6.64997 6.82898 6.78052 6.69867 7.52948 6.69783C11.5623 6.69323 15.595 6.69628 19.6279 6.69567C20.4765 6.69553 20.4772 6.69492 20.4771 5.84119C20.4769 5.27986 20.4725 4.71839 20.4779 4.15717C20.4809 3.84091 20.3511 3.69206 20.0306 3.70567C19.8686 3.71253 19.7057 3.7047 19.5432 3.7047C13.339 3.70458 7.13461 3.70494 0.930352 3.70434C0.00999802 3.70422 -0.000479647 3.70277 0.0130089 2.797C0.026377 1.8988 -0.0457626 0.999169 0.0529927 0.102303C7.91419 0.102303 15.7754 0.104591 23.6365 0.0937516C23.9401 0.0933907 24.0012 0.153125 24 0.456979C23.9859 3.73734 23.9912 7.0178 23.9912 10.2982C23.7629 10.4883 23.4872 10.4392 23.2262 10.4394C19.2554 10.4426 15.2847 10.4414 11.3139 10.4417C10.3926 10.4419 10.3921 10.4424 10.3923 11.3629C10.3925 11.9681 10.3844 12.5734 10.3956 13.1785C10.4039 13.6272 10.4615 13.6796 10.9154 13.6975C11.1956 13.7086 11.4762 13.7011 11.7567 13.7011C15.5799 13.7014 19.403 13.7002 23.2262 13.7034C23.4872 13.7035 23.7629 13.6543 23.9912 13.8446Z" fill="white"/>
<path d="M23.9999 23.9015C16.1643 23.9015 8.3288 23.8991 0.493298 23.9092C0.129911 23.9097 -0.00131802 23.8609 9.96557e-06 23.4481C0.0177567 18.083 0.0153422 12.7178 0.00351102 7.35267C0.00278667 7.00903 0.0880195 6.91439 0.43559 6.9254C1.27898 6.95203 2.1243 6.95025 2.96794 6.92681C3.35318 6.91622 3.47137 7.03303 3.47016 7.42411C3.4564 11.7045 3.46425 15.9849 3.45531 20.2653C3.45471 20.5507 3.49286 20.664 3.8263 20.6636C10.5066 20.6526 17.1868 20.6552 23.8671 20.6548C23.9114 20.6548 23.9557 20.6499 24 20.6473C23.9999 21.7319 23.9999 22.8168 23.9999 23.9015Z" fill="white"/>
</g>
<defs>
<clipPath id="clip0_5901_1443">
<rect width="24" height="24" fill="white"/>
</clipPath>
</defs>
</svg>
