<svg width="24" height="24" viewBox="0 0 24 24" fill="none" xmlns="http://www.w3.org/2000/svg">
<path d="M18.671 10.8419C19.0214 11.1704 19.0214 11.6985 18.671 12.027L13.929 16.4663C13.9102 16.488 13.89 16.509 13.8685 16.5292C13.5181 16.8577 12.9547 16.8577 12.6043 16.5292L10.076 14.1589C9.73244 13.8304 9.73244 13.2958 10.076 12.9737C10.4264 12.6517 10.9966 12.6517 11.3402 12.9737L13.2365 14.7515L17.4068 10.8419C17.7572 10.5198 18.3275 10.5198 18.671 10.8419Z" fill="white"/>
<path d="M23.7415 10.8612C23.398 10.5392 22.8277 10.5392 22.4773 10.8612L19.9558 13.2316C19.6054 13.5601 19.6054 14.0883 19.9558 14.4167C20.2994 14.7388 20.8696 14.7388 21.22 14.4167L23.7484 12.0464C24.085 11.7179 24.085 11.1833 23.7415 10.8612Z" fill="white"/>
<path d="M13.8889 10.6167C14.2324 10.9452 14.2324 11.4798 13.8889 11.8019C13.5385 12.1239 12.9751 12.1239 12.6247 11.8019L10.7283 10.024C10.7283 10.024 10.7284 10.024 10.7283 10.024L6.55789 13.9403C6.20749 14.2623 5.63722 14.2623 5.29369 13.9403C4.94329 13.6118 4.94329 13.0836 5.29369 12.7551L10.0356 8.30955C10.0545 8.28772 10.0748 8.26663 10.0964 8.24637C10.4468 7.91788 11.0101 7.91788 11.3605 8.24637L13.8889 10.6167Z" fill="white"/>
<path d="M0.257645 13.927C0.601172 14.2491 1.17142 14.2491 1.52182 13.927L4.05018 11.5567C4.40058 11.2282 4.40058 10.7 4.05018 10.3715C3.70664 10.0495 3.13639 10.0495 2.786 10.3715L0.257645 12.7419C-0.0858815 13.0704 -0.0858815 13.5986 0.257645 13.927Z" fill="white"/>
</svg>
