<svg width="24" height="24" viewBox="0 0 24 24" fill="none" xmlns="http://www.w3.org/2000/svg">
<path d="M21.564 14.7759C22.187 14.4173 22.579 13.9061 22.5842 13.1769C22.5987 11.1059 22.5939 9.03468 22.5862 6.96347C22.5842 6.40959 22.3585 5.92805 21.9106 5.61037C21.5721 5.37021 21.212 5.16056 20.8331 4.93996C20.662 4.84039 20.4872 4.7386 20.3088 4.63076V5.04949C20.3088 5.66931 20.3081 6.28913 20.3075 6.90894C20.3058 8.68337 20.304 10.4578 20.3166 12.2319C20.3199 12.6918 20.1482 12.9651 19.7567 13.1886C18.4645 13.9262 17.1763 14.6708 15.888 15.4155C14.9835 15.9383 14.0791 16.4612 13.1732 16.9815C13.003 17.0794 12.9374 17.1847 12.9408 17.3818C12.9492 17.8611 12.948 18.3406 12.9469 18.8201C12.9463 19.0342 12.9458 19.2483 12.9461 19.4623C12.9463 19.515 12.9502 19.5676 12.955 19.6312C12.9575 19.6648 12.9603 19.7013 12.9628 19.7425C13.109 19.6583 13.2522 19.5759 13.3933 19.4947C13.7092 19.3129 14.0145 19.1372 14.3195 18.961C15.0311 18.5498 15.7427 18.1383 16.4542 17.7267C18.1568 16.742 19.8594 15.7573 21.564 14.7759Z" fill="white"/>
<path d="M21.5882 19.0219C22.142 18.7029 22.5173 18.248 22.5688 17.6072C22.6005 17.2112 22.5931 16.812 22.5854 16.3979C22.582 16.2109 22.5785 16.0209 22.5785 15.8268C22.5474 15.8417 22.5209 15.854 22.4976 15.8648C22.4551 15.8846 22.4231 15.8994 22.3926 15.917C21.6964 16.3193 21.0003 16.7217 20.3041 17.124C17.9124 18.5064 15.5206 19.8888 13.127 21.2679C12.9807 21.3522 12.9408 21.4506 12.9423 21.6094C12.9473 22.0811 12.9468 22.5527 12.9464 23.0243C12.9461 23.2557 12.9459 23.4871 12.9463 23.7185C12.9464 23.7721 12.9505 23.8256 12.9552 23.8877C12.9576 23.9195 12.9602 23.9534 12.9625 23.9908C12.9991 23.9714 13.0329 23.954 13.0646 23.9376C13.127 23.9054 13.1814 23.8773 13.2345 23.8467C13.9002 23.4631 14.5656 23.0787 15.2307 22.6942C15.8571 22.3323 16.4833 21.9701 17.1096 21.608C18.6019 20.745 20.0942 19.8821 21.5882 19.0219Z" fill="white"/>
<path d="M7.5912 4.79499C7.9624 4.57782 8.2793 4.57566 8.6505 4.79427C9.75238 5.44321 10.8603 6.08185 11.9683 6.72048C12.3722 6.95333 12.7762 7.18618 13.1799 7.41953C13.5732 7.64697 13.9665 7.87422 14.3713 8.10808C14.6495 8.26879 14.933 8.43261 15.2257 8.60177C15.2257 8.40499 15.226 8.21122 15.2263 8.01978C15.2273 7.35998 15.2282 6.72791 15.2171 6.09604C15.2157 6.01366 15.1108 5.90525 15.0264 5.85607C13.0505 4.70686 11.0717 3.56303 9.09161 2.42118C8.45531 2.05414 7.80664 2.04534 7.16998 2.41095C5.74263 3.23002 4.31853 4.05475 2.89452 4.87942C2.57861 5.06237 2.26271 5.24531 1.94678 5.42819C1.58166 5.63944 1.30617 5.9381 1.15848 6.33421C0.980281 6.81242 0.99354 7.30119 1.00725 7.80656C1.01431 8.06672 1.02148 8.33127 1.00272 8.60105C1.05999 8.56977 1.10849 8.54364 1.15132 8.52056C1.22497 8.48086 1.28185 8.45021 1.33772 8.41798C1.836 8.12992 2.33443 7.84213 2.83287 7.55434C4.42075 6.63754 6.00862 5.72073 7.5912 4.79499Z" fill="white"/>
<path d="M10.4874 19.6496C10.5436 19.6815 10.6039 19.7159 10.6707 19.754C10.6707 19.5245 10.6701 19.2997 10.6694 19.0784C10.6678 18.51 10.6663 17.964 10.6757 17.4184C10.6795 17.2028 10.6205 17.0812 10.4253 16.9715C9.90741 16.6805 9.3933 16.3827 8.87917 16.0849C8.40848 15.8123 7.93777 15.5396 7.46412 15.2722C7.11944 15.0776 6.96798 14.8113 6.97659 14.4159C6.98733 13.927 6.98506 13.4379 6.98279 12.9488C6.98184 12.7444 6.98089 12.5401 6.98089 12.3357V11.0558C6.95127 11.0699 6.92588 11.0815 6.90341 11.0918C6.86129 11.1111 6.82941 11.1257 6.79914 11.1432C6.60835 11.2532 6.41789 11.3638 6.22742 11.4744C5.77817 11.7353 5.32894 11.9962 4.87554 12.2495C4.72319 12.3346 4.69863 12.4414 4.69935 12.5956C4.70401 13.7353 4.70849 14.8752 4.69612 16.015C4.69361 16.2358 4.76424 16.3514 4.95351 16.4596C6.2907 17.2246 7.62435 17.996 8.95795 18.7672C9.37296 19.0072 9.78796 19.2473 10.2031 19.4871C10.2928 19.5389 10.3828 19.5901 10.4874 19.6496Z" fill="white"/>
<path d="M10.5651 23.946C10.5979 23.9626 10.6329 23.9803 10.6709 23.9999C10.6709 23.771 10.6701 23.5462 10.6693 23.3244C10.6672 22.7591 10.6653 22.2134 10.677 21.668C10.682 21.4438 10.6024 21.3329 10.4158 21.2257C9.41076 20.6487 8.40718 20.0691 7.4036 19.4894C6.20562 18.7974 5.00763 18.1054 3.8071 17.418C3.45436 17.2161 3.29232 16.9573 3.29573 16.5474C3.3081 15.0652 3.30702 13.5829 3.29627 12.1007C3.29322 11.7027 3.45203 11.4483 3.79491 11.252C5.40217 10.3312 7.00529 9.40325 8.60844 8.47532C9.09077 8.19614 9.57311 7.91695 10.0556 7.63796C10.1272 7.59655 10.1983 7.55394 10.2798 7.5051C10.3163 7.48324 10.3548 7.46013 10.3965 7.43532C10.2047 7.32443 10.0151 7.21552 9.82746 7.1077C9.32266 6.81765 8.83149 6.53543 8.34633 6.2434C8.17301 6.13912 8.05112 6.15491 7.88461 6.25183C5.95761 7.37305 4.03061 8.49426 2.09339 9.59753C1.34919 10.0215 1.00362 10.6362 1.0081 11.4858C1.0176 13.3672 1.02136 15.2487 1.00613 17.1298C0.998958 18.0143 1.35152 18.6441 2.12548 19.0865C4.08804 20.208 6.04452 21.3402 8.00099 22.4724C8.79517 22.932 9.58934 23.3916 10.3839 23.8504C10.4401 23.8829 10.498 23.9121 10.5651 23.946Z" fill="white"/>
<path d="M12.6678 0.235103C12.1505 -0.0599633 11.5868 -0.0777318 11.053 0.18431C10.7019 0.3567 10.3637 0.555238 10.0125 0.761352C9.85478 0.853949 9.69443 0.948076 9.52913 1.04205C9.57463 1.06967 9.61475 1.09427 9.65136 1.11672C9.72394 1.16122 9.78275 1.19728 9.84244 1.23176C10.3526 1.52679 10.8625 1.82225 11.3724 2.11772C12.9384 3.02511 14.5044 3.93252 16.0775 4.82747C16.4847 5.05918 16.6433 5.3555 16.641 5.81515C16.6315 7.58978 16.6329 9.36451 16.6342 11.1393C16.6346 11.758 16.6351 12.3768 16.6351 12.9956V13.3616C16.8086 13.2614 16.9791 13.1633 17.1472 13.0666C17.7122 12.7415 18.2496 12.4322 18.782 12.1147C18.851 12.0736 18.9067 11.9485 18.9069 11.8622C18.913 9.53525 18.9175 7.2081 18.9067 4.88114C18.9037 4.2176 18.6108 3.6761 18.0369 3.33922C16.254 2.29303 14.4634 1.25958 12.6678 0.235103Z" fill="white"/>
</svg>
