<svg width="25" height="25" viewBox="0 0 25 25" xmlns="http://www.w3.org/2000/svg">
  <path
     d="m 12.506364,0.01953601 c -6.8443374,0 -12.46115397,5.61681649 -12.46115397,12.46115299 0,5.840583 4.09832757,11.146114 9.54057107,12.461154 v -4.122647 c -0.539237,0.118041 -1.0354928,0.121498 -1.5844649,-0.0403 -0.736425,-0.217341 -1.3348038,-0.7079 -1.7789758,-1.45596 C 5.9392384,18.845323 5.4374337,18.327357 4.913968,18.365422 L 4.7856473,16.910824 c 1.1319303,-0.09697 2.1111531,0.689649 2.6923978,1.666192 0.2582282,0.43429 0.5553975,0.688917 0.9368256,0.801456 0.3687236,0.108599 0.7645598,0.05646 1.2258661,-0.106453 0.1158017,-0.923538 0.5388482,-1.269237 0.8585062,-1.756001 v -7.31e-4 C 7.2535008,17.031152 5.9599747,15.309224 5.4465849,13.950133 4.7662547,12.145454 5.131308,9.8909604 6.3343449,8.4662024 c 0.023365,-0.02774 0.065615,-0.10037 0.04926,-0.15114 C 5.8320045,6.6488213 6.504128,5.2705008 6.5288555,5.1242769 7.1654452,5.3125086 7.2688827,4.9348771 9.2941122,6.1653187 l 0.350032,0.210282 c 0.1464195,0.087229 0.1004186,0.037479 0.2468378,0.026382 0.845558,-0.2297041 1.736918,-0.356506 2.615188,-0.3679451 0.884937,0.011488 1.770602,0.138241 2.651159,0.377242 l 0.113319,0.011487 c -0.0099,-0.00194 0.03076,-0.0068 0.09905,-0.047996 2.529856,-1.5323326 2.438978,-1.0315011 3.117379,-1.2520538 0.02454,0.1464184 0.687751,1.5471789 0.142039,3.1922946 -0.07359,0.226637 2.193309,2.3024386 0.936826,5.6344836 -0.513389,1.359677 -1.806721,3.081604 -5.052464,3.56574 v 7.29e-4 c 0.416038,0.634156 0.915945,0.971435 0.913267,2.279613 v 5.146262 c 5.442463,-1.31504 9.540578,-6.620571 9.540578,-12.461154 C 24.967518,5.6363518 19.350701,0.01953541 12.506364,0.01953601 Z" fill="#4afebf" style="stroke-width:0.0486764" />
</svg>
