<svg width="24" height="24" viewBox="0 0 24 24" fill="none" xmlns="http://www.w3.org/2000/svg">
<path d="M11.3168 1.39504L0.106726 20.8094C-0.196713 21.3361 0.183063 21.9926 0.789943 21.9926H3.35867L11.313 7.90087C11.6145 7.36649 12.3855 7.36649 12.6871 7.90087L20.6414 21.9926H23.2101C23.817 21.9926 24.1967 21.3361 23.8933 20.8094L12.6813 1.39504C12.3779 0.868319 11.6183 0.868319 11.3149 1.39504H11.3168Z" fill="white"/>
<path d="M11.3282 14.0553L6.74609 21.9925H17.2519L12.6698 14.0553C12.3721 13.5382 11.6259 13.5382 11.3282 14.0553Z" fill="white"/>
</svg>
