<svg width="24" height="24" viewBox="0 0 24 24" fill="none" xmlns="http://www.w3.org/2000/svg">
<g clip-path="url(#clip0_7309_1681)">
<path fill-rule="evenodd" clip-rule="evenodd" d="M0 24H8.26448V11.6059C8.26448 11.2052 8.84063 11.1432 8.9259 11.5346L10.8758 20.4844H15.8345V17.4043C15.8345 17.2195 15.9843 17.0697 16.1691 17.0697H24V0H15.7355V3.08018C15.7355 3.26495 15.5857 3.41474 15.4009 3.41474H7.15683L7.83435 6.52451C7.8798 6.73309 7.72095 6.9303 7.5075 6.9303H0V24Z" fill="white"/>
</g>
<defs>
<clipPath id="clip0_7309_1681">
<rect width="24" height="24" fill="white"/>
</clipPath>
</defs>
</svg>
