<svg width="32" height="32" viewBox="0 0 32 32" fill="none" xmlns="http://www.w3.org/2000/svg">
<g clip-path="url(#clip0_8196_9165)">
<mask id="mask0_8196_9165" style="mask-type:luminance" maskUnits="userSpaceOnUse" x="0" y="0" width="32" height="32">
<path d="M32 0H0V32H32V0Z" fill="white"/>
</mask>
<g mask="url(#mask0_8196_9165)">
<path fill-rule="evenodd" clip-rule="evenodd" d="M16 32C24.8365 32 32 24.8365 32 16C32 7.16344 24.8365 0 16 0C7.16344 0 0 7.16344 0 16C0 24.8365 7.16344 32 16 32ZM24.4652 7.46667H21.5205L16.6691 12.8352L12.4753 7.46667H6.4L13.6596 16.6541L6.77895 24.2667H9.72463L15.0349 18.3933L19.6753 24.2667H25.6L18.0332 14.5832L24.4652 7.46667ZM22.1187 22.5607H20.4877L9.83881 9.08269H11.589L22.1187 22.5607Z" fill="#4AFEBF"/>
</g>
</g>
<defs>
<clipPath id="clip0_8196_9165">
<rect width="32" height="32" fill="white"/>
</clipPath>
</defs>
</svg>
