<svg width="24" height="24" viewBox="0 0 24 24" fill="none" xmlns="http://www.w3.org/2000/svg">
<path fill-rule="evenodd" clip-rule="evenodd" d="M24 13.4115C24 13.5254 23.9736 13.6337 23.9236 13.7277L18.7767 22.6424C18.5584 23.0204 18.1551 23.2533 17.7185 23.2533H6.28151C5.84495 23.2533 5.44155 23.0204 5.22327 22.6424L0.0759155 13.7269C0.026041 13.633 0 13.5252 0 13.4115C0 13.0425 0.299116 12.7434 0.668094 12.7434H6.31519L7.74631 15.1742L7.7551 15.1887C7.94608 15.4954 8.34791 15.5953 8.66098 15.411L8.67719 15.4012C8.82154 15.3106 8.92604 15.168 8.96884 15.0026L10.7924 7.95308L12.3582 19.3024L12.3606 19.3182C12.4184 19.6752 12.7511 19.9226 13.1113 19.8729L13.1277 19.8704C13.3885 19.8279 13.6004 19.6352 13.6668 19.3784L15.8649 10.8812L16.7674 12.4142L16.7763 12.429C16.8981 12.6242 17.1122 12.7434 17.3431 12.7434H23.3319C23.7009 12.7434 24 13.0425 24 13.4115ZM17.7185 1C18.1551 1 18.5584 1.2329 18.7767 1.61097L23.9239 10.526C23.9737 10.6199 24 10.7282 24 10.8419C24 11.2108 23.7009 11.51 23.3319 11.51H17.6663L16.2352 9.07911L16.2253 9.06291C16.1348 8.91855 15.9922 8.81405 15.8268 8.77125L15.8112 8.76743C15.4591 8.6851 15.1037 8.8987 15.0127 9.25074L13.1891 16.3002L11.6233 4.95095L11.6208 4.93458C11.5783 4.67378 11.3856 4.46189 11.1288 4.39545C10.7716 4.30304 10.4071 4.51772 10.3147 4.87494L8.11658 13.372L7.21413 11.8391L7.20516 11.8243C7.08336 11.6291 6.86928 11.51 6.63839 11.51H0.668094C0.299116 11.51 0 11.2108 0 10.8419C0 10.729 0.025342 10.6223 0.0742976 10.5291L5.22327 1.61097C5.44155 1.2329 5.84495 1 6.28151 1H17.7185Z" fill="white"/>
</svg>
