<svg width="24" height="24" viewBox="0 0 24 24" fill="none" xmlns="http://www.w3.org/2000/svg">
<g clip-path="url(#clip0_6082_1373)">
<path d="M17.3845 8.51013L6.19878 8.5C3.14961 8.5 0.613168 11.4763 0.533608 15.302C0.531714 15.4041 0.599277 15.4883 0.682625 15.4891L11.8684 15.4977V15.5C14.9175 15.5 17.454 12.5237 17.5335 8.69795C17.5354 8.59586 17.4679 8.51169 17.3845 8.51091V8.51013Z" fill="white"/>
<path d="M23.3823 0.507237L6.28151 0.5C3.18782 0.5 0.61433 2.62592 0.533609 5.35861C0.531687 5.43153 0.600236 5.49165 0.684802 5.49221L17.7856 5.49833V5.5C20.8793 5.5 23.4528 3.37408 23.5335 0.641394C23.5355 0.56847 23.4669 0.50835 23.3823 0.507793V0.507237Z" fill="white"/>
<path d="M4.48292 23.1466C5.95244 22.5379 6.65028 20.8531 6.04158 19.3836C5.43289 17.9141 3.74816 17.2163 2.27864 17.825C0.809124 18.4337 0.111288 20.1184 0.719983 21.5879C1.32868 23.0574 3.0134 23.7553 4.48292 23.1466Z" fill="white"/>
</g>
<defs>
<clipPath id="clip0_6082_1373">
<rect width="24" height="24" fill="white"/>
</clipPath>
</defs>
</svg>
