<svg width="24" height="24" viewBox="0 0 24 24" fill="none" xmlns="http://www.w3.org/2000/svg">
<g clip-path="url(#clip0_4278_2097)">
<path fill-rule="evenodd" clip-rule="evenodd" d="M8.94604 14.9675H14.8273V9.03223H8.94604V14.9675Z" fill="white"/>
<path fill-rule="evenodd" clip-rule="evenodd" d="M6.12415 20.7085H18.0162C19.3921 20.7085 20.5144 19.5754 20.5144 18.1887V6.18872H17.7788V17.9459H6.12415V20.7085Z" fill="white"/>
<path fill-rule="evenodd" clip-rule="evenodd" d="M17.6546 6.05409V3.2915H5.76248C4.38658 3.2915 3.26428 4.4246 3.26428 5.81129V17.8113H5.99989V6.05409H17.6546Z" fill="white"/>
<path fill-rule="evenodd" clip-rule="evenodd" d="M20.5144 3.29137H23.7734V0H20.5144V3.29137Z" fill="white"/>
<path fill-rule="evenodd" clip-rule="evenodd" d="M0 23.9999H3.26439V20.7085H0V23.9999Z" fill="white"/>
</g>
<defs>
<clipPath id="clip0_4278_2097">
<rect width="24" height="24" fill="white"/>
</clipPath>
</defs>
</svg>
