<svg width="24" height="24" viewBox="0 0 24 24" fill="none" xmlns="http://www.w3.org/2000/svg">
<g clip-path="url(#clip0_4618_4615)">
<path fill-rule="evenodd" clip-rule="evenodd" d="M5.55995 20.6054C2.95058 18.6489 1.25758 15.5217 1.25758 12C1.25758 6.07175 6.05065 1.26196 11.9583 1.26196C16.8358 1.26196 22.1618 4.18696 23.4487 8.6674C22.0091 3.66196 17.411 0 11.9583 0C5.35525 0 0 5.3739 0 12C0 18.6261 5.35525 24 11.9583 24C18.5614 24 23.9167 18.6261 23.9167 12V11.3674H23.2602C23.2407 11.3674 23.2115 11.3674 23.1725 11.3674C23.0945 11.3674 22.984 11.3642 22.841 11.3576C22.5583 11.3479 22.1684 11.3283 21.7297 11.2892C20.8328 11.2109 19.8092 11.0576 19.1138 10.7772C17.9927 10.3272 17.359 9.7337 16.6376 9.03585L16.5954 8.99675C15.8707 8.2989 15.0584 7.51305 13.6448 6.84785C12.254 6.1924 10.717 6.29675 9.5894 6.5315C9.0175 6.6489 8.52355 6.80545 8.17585 6.9326C8.00035 6.99455 7.86065 7.05325 7.76315 7.0924C7.1945 7.3337 6.64205 7.6174 6.0864 7.8815C6.0864 7.8815 7.1815 8.1815 7.7209 8.3511C7.7404 8.3576 7.76965 8.3674 7.8119 8.38045C7.89315 8.4065 8.0101 8.4489 8.14985 8.5076C8.4358 8.625 8.8095 8.79785 9.17995 9.03915C9.76485 9.41415 10.249 9.8902 10.4473 10.4706C9.2092 10.6337 8.04585 11.1815 7.175 11.6935C6.64855 12.0032 6.20985 12.3163 5.90115 12.5478C5.74845 12.6652 5.62495 12.7631 5.54045 12.8315C5.469 12.8902 4.35113 13.8783 4.35113 13.8783C4.35113 13.8783 5.79395 14.0315 6.5056 14.175C6.98 14.2696 7.61695 14.4261 8.28635 14.6576C8.95575 14.8924 9.63165 15.1989 10.1938 15.5935C10.756 15.9881 11.1686 16.4413 11.3701 16.9631C11.9615 18.4826 11.3799 19.9598 10.2133 20.7913C9.0597 21.613 7.3082 21.8087 5.5567 20.6021L5.55995 20.6054ZM9.6414 22.4837C10.1126 22.3304 10.5512 22.1055 10.9477 21.825C12.5335 20.6935 13.3686 18.6196 12.5465 16.5065C12.2216 15.675 11.6041 15.0424 10.9185 14.5598C10.2296 14.0772 9.4399 13.725 8.7055 13.4674C8.2246 13.2978 7.75665 13.1674 7.35045 13.0695C7.4967 12.975 7.6494 12.8772 7.81515 12.7794C8.7835 12.2087 10.0053 11.6837 11.1751 11.6837C12.9396 11.6837 14.2525 12.2282 15.5068 12.8087C15.6205 12.8608 15.7343 12.9163 15.8512 12.9685C16.9723 13.4968 18.1487 14.0511 19.5168 14.0511C20.8848 14.0511 21.8759 13.6761 22.5875 13.2848C21.9539 18.6065 17.4403 22.7348 11.9648 22.7348C11.1686 22.7348 10.392 22.6467 9.6479 22.4837H9.6414ZM21.2227 12.5119C20.7515 12.6717 20.1797 12.7892 19.5135 12.7892C18.4412 12.7892 17.5183 12.3587 16.3484 11.8109C16.2444 11.762 16.1405 11.7131 16.0333 11.6642C14.8602 11.1196 13.5051 10.5424 11.7406 10.4381C11.5034 9.2674 10.6195 8.4652 9.8591 7.9761C9.7746 7.92065 9.69015 7.8685 9.60565 7.81955C9.6804 7.80325 9.75835 7.7837 9.8396 7.7674C10.8599 7.55545 12.0753 7.50325 13.1054 7.9924C14.3273 8.56955 15.0194 9.2348 15.7375 9.9261L15.7635 9.9489C16.5011 10.6598 17.2843 11.4065 18.6458 11.9544C19.403 12.2576 20.3843 12.4206 21.2227 12.5119Z" fill="white"/>
</g>
<defs>
<clipPath id="clip0_4618_4615">
<rect width="24" height="24" fill="white"/>
</clipPath>
</defs>
</svg>
