<svg width="24" height="24" viewBox="0 0 24 24" fill="none" xmlns="http://www.w3.org/2000/svg">
<g clip-path="url(#clip0_6080_2776)">
<path fill-rule="evenodd" clip-rule="evenodd" d="M9.09581 23.641C15.5259 25.2441 22.0378 21.3317 23.6407 14.9031H23.6406L23.6405 14.9032C25.2436 8.47429 21.331 1.96201 14.9014 0.359325C8.47324 -1.24336 1.96134 2.66927 0.359179 9.09861C-1.24439 15.5267 2.66839 22.0383 9.09581 23.641ZM14.6523 7.26233C16.315 7.83498 17.531 8.6934 17.2921 10.2903L17.2921 10.2902L17.2926 10.2905C17.1197 11.4595 16.4716 12.0254 15.6111 12.2238C16.7925 12.8389 17.3937 13.7821 16.821 15.4172C16.1103 17.4482 14.4217 17.6196 12.176 17.1946L11.6311 19.3785L10.3141 19.0504L10.852 16.8958C10.5106 16.811 10.1618 16.721 9.80248 16.6235L9.26279 18.7883L7.94737 18.4601L8.49233 16.2721C8.36576 16.2398 8.23838 16.2066 8.11008 16.1731C7.92651 16.1253 7.74106 16.077 7.5534 16.0299L5.8396 15.6027L6.49344 14.0954C6.49344 14.0954 7.46382 14.3534 7.45062 14.3342C7.82347 14.4266 7.9889 14.1834 8.05407 14.0214L8.91528 10.5692C8.94997 10.5775 8.98376 10.5859 9.01626 10.5941C9.02922 10.5973 9.04196 10.6005 9.05448 10.6036C9.00192 10.5825 8.95429 10.569 8.91757 10.5597L9.53199 8.09529C9.548 7.81551 9.45156 7.46252 8.91827 7.32943C8.93886 7.31565 7.9618 7.09171 7.9618 7.09171L8.31212 5.68528L10.1282 6.13874L10.1267 6.14554C10.3997 6.21347 10.6811 6.27793 10.9676 6.34315L11.5073 4.18066L12.8234 4.50878L12.2945 6.62892C12.6479 6.70957 13.0035 6.79092 13.3497 6.87726L13.8748 4.77103L15.1917 5.09914L14.6523 7.26233ZM10.4867 15.1054C11.5612 15.3891 13.9098 16.0094 14.2832 14.5091H14.2832C14.6657 12.9754 12.3885 12.4644 11.277 12.2149C11.1527 12.1871 11.043 12.1624 10.9532 12.14L10.23 15.0387C10.3037 15.057 10.39 15.0798 10.4867 15.1054ZM11.5 10.8696C12.3958 11.1087 14.3501 11.6302 14.6904 10.2666H14.6906C15.0381 8.8721 13.1389 8.45166 12.2113 8.24631C12.1069 8.22321 12.0149 8.20283 11.9397 8.1841L11.284 10.8131C11.3459 10.8285 11.4186 10.8479 11.5 10.8696Z" fill="white"/>
</g>
<defs>
<clipPath id="clip0_6080_2776">
<rect width="24" height="24" fill="white"/>
</clipPath>
</defs>
</svg>
