<svg width="24" height="24" viewBox="0 0 24 24" fill="none" xmlns="http://www.w3.org/2000/svg">
<path fill-rule="evenodd" clip-rule="evenodd" d="M16.2591 5.33781H23V2.31314L16.0676 2.31809C9.66944 2.3225 8.89112 2.31936 8.15129 2.48656C8.02725 2.51459 7.90429 2.54741 7.7561 2.58586C4.41829 3.4535 1.84576 6.14092 1.20139 9.42841C1.04029 10.2563 1 11.1637 1 14.0989V16.7912H4.12127V13.6973C4.12127 10.3455 4.13134 10.2216 4.40822 9.37873C4.68511 8.54078 5.113 7.84177 5.75235 7.17738C6.46721 6.44353 7.25265 5.94262 8.17895 5.64021C8.31518 5.59499 8.42621 5.55652 8.5389 5.52381C9.20502 5.33042 9.92942 5.33781 16.2591 5.33781ZM22.9496 13.5932C22.9747 13.2859 23 11.7637 23 10.1076V7.17223L16.2942 7.17738C10.973 7.18233 9.51808 7.19717 9.25626 7.24664C8.45079 7.40537 7.79633 7.75745 7.18716 8.35732C6.68373 8.85308 6.4119 9.28452 6.1752 9.94891L6.00908 10.4199L5.97887 16.7912H10.0768C13.193 16.7912 14.1849 16.7764 14.2301 16.7317C14.3963 16.5681 14.3107 16.469 11.8841 14.0791C10.4393 12.6512 9.4475 11.6347 9.39218 11.5257C9.20586 11.1389 9.34178 10.7124 9.70931 10.5339C9.87544 10.4498 10.2279 10.4447 14.8846 10.4447H19.8787V11.8528C19.8787 13.638 19.8031 14.1337 19.3804 15.1055C19.0832 15.7848 18.6754 16.355 18.0714 16.94C17.2507 17.7284 16.5056 18.1449 15.3074 18.4672L14.8191 18.6011L1 18.6308V21.7H7.55963C11.698 21.7 14.3358 21.6801 14.7184 21.6454C19.0882 21.2735 22.5318 17.9019 22.9496 13.5932Z" fill="white"/>
</svg>
