<svg width="24" height="24" viewBox="0 0 24 24" fill="none" xmlns="http://www.w3.org/2000/svg">
<path fill-rule="evenodd" clip-rule="evenodd" d="M3 16.6529V1.84622C3 1.35657 3.19526 0.886978 3.54281 0.540744C3.89037 0.194512 4.36176 0 4.85328 0H18.2895C18.7811 0 19.2525 0.194512 19.6 0.540744C19.9476 0.886978 20.1428 1.35657 20.1428 1.84622V16.6529C20.1427 16.9295 20.0801 17.2024 19.9598 17.4517C19.8396 17.7009 19.6645 17.9201 19.4478 18.0929L12.4402 23.6962C12.1936 23.8928 11.8872 24 11.5714 24C11.2556 24 10.9492 23.8928 10.7027 23.6962L3.69498 18.0929C3.47826 17.9201 3.3033 17.7009 3.18301 17.4517C3.06272 17.2024 3.00017 16.9295 3 16.6529ZM16.5685 5.32778V8.5549C16.5685 8.9823 16.4004 9.39225 16.1011 9.69482C15.8018 9.99731 15.3957 10.1676 14.972 10.1684C15.3962 10.1684 15.803 10.3385 16.103 10.641C16.403 10.9437 16.5715 11.3541 16.5715 11.782V14.6914C16.5714 14.9331 16.5174 15.1717 16.4136 15.3896C16.3098 15.6075 16.1588 15.7989 15.9717 15.95L13.4965 17.9549C13.4671 17.9786 13.4316 17.9935 13.3942 17.9978C13.3568 18.0022 13.3189 17.9957 13.285 17.9792C13.251 17.9628 13.2223 17.937 13.2023 17.9049C13.1822 17.8727 13.1716 17.8356 13.1715 17.7975V12.1854C13.1715 11.8644 13.0451 11.5566 12.8202 11.3297C12.5952 11.1027 12.2901 10.9752 11.9719 10.9752H10.1725C10.1194 10.9752 10.0686 10.9965 10.0311 11.0343C9.99359 11.0721 9.97252 11.1234 9.97252 11.1769V17.7975C9.97265 17.8357 9.96204 17.8731 9.94192 17.9055C9.92181 17.9378 9.89302 17.9637 9.85889 17.9802C9.82476 17.9966 9.7867 18.003 9.74912 17.9985C9.71155 17.9941 9.676 17.9789 9.64662 17.9549L7.17137 15.95C6.98433 15.7989 6.83331 15.6075 6.7295 15.3896C6.62567 15.1717 6.5717 14.9331 6.57155 14.6914V5.32778C6.57155 4.89984 6.74006 4.48943 7.04003 4.18683C7.34 3.88423 7.74685 3.71423 8.17106 3.71423H14.969C15.3933 3.71423 15.8001 3.88423 16.1001 4.18683C16.4 4.48943 16.5685 4.89984 16.5685 5.32778ZM10.1705 9.3617H11.9699C12.2881 9.3617 12.5932 9.23414 12.8182 9.00723C13.0432 8.78025 13.1696 8.47246 13.1696 8.15149V5.52948C13.1696 5.47599 13.1485 5.42469 13.111 5.38686C13.0735 5.34903 13.0226 5.32778 12.9696 5.32778H10.1705C10.1174 5.32778 10.0666 5.34903 10.0291 5.38686C9.99158 5.42469 9.97052 5.47599 9.97052 5.52948V9.15996C9.97052 9.21349 9.99158 9.26477 10.0291 9.30264C10.0666 9.34043 10.1174 9.3617 10.1705 9.3617Z" fill="url(#paint0_linear_4707_2906)"/>
<defs>
<linearGradient id="paint0_linear_4707_2906" x1="11.5716" y1="3.71423" x2="11.5716" y2="17.9999" gradientUnits="userSpaceOnUse">
<stop stop-color="white"/>
<stop offset="0.458333" stop-color="white"/>
<stop offset="1" stop-color="white"/>
</linearGradient>
</defs>
</svg>
