<svg width="24" height="24" viewBox="0 0 24 24" fill="none" xmlns="http://www.w3.org/2000/svg">
<path d="M21.519 10.1911C21.4864 10.0933 21.4864 9.99545 21.4211 9.89764C21.4211 9.86503 24.7142 5.62645 21.682 3.01809C18.6498 0.409733 15.1285 3.8006 15.0959 3.8332C14.5416 3.67018 13.9547 3.57237 13.4004 3.50716C12.2593 3.34414 10.6291 3.50716 10.6291 3.50716C10.0748 3.53976 9.52051 3.63758 8.96623 3.8006C8.93363 3.768 5.41235 0.377129 2.38013 2.98549C-0.65209 5.59385 2.60836 9.83243 2.64096 9.86503C2.60836 9.96285 2.57575 10.0607 2.54315 10.1585C2.21711 11.9843 0 12.5386 0 15.7012C0 18.9291 2.31492 21.4722 7.07517 21.4722H9.03144C9.03144 21.4722 9.78135 22.483 11.3464 22.5482C11.3464 22.5482 11.705 22.5808 12.5201 22.5482C14.183 22.5482 14.9655 21.5048 14.9655 21.4722H16.9217C21.682 21.4722 23.9969 18.9291 23.9969 15.7012C24.0947 12.5712 21.845 11.9843 21.519 10.1911Z" fill="white"/>
</svg>
