<svg width="24" height="24" viewBox="0 0 24 24" fill="none" xmlns="http://www.w3.org/2000/svg">
<path d="M11.9999 0C5.37255 0 0 5.37255 0 12.0001C0 18.6277 5.37255 24 11.9999 24C18.6272 24 24 18.6274 24 12.0001C24 5.37278 18.6274 0 11.9999 0ZM19.9119 11.8043C19.6822 12.0041 19.2497 12.3207 19.2497 12.3207C19.265 12.4114 19.2933 12.4994 19.3336 12.582C19.3942 12.6978 19.5437 12.87 19.4982 13.0272C19.4527 13.1843 19.1343 13.3069 19.2247 13.4811C19.3151 13.6552 19.5413 13.7088 19.4763 13.8651C19.4113 14.0214 19.0954 14.2915 19.1269 14.4083C19.1584 14.5251 19.4149 15.6008 18.8239 15.7886C18.3792 15.9294 17.1568 16.0096 16.5827 16.04C16.4609 16.0466 16.3427 16.0841 16.2394 16.149C16.1361 16.214 16.051 16.3041 15.9922 16.411C15.8779 16.625 15.8033 16.8578 15.7718 17.0983C15.6602 17.8605 14.9073 19.6103 14.9073 19.6103C14.9073 19.6103 14.8714 19.692 14.835 19.7782C14.8119 19.8335 14.7767 19.8829 14.7319 19.9226C14.6871 19.9624 14.6338 19.9916 14.5762 20.0079C12.8316 20.4884 10.9813 20.4198 9.27711 19.8114C9.22531 19.7933 9.1778 19.7647 9.13753 19.7274C9.09726 19.6901 9.06508 19.6449 9.04299 19.5947C9.02091 19.5444 9.00938 19.4902 9.00913 19.4353C9.00889 19.3804 9.01992 19.326 9.04156 19.2756C9.19494 18.9219 9.32377 18.5687 9.41933 18.2856C9.46086 18.1626 9.50752 18.0418 9.5582 17.9221C9.70556 17.5745 10.0074 16.871 10.2099 16.4432C12.3696 16.9214 13.6831 15.7162 14.0243 15.3492C14.0346 15.3378 14.0419 15.324 14.0456 15.3091C14.0492 15.2941 14.049 15.2785 14.045 15.2637C14.041 15.2488 14.0334 15.2352 14.0228 15.2241C14.0122 15.213 13.999 15.2047 13.9843 15.2C12.8854 14.831 11.4696 15.1107 10.5013 15.8448C10.809 15.227 11.1564 14.5796 11.5357 13.9394C13.7798 14.2458 14.9709 12.9086 15.2704 12.5121C15.2793 12.5 15.2852 12.4858 15.2873 12.4709C15.2895 12.4559 15.2878 12.4407 15.2826 12.4266C15.2774 12.4124 15.2687 12.3998 15.2573 12.3899C15.246 12.3799 15.2324 12.373 15.2177 12.3696C14.1757 12.1169 12.9222 12.446 12.0276 13.145C12.2866 12.7452 12.5574 12.3553 12.8387 11.984C15.1781 10.8918 15.518 8.76492 15.5675 8.21278C15.569 8.19773 15.5667 8.18255 15.5608 8.16864C15.5548 8.15474 15.5454 8.14258 15.5335 8.1333C15.5216 8.12401 15.5075 8.11792 15.4925 8.11557C15.4776 8.11323 15.4623 8.11472 15.4481 8.1199C14.918 8.30566 12.901 9.18289 12.4971 11.8536C12.348 12.0532 12.1198 12.3714 11.8387 12.801C12.2265 11.1854 11.6002 10.0639 11.3698 9.72186C11.3615 9.70905 11.35 9.6986 11.3364 9.6915C11.3229 9.6844 11.3078 9.6809 11.2925 9.68133C11.2772 9.68175 11.2623 9.68609 11.2492 9.69393C11.2361 9.70177 11.2252 9.71285 11.2175 9.7261C10.9519 10.1688 10.1097 11.8472 11.2399 13.7633C10.9329 14.2817 10.5969 14.8886 10.2512 15.5789C10.3685 13.7034 9.36909 12.6648 9.04044 12.3768C9.02927 12.3667 9.01575 12.3597 9.00113 12.3562C8.98651 12.3528 8.97126 12.3531 8.95679 12.3572C8.94232 12.3612 8.92911 12.3688 8.91836 12.3793C8.90762 12.3898 8.89969 12.4028 8.89531 12.4172C8.74505 12.8992 8.33312 14.6986 9.90003 16.3045C9.70467 16.7216 9.50864 17.1646 9.31529 17.6317C9.301 17.6265 9.28894 17.6223 9.2809 17.62C9.00609 17.5371 8.74263 17.4204 8.49655 17.2726C8.29471 17.1514 8.08002 17.0529 7.85644 16.979C6.98568 16.6935 7.11406 16.2737 6.65948 15.4336C6.62979 15.3789 6.27032 15.0035 6.19307 14.9354C6.17432 14.9189 5.94457 14.7854 5.82803 14.5394C5.72944 14.3385 5.66536 14.1225 5.63847 13.9004C5.60922 13.6269 5.49625 13.4471 5.22944 13.3547C3.94831 12.9119 4.52167 11.2504 4.5661 11.0273C4.60428 10.8391 4.43906 10.4283 4.37833 10.2012C4.37297 10.174 4.36583 10.1405 4.356 10.0999C4.26312 9.65332 4.47099 9.27666 4.62393 9.12171C4.77687 8.96676 5.30937 8.71982 5.42167 8.57246C5.53175 8.4298 5.61927 8.26636 5.73224 8.12592C5.88161 7.93994 6.33798 7.57601 6.95442 7.24557C7.32751 7.04619 7.39315 6.52441 7.53493 6.36477C7.77785 6.09059 8.14602 6.09059 8.4193 5.84388C8.55728 5.71952 8.75711 5.65745 8.88527 5.52616C9.52002 4.87555 10.3707 4.6121 11.2122 4.45447C11.7788 4.34864 12.41 4.5114 13.0024 4.61232C13.0869 4.6273 13.1704 4.64713 13.2527 4.67171C14.5825 4.71636 16.1833 4.99389 16.7616 5.55809C17.0475 5.83599 17.2613 6.1795 17.3843 6.55879C17.4809 6.85406 17.6124 7.13671 17.7761 7.40074L18.1316 7.97968C18.3572 8.34575 18.4298 8.78583 18.3338 9.20499C18.2785 9.44389 18.2492 9.69418 18.3204 9.83327C18.4321 10.0507 18.7726 10.4042 18.9771 10.6065C19.0763 10.7043 19.1859 10.7911 19.304 10.8652C19.5775 11.0385 20.0961 11.3703 20.0968 11.3988C20.099 11.4399 20.1414 11.6045 19.9119 11.8043Z" fill="white"/>
</svg>
