<svg width="24" height="24" viewBox="0 0 24 24" fill="none" xmlns="http://www.w3.org/2000/svg">
<path d="M5.06128 10.7537L12.1361 7.77143L18.9933 10.8299L12.1252 0L5.06128 10.7537ZM5.08305 14.0626L12.147 18.1551L19.3524 14.0626L12.2123 24L5.08305 14.0626Z" fill="white"/>
<path d="M12.1688 9.22998L4.80005 12.332L12.1688 16.4245L19.3307 12.4191L12.1688 9.22998Z" fill="white"/>
</svg>
