<svg width="24" height="24" viewBox="0 0 24 24" fill="none" xmlns="http://www.w3.org/2000/svg">
<path fill-rule="evenodd" clip-rule="evenodd" d="M16.8913 18.1808H7.10869L10.595 12.1417L8.22492 8.03863L0 22.285H24L11.9997 1.5L9.63015 5.60421L16.8913 18.1808Z" fill="white"/>
</svg>
