<svg width="24" height="24" viewBox="0 0 24 24" fill="none" xmlns="http://www.w3.org/2000/svg">
<path d="M1.57116 18.1839L11.1674 23.7463C11.4591 23.9175 11.7889 24 12.1124 24C12.4422 24 12.7657 23.9175 13.0574 23.7463L22.6536 18.1839C23.1039 17.9239 23.3196 17.3911 23.1927 16.8901L19.1082 1.40803C18.8925 0.58351 18.1378 0 17.2815 0H6.95594C6.0997 0 5.35128 0.577168 5.1293 1.40803L1.03839 16.8964C0.905196 17.3975 1.12718 17.9302 1.57116 18.1839ZM10.66 22.4841L2.47814 17.7463C2.06587 17.5116 1.86291 17.0233 1.98976 16.5666L5.52253 3.19028C5.57961 2.96829 5.76989 2.9556 5.82697 2.9556C5.88405 2.9556 6.07433 2.97463 6.13775 3.19028L11.2181 22.0592C11.2815 22.2875 11.1293 22.4207 11.0849 22.4588C11.0342 22.4905 10.8629 22.6047 10.66 22.4841ZM17.1356 0.830867C17.3132 0.830867 17.4781 0.91332 17.586 1.05285C17.6938 1.19239 17.7318 1.36998 17.6811 1.54123L12.4295 21.0634C12.3724 21.2854 12.1822 21.2981 12.1187 21.2981C12.0616 21.2981 11.8714 21.2791 11.8079 21.0634L6.55636 1.54123C6.51196 1.36998 6.54367 1.19239 6.6515 1.05285C6.75932 0.91332 6.92422 0.830867 7.10181 0.830867H17.1356ZM13.5775 22.4841C13.3745 22.6047 13.2033 22.4905 13.1589 22.4588C13.1145 22.4207 12.9623 22.2875 13.0257 22.0592L18.106 3.19028C18.1631 2.97463 18.3534 2.9556 18.4168 2.9556C18.4739 2.9556 18.6642 2.97463 18.7213 3.19028L22.254 16.5666C22.3745 17.0233 22.1716 17.5116 21.7657 17.7463L13.5775 22.4841Z" fill="white"/>
</svg>
