<svg width="24" height="24" viewBox="0 0 24 24" fill="none" xmlns="http://www.w3.org/2000/svg">
<g clip-path="url(#clip0_5728_4883)">
<path d="M4.97508 11.3924C4.9751 11.2588 5.00152 11.1265 5.05281 11.0032C5.10409 10.8798 5.17924 10.7678 5.27394 10.6735C5.36866 10.5793 5.48103 10.5047 5.60465 10.454C5.72827 10.4033 5.86068 10.3775 5.9943 10.3781L7.68413 10.3836C7.95354 10.3836 8.21193 10.4907 8.40244 10.6812C8.59296 10.8717 8.7 11.1301 8.7 11.3995V17.789C8.89023 17.7325 9.13456 17.6724 9.4019 17.6094C9.58761 17.5658 9.75311 17.4607 9.87157 17.3112C9.99002 17.1617 10.0545 16.9765 10.0544 16.7857V8.85983C10.0544 8.59038 10.1614 8.33198 10.3519 8.14144C10.5425 7.9509 10.8008 7.84382 11.0703 7.84376H12.7635C13.0329 7.84382 13.2913 7.9509 13.4818 8.14144C13.6723 8.33198 13.7793 8.59038 13.7793 8.85983V16.2158C13.7793 16.2158 14.2033 16.0443 14.6162 15.87C14.7696 15.8051 14.9005 15.6965 14.9926 15.5578C15.0846 15.419 15.1338 15.2561 15.134 15.0896V6.32016C15.134 6.05077 15.241 5.79241 15.4314 5.60191C15.6219 5.41138 15.8802 5.30435 16.1496 5.30429H17.8428C18.1122 5.30429 18.3706 5.41132 18.5611 5.60183C18.7517 5.79233 18.8587 6.05073 18.8587 6.32016V13.5416C20.3266 12.4777 21.8142 11.1983 22.9948 9.6597C23.1661 9.43638 23.2794 9.17415 23.3247 8.89638C23.3699 8.61863 23.3457 8.33397 23.2542 8.06783C22.7077 6.49559 21.8392 5.05473 20.7039 3.83747C19.5687 2.6202 18.1918 1.65333 16.6614 0.998734C15.131 0.34414 13.4809 0.0162335 11.8165 0.0359995C10.1521 0.0557657 8.51018 0.42277 6.9958 1.11352C5.4814 1.80428 4.12788 2.80357 3.02186 4.04745C1.91583 5.29134 1.08166 6.75241 0.572717 8.3372C0.0637785 9.92197 -0.108718 11.5955 0.0662658 13.2508C0.241249 14.9061 0.759862 16.5066 1.58891 17.9499C1.73333 18.1989 1.94581 18.4015 2.20137 18.5339C2.45693 18.6663 2.74497 18.7231 3.03167 18.6975C3.35193 18.6693 3.75069 18.6294 4.22479 18.5737C4.43117 18.5503 4.62171 18.4518 4.76011 18.2969C4.89852 18.142 4.9751 17.9416 4.97528 17.7339L4.97508 11.3924Z" fill="white"/>
<path d="M4.93848 21.641C6.72319 22.9394 8.83234 23.7188 11.0325 23.8929C13.2327 24.0668 15.4382 23.6289 17.4049 22.6272C19.3716 21.6255 21.0228 20.0993 22.176 18.2175C23.3289 16.3356 23.939 14.1714 23.9384 11.9643C23.9384 11.6889 23.9256 11.4164 23.9073 11.1455C19.5364 17.6645 11.4659 20.7121 4.93885 21.6401" fill="#8B8B8B"/>
</g>
<defs>
<clipPath id="clip0_5728_4883">
<rect width="24" height="24" fill="white"/>
</clipPath>
</defs>
</svg>
