2022-01-24 10:51:13,890:DEBUG:urllib3.connectionpool:http://localhost:None "GET /v2/connections?snap=certbot&interface=content HTTP/1.1" 200 97
2022-01-24 10:51:14,364:DEBUG:certbot._internal.main:certbot version: 1.22.0
2022-01-24 10:51:14,364:DEBUG:certbot._internal.main:Location of certbot entry point: /snap/certbot/1670/bin/certbot
2022-01-24 10:51:14,364:DEBUG:certbot._internal.main:Arguments: ['-d', 'pegase.mobilizing-js.net,a.pegase.mobilizing-js.net,b.pegase.mobilizing-js.net,c.pegase.mobilizing-js.net,d.pegase.mobilizing-js.net,e.pegase.mobilizing-js.net,f.pegase.mobilizing-js.net,g.pegase.mobilizing-js.net,h.pegase.mobilizing-js.net,i.pegase.mobilizing-js.net,j.pegase.mobilizing-js.net,k.pegase.mobilizing-js.net,l.pegase.mobilizing-js.net,m.pegase.mobilizing-js.net,n.pegase.mobilizing-js.net,o.pegase.mobilizing-js.net,p.pegase.mobilizing-js.net,q.pegase.mobilizing-js.net,r.pegase.mobilizing-js.net,s.pegase.mobilizing-js.net,t.pegase.mobilizing-js.net,u.pegase.mobilizing-js.net,v.pegase.mobilizing-js.net,w.pegase.mobilizing-js.net,x.pegase.mobilizing-js.net,y.pegase.mobilizing-js.net,z.pegase.mobilizing-js.net,www.pegase.mobilizing-js.net', '--cert-path', '/home/jplambert/certificates', '--key-path', '/home/jplambert/certificates', '--fullchain-path', '/home/jplambert/certificates', '--chain-path', '/home/jplambert/certificates', '--work-dir', '/home/jplambert/certificates', '--logs-dir', '/home/jplambert/certificates/log', '--config-dir', '/home/jplambert/certificates', '--register-unsafely-without-email', '--preconfigured-renewal']
2022-01-24 10:51:14,364:DEBUG:certbot._internal.main:Discovered plugins: PluginsRegistry(PluginEntryPoint#apache,PluginEntryPoint#manual,PluginEntryPoint#nginx,PluginEntryPoint#null,PluginEntryPoint#standalone,PluginEntryPoint#webroot)
2022-01-24 10:51:14,380:DEBUG:certbot._internal.log:Root logging level set at 30
2022-01-24 10:51:14,381:DEBUG:certbot._internal.plugins.selection:Requested authenticator None and installer None
2022-01-24 10:51:14,476:DEBUG:certbot_apache._internal.configurator:Apache version is 2.4.38
2022-01-24 10:51:14,755:DEBUG:certbot._internal.plugins.disco:No installation (PluginEntryPoint#nginx): Could not find a usable 'nginx' binary. Ensure nginx exists, the binary is executable, and your PATH is set correctly.
Traceback (most recent call last):
  File "/snap/certbot/1670/lib/python3.8/site-packages/certbot/_internal/plugins/disco.py", line 160, in prepare
    self._initialized.prepare()
  File "/snap/certbot/1670/lib/python3.8/site-packages/certbot_nginx/_internal/configurator.py", line 185, in prepare
    raise errors.NoInstallationError(
certbot.errors.NoInstallationError: Could not find a usable 'nginx' binary. Ensure nginx exists, the binary is executable, and your PATH is set correctly.
2022-01-24 10:51:14,756:DEBUG:certbot._internal.plugins.selection:Multiple candidate plugins: * apache
Description: Apache Web Server plugin
Interfaces: Installer, Authenticator, Plugin
Entry point: apache = certbot_apache._internal.entrypoint:ENTRYPOINT
Initialized: <certbot_apache._internal.override_debian.DebianConfigurator object at 0x7fa286152d90>
Prep: True

* standalone
Description: Spin up a temporary webserver
Interfaces: Authenticator, Plugin
Entry point: standalone = certbot._internal.plugins.standalone:Authenticator
Initialized: <certbot._internal.plugins.standalone.Authenticator object at 0x7fa2861526d0>
Prep: True

* webroot
Description: Place files in webroot directory
Interfaces: Authenticator, Plugin
Entry point: webroot = certbot._internal.plugins.webroot:Authenticator
Initialized: <certbot._internal.plugins.webroot.Authenticator object at 0x7fa286152490>
Prep: True
2022-01-24 10:51:27,583:ERROR:certbot._internal.log:Exiting due to user request.
