2022-01-24 10:56:51,607:DEBUG:urllib3.connectionpool:http://localhost:None "GET /v2/connections?snap=certbot&interface=content HTTP/1.1" 200 97
2022-01-24 10:56:52,085:DEBUG:certbot._internal.main:certbot version: 1.22.0
2022-01-24 10:56:52,085:DEBUG:certbot._internal.main:Location of certbot entry point: /snap/certbot/1670/bin/certbot
2022-01-24 10:56:52,085:DEBUG:certbot._internal.main:Arguments: ['--cert-path', '/home/jplambert/certificates', '--key-path', '/home/jplambert/certificates', '--fullchain-path', '/home/jplambert/certificates', '--chain-path', '/home/jplambert/certificates', '--work-dir', '/home/jplambert/certificates', '--logs-dir', '/home/jplambert/certificates/log', '--config-dir', '/home/jplambert/certificates', '--register-unsafely-without-email', '--preconfigured-renewal']
2022-01-24 10:56:52,086:DEBUG:certbot._internal.main:Discovered plugins: PluginsRegistry(PluginEntryPoint#apache,PluginEntryPoint#manual,PluginEntryPoint#nginx,PluginEntryPoint#null,PluginEntryPoint#standalone,PluginEntryPoint#webroot)
2022-01-24 10:56:52,100:DEBUG:certbot._internal.log:Root logging level set at 30
2022-01-24 10:56:52,109:DEBUG:urllib3.connectionpool:Starting new HTTP connection (1): r3.o.lencr.org:80
2022-01-24 10:56:52,148:DEBUG:urllib3.connectionpool:http://r3.o.lencr.org:80 "POST / HTTP/1.1" 200 503
2022-01-24 10:56:52,149:DEBUG:certbot.ocsp:OCSP response for certificate /home/jplambert/certificates/live/cotton.mobilizing-js.net/cert.pem is signed by the certificate's issuer.
2022-01-24 10:56:52,150:DEBUG:certbot.ocsp:OCSP certificate status for /home/jplambert/certificates/live/cotton.mobilizing-js.net/cert.pem is: OCSPCertStatus.GOOD
2022-01-24 10:56:52,162:DEBUG:urllib3.connectionpool:Starting new HTTP connection (1): r3.o.lencr.org:80
2022-01-24 10:56:52,205:DEBUG:urllib3.connectionpool:http://r3.o.lencr.org:80 "POST / HTTP/1.1" 200 503
2022-01-24 10:56:52,206:DEBUG:certbot.ocsp:OCSP response for certificate /home/jplambert/certificates/live/mobilizing-js.net/cert.pem is signed by the certificate's issuer.
2022-01-24 10:56:52,206:DEBUG:certbot.ocsp:OCSP certificate status for /home/jplambert/certificates/live/mobilizing-js.net/cert.pem is: OCSPCertStatus.GOOD
2022-01-24 10:56:52,213:DEBUG:certbot._internal.display.obj:Notifying user: Found the following certs:
  Certificate Name: cotton.mobilizing-js.net
    Serial Number: 3ff035842ff1383029d31fa6732f3d920b0
    Key Type: RSA
    Domains: t1.cotton.mobilizing-js.net cotton.mobilizing-js.net t2.cotton.mobilizing-js.net t3.cotton.mobilizing-js.net www.cotton.mobilizing-js.net
    Expiry Date: 2022-04-21 21:43:31+00:00 (VALID: 87 days)
    Certificate Path: /home/jplambert/certificates/live/cotton.mobilizing-js.net/fullchain.pem
    Private Key Path: /home/jplambert/certificates/live/cotton.mobilizing-js.net/privkey.pem
  Certificate Name: mobilizing-js.net
    Serial Number: 4fa4f7332d6ecccf0f7cd60115ad52b6ec1
    Key Type: RSA
    Domains: mobilizing-js.net
    Expiry Date: 2022-04-21 14:05:09+00:00 (VALID: 87 days)
    Certificate Path: /home/jplambert/certificates/live/mobilizing-js.net/fullchain.pem
    Private Key Path: /home/jplambert/certificates/live/mobilizing-js.net/privkey.pem
