2022-01-24 10:56:05,649:DEBUG:urllib3.connectionpool:http://localhost:None "GET /v2/connections?snap=certbot&interface=content HTTP/1.1" 200 97
2022-01-24 10:56:06,104:DEBUG:certbot._internal.main:certbot version: 1.22.0
2022-01-24 10:56:06,104:DEBUG:certbot._internal.main:Location of certbot entry point: /snap/certbot/1670/bin/certbot
2022-01-24 10:56:06,104:DEBUG:certbot._internal.main:Arguments: ['--cert-path', '/home/jplambert/certificates', '--key-path', '/home/jplambert/certificates', '--fullchain-path', '/home/jplambert/certificates', '--chain-path', '/home/jplambert/certificates', '--work-dir', '/home/jplambert/certificates', '--logs-dir', '/home/jplambert/certificates/log', '--config-dir', '/home/jplambert/certificates', '--register-unsafely-without-email', '--preconfigured-renewal']
2022-01-24 10:56:06,104:DEBUG:certbot._internal.main:Discovered plugins: PluginsRegistry(PluginEntryPoint#apache,PluginEntryPoint#manual,PluginEntryPoint#nginx,PluginEntryPoint#null,PluginEntryPoint#standalone,PluginEntryPoint#webroot)
2022-01-24 10:56:06,119:DEBUG:certbot._internal.log:Root logging level set at 30
2022-01-24 10:56:06,121:WARNING:certbot._internal.cert_manager:Renewal configuration file /home/jplambert/certificates/renewal/a.pegase.mobilizing-js.net.conf produced an unexpected error: expected /home/jplambert/certificates/live/a.pegase.mobilizing-js.net/cert.pem to be a symlink. Skipping.
2022-01-24 10:56:06,122:DEBUG:certbot._internal.cert_manager:Traceback was:
Traceback (most recent call last):
  File "/snap/certbot/1670/lib/python3.8/site-packages/certbot/_internal/cert_manager.py", line 85, in certificates
    renewal_candidate = storage.RenewableCert(renewal_file, config)
  File "/snap/certbot/1670/lib/python3.8/site-packages/certbot/_internal/storage.py", line 498, in __init__
    self._check_symlinks()
  File "/snap/certbot/1670/lib/python3.8/site-packages/certbot/_internal/storage.py", line 571, in _check_symlinks
    raise errors.CertStorageError(
certbot.errors.CertStorageError: expected /home/jplambert/certificates/live/a.pegase.mobilizing-js.net/cert.pem to be a symlink

2022-01-24 10:56:06,129:WARNING:certbot._internal.cert_manager:Renewal configuration file /home/jplambert/certificates/renewal/pegase.mobilizing-js.neta.pegase.mobilizing-js.net.conf produced an unexpected error: expected /home/jplambert/certificates/live/pegase.mobilizing-js.neta.pegase.mobilizing-js.net/cert.pem to be a symlink. Skipping.
2022-01-24 10:56:06,129:DEBUG:certbot._internal.cert_manager:Traceback was:
Traceback (most recent call last):
  File "/snap/certbot/1670/lib/python3.8/site-packages/certbot/_internal/cert_manager.py", line 85, in certificates
    renewal_candidate = storage.RenewableCert(renewal_file, config)
  File "/snap/certbot/1670/lib/python3.8/site-packages/certbot/_internal/storage.py", line 498, in __init__
    self._check_symlinks()
  File "/snap/certbot/1670/lib/python3.8/site-packages/certbot/_internal/storage.py", line 571, in _check_symlinks
    raise errors.CertStorageError(
certbot.errors.CertStorageError: expected /home/jplambert/certificates/live/pegase.mobilizing-js.neta.pegase.mobilizing-js.net/cert.pem to be a symlink

2022-01-24 10:56:06,134:DEBUG:urllib3.connectionpool:Starting new HTTP connection (1): r3.o.lencr.org:80
2022-01-24 10:56:06,305:DEBUG:urllib3.connectionpool:http://r3.o.lencr.org:80 "POST / HTTP/1.1" 200 503
2022-01-24 10:56:06,306:DEBUG:certbot.ocsp:OCSP response for certificate /home/jplambert/certificates/live/cotton.mobilizing-js.net/cert.pem is signed by the certificate's issuer.
2022-01-24 10:56:06,307:DEBUG:certbot.ocsp:OCSP certificate status for /home/jplambert/certificates/live/cotton.mobilizing-js.net/cert.pem is: OCSPCertStatus.GOOD
2022-01-24 10:56:06,318:DEBUG:urllib3.connectionpool:Starting new HTTP connection (1): r3.o.lencr.org:80
2022-01-24 10:56:06,489:DEBUG:urllib3.connectionpool:http://r3.o.lencr.org:80 "POST / HTTP/1.1" 200 503
2022-01-24 10:56:06,490:DEBUG:certbot.ocsp:OCSP response for certificate /home/jplambert/certificates/live/mobilizing-js.net/cert.pem is signed by the certificate's issuer.
2022-01-24 10:56:06,491:DEBUG:certbot.ocsp:OCSP certificate status for /home/jplambert/certificates/live/mobilizing-js.net/cert.pem is: OCSPCertStatus.GOOD
2022-01-24 10:56:06,500:DEBUG:urllib3.connectionpool:Starting new HTTP connection (1): r3.o.lencr.org:80
2022-01-24 10:56:06,672:DEBUG:urllib3.connectionpool:http://r3.o.lencr.org:80 "POST / HTTP/1.1" 200 503
2022-01-24 10:56:06,673:DEBUG:certbot.ocsp:OCSP response for certificate /home/jplambert/certificates/live/pegase.mobilizing-js.net/cert.pem is signed by the certificate's issuer.
2022-01-24 10:56:06,673:DEBUG:certbot.ocsp:OCSP certificate status for /home/jplambert/certificates/live/pegase.mobilizing-js.net/cert.pem is: OCSPCertStatus.GOOD
2022-01-24 10:56:06,680:DEBUG:certbot._internal.display.obj:Notifying user: Found the following certs:
  Certificate Name: cotton.mobilizing-js.net
    Serial Number: 3ff035842ff1383029d31fa6732f3d920b0
    Key Type: RSA
    Domains: t1.cotton.mobilizing-js.net cotton.mobilizing-js.net t2.cotton.mobilizing-js.net t3.cotton.mobilizing-js.net www.cotton.mobilizing-js.net
    Expiry Date: 2022-04-21 21:43:31+00:00 (VALID: 87 days)
    Certificate Path: /home/jplambert/certificates/live/cotton.mobilizing-js.net/fullchain.pem
    Private Key Path: /home/jplambert/certificates/live/cotton.mobilizing-js.net/privkey.pem
  Certificate Name: mobilizing-js.net
    Serial Number: 4fa4f7332d6ecccf0f7cd60115ad52b6ec1
    Key Type: RSA
    Domains: mobilizing-js.net
    Expiry Date: 2022-04-21 14:05:09+00:00 (VALID: 87 days)
    Certificate Path: /home/jplambert/certificates/live/mobilizing-js.net/fullchain.pem
    Private Key Path: /home/jplambert/certificates/live/mobilizing-js.net/privkey.pem
  Certificate Name: pegase.mobilizing-js.net
    Serial Number: 39458045b305456e0b7fb05525948c903d8
    Key Type: RSA
    Domains: pegase.mobilizing-js.net a.pegase.mobilizing-js.net b.pegase.mobilizing-js.net c.pegase.mobilizing-js.net d.pegase.mobilizing-js.net e.pegase.mobilizing-js.net f.pegase.mobilizing-js.net g.pegase.mobilizing-js.net h.pegase.mobilizing-js.net i.pegase.mobilizing-js.net j.pegase.mobilizing-js.net k.pegase.mobilizing-js.net l.pegase.mobilizing-js.net m.pegase.mobilizing-js.net n.pegase.mobilizing-js.net o.pegase.mobilizing-js.net p.pegase.mobilizing-js.net q.pegase.mobilizing-js.net r.pegase.mobilizing-js.net s.pegase.mobilizing-js.net t.pegase.mobilizing-js.net u.pegase.mobilizing-js.net v.pegase.mobilizing-js.net w.pegase.mobilizing-js.net www.pegase.mobilizing-js.net x.pegase.mobilizing-js.net y.pegase.mobilizing-js.net z.pegase.mobilizing-js.net
    Expiry Date: 2022-04-24 09:52:58+00:00 (VALID: 89 days)
    Certificate Path: /home/jplambert/certificates/live/pegase.mobilizing-js.net/fullchain.pem
    Private Key Path: /home/jplambert/certificates/live/pegase.mobilizing-js.net/privkey.pem

The following renewal configurations were invalid:
  /home/jplambert/certificates/renewal/a.pegase.mobilizing-js.net.conf
  /home/jplambert/certificates/renewal/pegase.mobilizing-js.neta.pegase.mobilizing-js.net.conf
