{
    // JSON5 allows comments
    "name": "platform-example",
    "author": "",
    "clients": {
        "player": {
            "target": "browser",
            "default": true
        },
        "controller": {
            "target": "browser",
        },
        "display": {
            "target": "browser",
        },
        "handsSimulator": {
            "target": "browser",
        },
    },
}