{
	"info": {
		"_postman_id": "873689ab-d572-45c7-9010-3994403064a8",
		"name": "Todoist API",
		"schema": "https://schema.getpostman.com/json/collection/v2.1.0/collection.json"
	},
	"item": [
		{
			"name": "Negative Tests",
			"item": [
				{
					"name": "Create New Task - Unexpected payload",
					"event": [
						{
							"listen": "test",
							"script": {
								"exec": [
									"",
									"pm.test(\"Status Code is 400\", () => pm.response.to.have.status(400))"
								],
								"type": "text/javascript"
							}
						},
						{
							"listen": "prerequest",
							"script": {
								"exec": [
									""
								],
								"type": "text/javascript"
							}
						}
					],
					"request": {
						"method": "POST",
						"header": [
							{
								"key": "Content-Type",
								"value": "application/json",
								"type": "text"
							},
							{
								"key": "X-Requested-Id",
								"value": "$(uuidgen)",
								"type": "text"
							},
							{
								"key": "",
								"value": "",
								"type": "text",
								"disabled": true
							}
						],
						"body": {
							"mode": "raw",
							"raw": "{\n    \"invalidProperty\": \"someString\"\n}"
						},
						"url": {
							"raw": "{{testTasksURL}}",
							"host": [
								"{{testTasksURL}}"
							]
						}
					},
					"response": []
				},
				{
					"name": "Update Task  - invalid Task ID",
					"event": [
						{
							"listen": "prerequest",
							"script": {
								"exec": [
									""
								],
								"type": "text/javascript"
							}
						},
						{
							"listen": "test",
							"script": {
								"exec": [
									"",
									"pm.test(\"Test for 404 status\", ()=>pm.response.to.have.status(404))",
									""
								],
								"type": "text/javascript"
							}
						}
					],
					"request": {
						"method": "POST",
						"header": [
							{
								"key": "Content-Type",
								"value": "application/json",
								"type": "text"
							},
							{
								"key": "X-Request-Id",
								"value": "{{$randomUUID}}",
								"type": "text"
							}
						],
						"body": {
							"mode": "raw",
							"raw": "{\n    \"content\": \"{{updateContentValue}}\"\n}"
						},
						"url": {
							"raw": "{{testTasksURL}}/invalidID",
							"host": [
								"{{testTasksURL}}"
							],
							"path": [
								"invalidID"
							]
						}
					},
					"response": []
				},
				{
					"name": "Create New Task - No bearer Token",
					"event": [
						{
							"listen": "test",
							"script": {
								"exec": [
									"",
									"pm.test(\"Status Code is 400\", () => pm.response.to.have.status(400))"
								],
								"type": "text/javascript"
							}
						},
						{
							"listen": "prerequest",
							"script": {
								"exec": [
									""
								],
								"type": "text/javascript"
							}
						}
					],
					"request": {
						"auth": {
							"type": "noauth"
						},
						"method": "POST",
						"header": [
							{
								"key": "Content-Type",
								"value": "application/json",
								"type": "text",
								"disabled": true
							},
							{
								"key": "X-Requested-Id",
								"value": "$(uuidgen)",
								"type": "text",
								"disabled": true
							},
							{
								"key": "",
								"value": "",
								"type": "text",
								"disabled": true
							}
						],
						"body": {
							"mode": "raw",
							"raw": "{\n    \"content\": \"{{taskContent}}\", \n    \"due_string\": \"{{taskDueString}}\", \n    \"due_lang\": \"en\", \n    \"priority\": 4\n}",
							"options": {
								"raw": {
									"language": "json"
								}
							}
						},
						"url": {
							"raw": "{{testTasksURL}}",
							"host": [
								"{{testTasksURL}}"
							]
						}
					},
					"response": []
				},
				{
					"name": "Delete a Task  - InvalidTaskID",
					"event": [
						{
							"listen": "test",
							"script": {
								"exec": [
									"pm.test(\"Test for 404 status\", ()=> pm.response.to.have.status(404))"
								],
								"type": "text/javascript"
							}
						},
						{
							"listen": "prerequest",
							"script": {
								"exec": [
									""
								],
								"type": "text/javascript"
							}
						}
					],
					"request": {
						"method": "DELETE",
						"header": [],
						"body": {
							"mode": "raw",
							"raw": ""
						},
						"url": {
							"raw": "{{testTasksURL}}/invalidID",
							"host": [
								"{{testTasksURL}}"
							],
							"path": [
								"invalidID"
							]
						}
					},
					"response": []
				},
				{
					"name": "Update Task - No Bearer Token",
					"event": [
						{
							"listen": "prerequest",
							"script": {
								"exec": [
									""
								],
								"type": "text/javascript"
							}
						},
						{
							"listen": "test",
							"script": {
								"exec": [
									"",
									"pm.test(\"Test for 400 status\", ()=>pm.response.to.have.status(400))"
								],
								"type": "text/javascript"
							}
						}
					],
					"request": {
						"auth": {
							"type": "noauth"
						},
						"method": "POST",
						"header": [
							{
								"key": "Content-Type",
								"value": "application/json",
								"type": "text"
							},
							{
								"key": "X-Request-Id",
								"value": "{{$randomUUID}}",
								"type": "text"
							}
						],
						"body": {
							"mode": "raw",
							"raw": "{\n    \"content\": \"{{updateContentValue}}\"\n}"
						},
						"url": {
							"raw": "{{testTasksURL}}/{{task}}",
							"host": [
								"{{testTasksURL}}"
							],
							"path": [
								"{{task}}"
							]
						}
					},
					"response": []
				},
				{
					"name": "Close a Task - Change status to \"Complete\"  - invalid taskID",
					"event": [
						{
							"listen": "prerequest",
							"script": {
								"exec": [
									""
								],
								"type": "text/javascript"
							}
						},
						{
							"listen": "test",
							"script": {
								"exec": [
									"pm.test(\"Test for 404 status\", ()=>pm.response.to.have.status(404))",
									""
								],
								"type": "text/javascript"
							}
						}
					],
					"request": {
						"method": "POST",
						"header": [],
						"body": {
							"mode": "raw",
							"raw": ""
						},
						"url": {
							"raw": "{{testTasksURL}}/invalidTaskID/close",
							"host": [
								"{{testTasksURL}}"
							],
							"path": [
								"invalidTaskID",
								"close"
							]
						}
					},
					"response": []
				},
				{
					"name": "Update Task - invalid Payload",
					"event": [
						{
							"listen": "prerequest",
							"script": {
								"exec": [
									""
								],
								"type": "text/javascript"
							}
						},
						{
							"listen": "test",
							"script": {
								"exec": [
									"",
									"pm.test(\"Test for 400 status\", ()=>pm.response.to.have.status(400))",
									"",
									"pm.test(\"Validate Response Text\", ()=>",
									"pm.expect(pm.response.text()).to.include(\"At least one of supported fields should be set and non-empty\")",
									")"
								],
								"type": "text/javascript"
							}
						}
					],
					"request": {
						"method": "POST",
						"header": [
							{
								"key": "Content-Type",
								"value": "application/json",
								"type": "text"
							},
							{
								"key": "X-Request-Id",
								"value": "{{$randomUUID}}",
								"type": "text"
							}
						],
						"body": {
							"mode": "raw",
							"raw": "{\n    \"invalidPropertyName\": \"{{updateContentValue}}\"\n}"
						},
						"url": {
							"raw": "{{testTasksURL}}/{{task}}",
							"host": [
								"{{testTasksURL}}"
							],
							"path": [
								"{{task}}"
							]
						}
					},
					"response": []
				}
			]
		},
		{
			"name": "All Active Tasks",
			"event": [
				{
					"listen": "test",
					"script": {
						"exec": [
							"let milliseconds = parseInt(pm.environment.get('milliseconds'))",
							"/* Schema Definition - tried to define the schema in the pre-request script and store it as an environment variable and then read from it in ",
							"    the test tab but kept getting error: ",
							"    Json Schema test ALL fields | AssertionError: expected null to be an object",
							"*/",
							"const schema = {",
							"   'type': 'array',",
							"    'items': {",
							"        'type': 'object',",
							"        'properties': {",
							"            'id': {'type': 'number'},",
							"            'assigner': {'type': 'number'},",
							"            'project_id': {'type': 'number'},",
							"            'section_id': {'type': 'number'},",
							"            'order': {'type': 'number'},",
							"            'content': {'type': 'string'},",
							"            'completed': {'type': 'boolean'},",
							"            'label_ids': {'type': 'array'},",
							"            'priority': {'type': 'number'},",
							"            'comment_count': {'type': 'number'},",
							"            'creator': {'type': 'number'},",
							"            'created': {'type': 'string'},",
							"            'due': {'type': 'object',  // This property doesn't appear in every object it won't get marked as 'required'",
							"                    'properties': {",
							"                        'recurring': {'type': 'boolean'},",
							"                        'string': {'type': 'string'},",
							"                        'date': {'type': 'string'},",
							"                        'datetime': {'type': 'string'},",
							"                        'timezone': {'type': 'string'},",
							"                    },",
							"                    'required' : [ // Following 3 properties are common on all 'due' properties",
							"                        'recurring',",
							"                        'string',",
							"                         'date'",
							"                    ]",
							"                },",
							"            'url': {'type': 'string'},",
							"        },",
							"        ",
							"        'additionalProperties': true, // Have to set it like this because some objects contain the 'due' property others don't",
							"        'required' : [",
							"            'id',  // Can switch this value with 'id11111' to make the JSON schema validation to fail, or add any invalid property field",
							"            'assigner',",
							"            'project_id',",
							"            'section_id',",
							"            'order',",
							"            'content',",
							"            'completed', ",
							"            'label_ids',",
							"            'priority',",
							"            'comment_count',",
							"            'creator',",
							"            'created',",
							"            'url',",
							"        ]",
							"        ",
							"    }",
							"}",
							"",
							"// Positive Test - Status Code 200 OK",
							"pm.test(\"Status Code is 200\", () => ",
							"    pm.response.to.have.status(200)",
							"    //pm.response.to.be.success; // Any 200-299 status code",
							")",
							"",
							"// Positive Test - Content - Test \"id\" value is not set to \"null\"",
							"pm.test(\"Validate property 'id' for each object is not null\", () => {",
							"    let jsonData = pm.response.json()",
							" ",
							"    jsonData.forEach(function (value,index) {",
							"        console.log(\"'id' NOT null - \" + jsonData[index].id)",
							"",
							"        pm.expect(jsonData[index].id).not.eql(null)",
							"    })",
							"})",
							"// Positive Test - Content - Slow test ",
							"pm.test(\"NOT NULL Check for each property in each object in tasks array \", () => {",
							"    let jsonData = pm.response.json()",
							" ",
							"    jsonData.forEach(function(value,index) { //Iterate through each array object",
							"    for (let property in jsonData[index]) {  // Iterate through each object property",
							"        pm.expect(jsonData.property).to.not.eql(null) // label_ids doesnt fail because it's an empty array [] which is !=null",
							"        console.log(\"Current Property \\\"\"+property+\"\\\" = \"+jsonData[index][property])",
							"        }",
							"    })",
							"})",
							"// Positive Test - Json Schema for tasks",
							"pm.test(\"Json Schema test ALL fields\", () => ",
							"    pm.response.to.have.jsonSchema(schema)",
							")",
							"    ",
							"// Positive Test - Response Time",
							"pm.test(\"Test Response Time is < \"+milliseconds+\" ms\", () => ",
							"    pm.expect(pm.response.responseTime).to.be.below(milliseconds)",
							")",
							"",
							"// Negative Test - expecting wrong json schema",
							"pm.test(\"Negative Test - Wrong Schema\", function() { ",
							"const wrongSchema = {",
							"    \"type\" : \"object\",",
							"    \"properties\": {",
							"    \"name\" :    {\"type\": \"string\"},",
							"    \"address\" : {\"type\": \"string\"},",
							"    \"phone\" :   {\"type\": \"number\"},",
							"    },",
							"    \"additionalProperties\":false,",
							"    \"required\" : [ \"name\", \"address\", \"phone\"]",
							"}   ",
							"    pm.response.to.not.have.jsonSchema(wrongSchema)",
							"})",
							"// Negative Test - Wrong Header - TE",
							"pm.test(\"Negative Test - Wrong Header\", () => {",
							"    pm.response.to.not.have.header(\"TE\")",
							"})"
						],
						"type": "text/javascript"
					}
				},
				{
					"listen": "prerequest",
					"script": {
						"exec": [
							""
						],
						"type": "text/javascript"
					}
				}
			],
			"request": {
				"method": "GET",
				"header": [],
				"url": {
					"raw": "{{testTasksURL}}",
					"host": [
						"{{testTasksURL}}"
					]
				}
			},
			"response": [
				{
					"name": "All Active Tasks",
					"originalRequest": {
						"method": "GET",
						"header": [
							{
								"key": "Content-Type",
								"name": "Content-Type",
								"value": "application/json",
								"type": "text"
							}
						],
						"body": {
							"mode": "raw",
							"raw": "",
							"options": {
								"raw": {
									"language": "json"
								}
							}
						},
						"url": {
							"raw": "https://783297e9-ccaf-4a97-97a3-d1d83fa92ead.mock.pstmn.io",
							"protocol": "https",
							"host": [
								"783297e9-ccaf-4a97-97a3-d1d83fa92ead",
								"mock",
								"pstmn",
								"io"
							]
						}
					},
					"status": "OK",
					"code": 200,
					"_postman_previewlanguage": "json",
					"header": [
						{
							"key": "Content-Type",
							"value": "application/json"
						},
						{
							"key": "Transfer-Encoding",
							"value": "chunked"
						},
						{
							"key": "Connection",
							"value": "keep-alive"
						},
						{
							"key": "Date",
							"value": "Fri, 19 Mar 2021 14:40:10 GMT"
						},
						{
							"key": "X-Cache",
							"value": "Miss from cloudfront"
						},
						{
							"key": "Via",
							"value": "1.1 51c947a89f81287c4310dda23943d797.cloudfront.net (CloudFront)"
						},
						{
							"key": "X-Amz-Cf-Pop",
							"value": "LAX50-C2"
						},
						{
							"key": "X-Amz-Cf-Id",
							"value": "iPmw34ktjQINXzyp8ulCME1hx5td68HGOH7ZrAAPCqO0dVm4Gbgc4w=="
						}
					],
					"cookie": [],
					"body": "[\n    {\n        \"id\": null,\n        \"assigner\": 0,\n        \"project_id\": 2260973797,\n        \"section_id\": 41453030,\n        \"order\": 1,\n        \"content\": \"Click this task to see more details\",\n        \"completed\": false,\n        \"label_ids\": [],\n        \"priority\": 1,\n        \"comment_count\": 1,\n        \"creator\": 33050511,\n        \"created\": \"2021-03-17T05:27:10Z\",\n        \"url\": \"https://todoist.com/showTask?id=4665876664\"\n    },\n    {\n        \"id\": 4665876665,\n        \"assigner\": 0,\n        \"project_id\": 2260973798,\n        \"section_id\": 41453029,\n        \"order\": 1,\n        \"content\": \"This is a task. Drag it to the \\\"Doing\\\" section\",\n        \"completed\": false,\n        \"label_ids\": [],\n        \"priority\": 1,\n        \"comment_count\": 0,\n        \"creator\": 33050511,\n        \"created\": \"2021-03-17T05:27:10Z\",\n        \"url\": \"https://todoist.com/showTask?id=4665876665\"\n    },\n    {\n        \"id\": 4665876668,\n        \"assigner\": 0,\n        \"project_id\": 2260973798,\n        \"section_id\": 41453031,\n        \"order\": 1,\n        \"content\": \"Switch between Board and List view from the three-dot project menu\",\n        \"completed\": false,\n        \"label_ids\": [],\n        \"priority\": 1,\n        \"comment_count\": 0,\n        \"creator\": 33050511,\n        \"created\": \"2021-03-17T05:27:10Z\",\n        \"url\": \"https://todoist.com/showTask?id=4665876668\"\n    },\n    {\n        \"id\": 4665876670,\n        \"assigner\": 0,\n        \"project_id\": 2260973797,\n        \"section_id\": 41453030,\n        \"parent\": 4665876664,\n        \"parent_id\": 4665876664,\n        \"order\": 1,\n        \"content\": \"You can add subtasks here! ✅\",\n        \"completed\": false,\n        \"label_ids\": [],\n        \"priority\": 1,\n        \"comment_count\": 0,\n        \"creator\": 33050511,\n        \"created\": \"2021-03-17T05:27:10Z\",\n        \"url\": \"https://todoist.com/showTask?id=4665876670\"\n    },\n    {\n        \"id\": 4665876672,\n        \"assigner\": 0,\n        \"project_id\": 2260973797,\n        \"section_id\": 41453030,\n        \"order\": 2,\n        \"content\": \"Add a new task ➕\",\n        \"completed\": false,\n        \"label_ids\": [],\n        \"priority\": 1,\n        \"comment_count\": 2,\n        \"creator\": 33050511,\n        \"created\": \"2021-03-17T05:27:10Z\",\n        \"due\": {\n            \"recurring\": false,\n            \"string\": \"Mar 16\",\n            \"date\": \"2021-03-16\"\n        },\n        \"url\": \"https://todoist.com/showTask?id=4665876672\"\n    },\n    {\n        \"id\": 4665876674,\n        \"assigner\": 0,\n        \"project_id\": 2260973798,\n        \"section_id\": 41453031,\n        \"order\": 2,\n        \"content\": \"Add a \\\"Done\\\" section by pressing Add Section\",\n        \"completed\": false,\n        \"label_ids\": [],\n        \"priority\": 1,\n        \"comment_count\": 0,\n        \"creator\": 33050511,\n        \"created\": \"2021-03-17T05:27:10Z\",\n        \"url\": \"https://todoist.com/showTask?id=4665876674\"\n    },\n    {\n        \"id\": 4665876676,\n        \"assigner\": 0,\n        \"project_id\": 2260973797,\n        \"section_id\": 41453030,\n        \"order\": 3,\n        \"content\": \"Schedule this task 📅\",\n        \"completed\": false,\n        \"label_ids\": [],\n        \"priority\": 1,\n        \"comment_count\": 1,\n        \"creator\": 33050511,\n        \"created\": \"2021-03-17T05:27:10Z\",\n        \"url\": \"https://todoist.com/showTask?id=4665876676\"\n    },\n    {\n        \"id\": 4665876679,\n        \"assigner\": 0,\n        \"project_id\": 2260973797,\n        \"section_id\": 41453030,\n        \"order\": 4,\n        \"content\": \"Add a section from the project menu in the top right `...`\",\n        \"completed\": false,\n        \"label_ids\": [],\n        \"priority\": 1,\n        \"comment_count\": 1,\n        \"creator\": 33050511,\n        \"created\": \"2021-03-17T05:27:11Z\",\n        \"url\": \"https://todoist.com/showTask?id=4665876679\"\n    },\n    {\n        \"id\": 4665876682,\n        \"assigner\": 0,\n        \"project_id\": 2260973797,\n        \"section_id\": 41453030,\n        \"order\": 5,\n        \"content\": \"Click **+** next to Projects to add one of your own\",\n        \"completed\": false,\n        \"label_ids\": [],\n        \"priority\": 1,\n        \"comment_count\": 1,\n        \"creator\": 33050511,\n        \"created\": \"2021-03-17T05:27:11Z\",\n        \"url\": \"https://todoist.com/showTask?id=4665876682\"\n    },\n    {\n        \"id\": 4665876689,\n        \"assigner\": 0,\n        \"project_id\": 2260973797,\n        \"section_id\": 41453032,\n        \"order\": 1,\n        \"content\": \"[Kickstart your projects with Templates →](https://todoist.com/templates?utm_source=todoist&utm_medium=in_app&utm_campaign=welcome_project)\",\n        \"completed\": false,\n        \"label_ids\": [],\n        \"priority\": 1,\n        \"comment_count\": 0,\n        \"creator\": 33050511,\n        \"created\": \"2021-03-17T05:27:11Z\",\n        \"url\": \"https://todoist.com/showTask?id=4665876689\"\n    },\n    {\n        \"id\": 4665876693,\n        \"assigner\": 0,\n        \"project_id\": 2260973797,\n        \"section_id\": 41453032,\n        \"order\": 2,\n        \"content\": \"[Learn how to use Todoist with the Guide →](https://todoist.com/getting-started?utm_source=todoist&utm_medium=in_app&utm_campaign=welcome_project)\",\n        \"completed\": false,\n        \"label_ids\": [],\n        \"priority\": 1,\n        \"comment_count\": 0,\n        \"creator\": 33050511,\n        \"created\": \"2021-03-17T05:27:11Z\",\n        \"url\": \"https://todoist.com/showTask?id=4665876693\"\n    },\n    {\n        \"id\": 4665876696,\n        \"assigner\": 0,\n        \"project_id\": 2260973797,\n        \"section_id\": 41453032,\n        \"order\": 3,\n        \"content\": \"[Get organized anywhere with the Apps →](https://todoist.com/downloads?focus=mobile&utm_source=todoist&utm_medium=in_app&utm_campaign=welcome_project)\",\n        \"completed\": false,\n        \"label_ids\": [],\n        \"priority\": 1,\n        \"comment_count\": 0,\n        \"creator\": 33050511,\n        \"created\": \"2021-03-17T05:27:11Z\",\n        \"url\": \"https://todoist.com/showTask?id=4665876696\"\n    },\n    {\n        \"id\": 4665876698,\n        \"assigner\": 0,\n        \"project_id\": 2260973797,\n        \"section_id\": 41453032,\n        \"order\": 4,\n        \"content\": \"[Questions? Need more tips? Visit the Help Center →](https://todoist.com/help/?utm_source=todoist&utm_medium=in_app&utm_campaign=welcome_project)\",\n        \"completed\": false,\n        \"label_ids\": [],\n        \"priority\": 1,\n        \"comment_count\": 0,\n        \"creator\": 33050511,\n        \"created\": \"2021-03-17T05:27:12Z\",\n        \"url\": \"https://todoist.com/showTask?id=4665876698\"\n    },\n    {\n        \"id\": 4668618429,\n        \"assigner\": 0,\n        \"project_id\": 2260973796,\n        \"section_id\": 0,\n        \"order\": 1,\n        \"content\": \"Manually Added Task\",\n        \"completed\": false,\n        \"label_ids\": [],\n        \"priority\": 1,\n        \"comment_count\": 0,\n        \"creator\": 33050511,\n        \"created\": \"2021-03-18T01:16:02Z\",\n        \"due\": {\n            \"recurring\": false,\n            \"string\": \"Mar 17\",\n            \"date\": \"2021-03-17\"\n        },\n        \"url\": \"https://todoist.com/showTask?id=4668618429\"\n    },\n    {\n        \"id\": 4668632327,\n        \"assigner\": 0,\n        \"project_id\": 2260973796,\n        \"section_id\": 0,\n        \"order\": 2,\n        \"content\": \"Buy Milk\",\n        \"completed\": false,\n        \"label_ids\": [],\n        \"priority\": 4,\n        \"comment_count\": 0,\n        \"creator\": 33050511,\n        \"created\": \"2021-03-18T01:26:32Z\",\n        \"due\": {\n            \"recurring\": false,\n            \"string\": \"tomorrow at 12:00\",\n            \"date\": \"2021-03-18\",\n            \"datetime\": \"2021-03-18T19:00:00Z\",\n            \"timezone\": \"America/Tijuana\"\n        },\n        \"url\": \"https://todoist.com/showTask?id=4668632327\"\n    },\n    {\n        \"id\": 4668633643,\n        \"assigner\": 0,\n        \"project_id\": 2260973796,\n        \"section_id\": 0,\n        \"order\": 3,\n        \"content\": \"Buy Milk\",\n        \"completed\": false,\n        \"label_ids\": [],\n        \"priority\": 4,\n        \"comment_count\": 0,\n        \"creator\": 33050511,\n        \"created\": \"2021-03-18T01:27:35Z\",\n        \"due\": {\n            \"recurring\": false,\n            \"string\": \"tomorrow at 12:00\",\n            \"date\": \"2021-03-18\",\n            \"datetime\": \"2021-03-18T19:00:00Z\",\n            \"timezone\": \"America/Tijuana\"\n        },\n        \"url\": \"https://todoist.com/showTask?id=4668633643\"\n    },\n    {\n        \"id\": 4668633941,\n        \"assigner\": 0,\n        \"project_id\": 2260973796,\n        \"section_id\": 0,\n        \"order\": 4,\n        \"content\": \"Buy Milk\",\n        \"completed\": false,\n        \"label_ids\": [],\n        \"priority\": 4,\n        \"comment_count\": 0,\n        \"creator\": 33050511,\n        \"created\": \"2021-03-18T01:27:48Z\",\n        \"due\": {\n            \"recurring\": false,\n            \"string\": \"tomorrow at 12:00\",\n            \"date\": \"2021-03-18\",\n            \"datetime\": \"2021-03-18T19:00:00Z\",\n            \"timezone\": \"America/Tijuana\"\n        },\n        \"url\": \"https://todoist.com/showTask?id=4668633941\"\n    },\n    {\n        \"id\": 4668636573,\n        \"assigner\": 0,\n        \"project_id\": 2260973796,\n        \"section_id\": 0,\n        \"order\": 5,\n        \"content\": \"Buy Milk\",\n        \"completed\": false,\n        \"label_ids\": [],\n        \"priority\": 4,\n        \"comment_count\": 0,\n        \"creator\": 33050511,\n        \"created\": \"2021-03-18T01:29:57Z\",\n        \"due\": {\n            \"recurring\": false,\n            \"string\": \"tomorrow at 12:00\",\n            \"date\": \"2021-03-18\",\n            \"datetime\": \"2021-03-18T19:00:00Z\",\n            \"timezone\": \"America/Tijuana\"\n        },\n        \"url\": \"https://todoist.com/showTask?id=4668636573\"\n    },\n    {\n        \"id\": 4668636776,\n        \"assigner\": 0,\n        \"project_id\": 2260973796,\n        \"section_id\": 0,\n        \"order\": 6,\n        \"content\": \"Buy Milk\",\n        \"completed\": false,\n        \"label_ids\": [],\n        \"priority\": 4,\n        \"comment_count\": 0,\n        \"creator\": 33050511,\n        \"created\": \"2021-03-18T01:30:08Z\",\n        \"due\": {\n            \"recurring\": false,\n            \"string\": \"tomorrow at 12:00\",\n            \"date\": \"2021-03-18\",\n            \"datetime\": \"2021-03-18T19:00:00Z\",\n            \"timezone\": \"America/Tijuana\"\n        },\n        \"url\": \"https://todoist.com/showTask?id=4668636776\"\n    },\n    {\n        \"id\": 4668637650,\n        \"assigner\": 0,\n        \"project_id\": 2260973796,\n        \"section_id\": 0,\n        \"order\": 7,\n        \"content\": \"Buy Milk\",\n        \"completed\": false,\n        \"label_ids\": [],\n        \"priority\": 4,\n        \"comment_count\": 0,\n        \"creator\": 33050511,\n        \"created\": \"2021-03-18T01:30:47Z\",\n        \"due\": {\n            \"recurring\": false,\n            \"string\": \"tomorrow at 12:00\",\n            \"date\": \"2021-03-18\",\n            \"datetime\": \"2021-03-18T19:00:00Z\",\n            \"timezone\": \"America/Tijuana\"\n        },\n        \"url\": \"https://todoist.com/showTask?id=4668637650\"\n    },\n    {\n        \"id\": 4668642544,\n        \"assigner\": 0,\n        \"project_id\": 2260973796,\n        \"section_id\": 0,\n        \"order\": 8,\n        \"content\": \"Buy Milk\",\n        \"completed\": false,\n        \"label_ids\": [],\n        \"priority\": 4,\n        \"comment_count\": 0,\n        \"creator\": 33050511,\n        \"created\": \"2021-03-18T01:33:57Z\",\n        \"due\": {\n            \"recurring\": false,\n            \"string\": \"tomorrow at 12:00\",\n            \"date\": \"2021-03-18\",\n            \"datetime\": \"2021-03-18T19:00:00Z\",\n            \"timezone\": \"America/Tijuana\"\n        },\n        \"url\": \"https://todoist.com/showTask?id=4668642544\"\n    },\n    {\n        \"id\": 4668644619,\n        \"assigner\": 0,\n        \"project_id\": 2260973796,\n        \"section_id\": 0,\n        \"order\": 9,\n        \"content\": \"Buy Milk\",\n        \"completed\": false,\n        \"label_ids\": [],\n        \"priority\": 4,\n        \"comment_count\": 0,\n        \"creator\": 33050511,\n        \"created\": \"2021-03-18T01:35:17Z\",\n        \"due\": {\n            \"recurring\": false,\n            \"string\": \"tomorrow at 12:00\",\n            \"date\": \"2021-03-18\",\n            \"datetime\": \"2021-03-18T19:00:00Z\",\n            \"timezone\": \"America/Tijuana\"\n        },\n        \"url\": \"https://todoist.com/showTask?id=4668644619\"\n    },\n    {\n        \"id\": 4668644890,\n        \"assigner\": 0,\n        \"project_id\": 2260973796,\n        \"section_id\": 0,\n        \"order\": 10,\n        \"content\": \"Buy Milk\",\n        \"completed\": false,\n        \"label_ids\": [],\n        \"priority\": 4,\n        \"comment_count\": 0,\n        \"creator\": 33050511,\n        \"created\": \"2021-03-18T01:35:29Z\",\n        \"due\": {\n            \"recurring\": false,\n            \"string\": \"tomorrow at 12:00\",\n            \"date\": \"2021-03-18\",\n            \"datetime\": \"2021-03-18T19:00:00Z\",\n            \"timezone\": \"America/Tijuana\"\n        },\n        \"url\": \"https://todoist.com/showTask?id=4668644890\"\n    },\n    {\n        \"id\": 4668645892,\n        \"assigner\": 0,\n        \"project_id\": 2260973796,\n        \"section_id\": 0,\n        \"order\": 11,\n        \"content\": \"Buy Milk\",\n        \"completed\": false,\n        \"label_ids\": [],\n        \"priority\": 4,\n        \"comment_count\": 0,\n        \"creator\": 33050511,\n        \"created\": \"2021-03-18T01:36:20Z\",\n        \"due\": {\n            \"recurring\": false,\n            \"string\": \"tomorrow at 12:00\",\n            \"date\": \"2021-03-18\",\n            \"datetime\": \"2021-03-18T19:00:00Z\",\n            \"timezone\": \"America/Tijuana\"\n        },\n        \"url\": \"https://todoist.com/showTask?id=4668645892\"\n    },\n    {\n        \"id\": 4668648580,\n        \"assigner\": 0,\n        \"project_id\": 2260973796,\n        \"section_id\": 0,\n        \"order\": 12,\n        \"content\": \"Buy Milk\",\n        \"completed\": false,\n        \"label_ids\": [],\n        \"priority\": 4,\n        \"comment_count\": 0,\n        \"creator\": 33050511,\n        \"created\": \"2021-03-18T01:38:01Z\",\n        \"due\": {\n            \"recurring\": false,\n            \"string\": \"tomorrow at 12:00\",\n            \"date\": \"2021-03-18\",\n            \"datetime\": \"2021-03-18T19:00:00Z\",\n            \"timezone\": \"America/Tijuana\"\n        },\n        \"url\": \"https://todoist.com/showTask?id=4668648580\"\n    },\n    {\n        \"id\": 4668648841,\n        \"assigner\": 0,\n        \"project_id\": 2260973796,\n        \"section_id\": 0,\n        \"order\": 13,\n        \"content\": \"Buy Milk\",\n        \"completed\": false,\n        \"label_ids\": [],\n        \"priority\": 4,\n        \"comment_count\": 0,\n        \"creator\": 33050511,\n        \"created\": \"2021-03-18T01:38:12Z\",\n        \"due\": {\n            \"recurring\": false,\n            \"string\": \"tomorrow at 12:00\",\n            \"date\": \"2021-03-18\",\n            \"datetime\": \"2021-03-18T19:00:00Z\",\n            \"timezone\": \"America/Tijuana\"\n        },\n        \"url\": \"https://todoist.com/showTask?id=4668648841\"\n    }\n]"
				}
			]
		},
		{
			"name": "Create New Task",
			"event": [
				{
					"listen": "test",
					"script": {
						"exec": [
							"let jsonData = pm.response.json()",
							"",
							"// Positive Test - Status Code",
							"pm.test(\"Status Code is 200\", () => {",
							"    if (pm.response.to.have.status(200)) {",
							"        // If we were able to create a task save the taskID in env variable",
							"        pm.environment.set(\"task\",jsonData.id)",
							"        // Set taskStatus to Open",
							"        pm.environment.set(\"taskStatus\",\"open\")",
							"    }",
							" })",
							"",
							"// Positive Test - Header 'Content-Length'",
							"pm.test(\"Header Positive Test - Content-Length\", ()=> {",
							"    pm.response.to.have.header(\"Content-Length\")",
							"})",
							"",
							"// Positive Test - Test Content in body request is = to content in the response",
							"pm.test(\"Content Positive Test - Content = \"+pm.environment.get(\"taskContent\"), () => { ",
							"    let content  = pm.environment.get(\"taskContent\")",
							"    pm.expect(jsonData.content).to.eql(content)",
							"})",
							"// Negative Test - Test Content with a different string which we used in the body request",
							"pm.test(\"Content Negative Test\", () => {",
							"    pm.expect(jsonData.content).to.not.eql(\"Invalid String\")",
							"})",
							"",
							"// Positive Test - Json Schema",
							"pm.test(\"JSON Schema validation\", () => {",
							"const schema = {",
							"    'type': 'object',",
							"    'properties': {",
							"        'id'           :{'type':'number'},",
							"        'assigner'     :{'type':'number'},",
							"        'project_id'   :{'type':'number'},",
							"        'section_id'   :{'type':'number'},",
							"        'order'        :{'type':'number'},",
							"        'content'      :{'type':'string'},",
							"        'completed'    :{'type':'boolean'},",
							"        'label_ids'    :{'type':'array'},",
							"        'priority'     :{'type':'number'},",
							"        'comment_count':{'type':'number'},",
							"        'creator'      :{'type':'number'},",
							"        'created'      :{'type':'string'},",
							"        'due'          :{'type':'object',",
							"                         'properties': {",
							"                             'recurring': {'type':'boolean'},",
							"                             'string'   : {'type':'string'},",
							"                             'date'     : {'type':'string'},",
							"                             'datetime' : {'type':'string'},",
							"                             'timezone' : {'type':'string'},  ",
							"                            },",
							"                            'additionalProperties': false, ",
							"                            'required': ['recurring','string','date']",
							"                        },",
							"        'url'           :    {'type':'string'},                 ",
							"    },",
							"    'additionalProperties': false,",
							"    'required': [",
							"        'id', 'assigner', 'project_id', 'section_id', 'order', 'content', 'completed', 'label_ids', 'priority', 'comment_count', 'creator', 'created', 'due', 'url'",
							"    ]",
							"}",
							"pm.response.to.have.jsonSchema(schema)",
							"})",
							"// Positive Test - Response Time",
							"let milliseconds = parseInt(pm.environment.get('milliseconds'))",
							"pm.test(\"Test Response Time is < \"+milliseconds+\" ms\", () => {",
							"    pm.expect(pm.response.responseTime).to.be.below(milliseconds)",
							"})",
							"",
							"",
							"",
							"",
							"",
							""
						],
						"type": "text/javascript"
					}
				},
				{
					"listen": "prerequest",
					"script": {
						"exec": [
							""
						],
						"type": "text/javascript"
					}
				}
			],
			"request": {
				"method": "POST",
				"header": [
					{
						"key": "Content-Type",
						"value": "application/json",
						"type": "text"
					},
					{
						"key": "X-Requested-Id",
						"value": "$(uuidgen)",
						"type": "text"
					},
					{
						"key": "",
						"value": "",
						"type": "text",
						"disabled": true
					}
				],
				"body": {
					"mode": "raw",
					"raw": "{\n    \"content\": \"{{taskContent}}\", \n    \"due_string\": \"{{taskDueString}}\", \n    \"due_lang\": \"en\", \n    \"priority\": 4\n}"
				},
				"url": {
					"raw": "{{testTasksURL}}",
					"host": [
						"{{testTasksURL}}"
					]
				}
			},
			"response": []
		},
		{
			"name": "Active Task",
			"event": [
				{
					"listen": "test",
					"script": {
						"exec": [
							"// Positive Test - Status Code (200)",
							"pm.test(\"Status Code is 200\", () => pm.response.to.have.status(200))",
							"// Positive Test - Content",
							"pm.test(\"Content Positive Test\", () => {",
							"    let jsonData = pm.response.json()",
							"    let content  = pm.environment.get(\"taskContent\")",
							"    pm.expect(jsonData.content).to.eql(pm.environment.get(\"taskContent\"))",
							"})",
							"",
							"// Positive Test - JSON Schema (expected) - Also tests that we only get 1 result back by forcing the schema validation",
							"pm.test(\"Expected JSON Schema\", () => {",
							"const schema = {",
							"    'type': 'object',",
							"    'properties': {",
							"        'id'           :{'type':'number'},",
							"        'assigner'     :{'type':'number'},",
							"        'project_id'   :{'type':'number'},",
							"        'section_id'   :{'type':'number'},",
							"        'order'        :{'type':'number'},",
							"        'content'      :{'type':'string'},",
							"        'completed'    :{'type':'boolean'},",
							"        'label_ids'    :{'type':'array'},",
							"        'priority'     :{'type':'number'},",
							"        'comment_count':{'type':'number'},",
							"        'creator'      :{'type':'number'},",
							"        'created'      :{'type':'string'},",
							"        'due'          :{'type':'object',",
							"                         'properties': {",
							"                             'recurring': {'type':'boolean'},",
							"                             'string'   : {'type':'string'},",
							"                             'date'     : {'type':'string'},",
							"                             'datetime' : {'type':'string'},",
							"                             'timezone' : {'type':'string'},  ",
							"                            },",
							"                            'additionalProperties': false, ",
							"                            'required': ['recurring','string','date']",
							"                        },",
							"        'url'           :    {'type':'string'},                 ",
							"    },",
							"    'additionalProperties': false,",
							"    'required': [",
							"        'id', 'assigner', 'project_id', 'section_id', 'order', 'content', 'completed', 'label_ids', 'priority', 'comment_count', 'creator', 'created', 'due', 'url'",
							"    ]",
							"}",
							"pm.response.to.have.jsonSchema(schema)",
							"})",
							"",
							"// Positive Test - Response Time",
							"let milliseconds = parseInt(pm.environment.get('milliseconds'))",
							"pm.test(\"Test Response Time is < \"+milliseconds+\" ms\", () => ",
							"    pm.expect(pm.response.responseTime).to.be.below(milliseconds)",
							")",
							""
						],
						"type": "text/javascript"
					}
				},
				{
					"listen": "prerequest",
					"script": {
						"exec": [
							""
						],
						"type": "text/javascript"
					}
				}
			],
			"protocolProfileBehavior": {
				"disableBodyPruning": true
			},
			"request": {
				"method": "GET",
				"header": [
					{
						"key": "X-Requested-Id",
						"value": "$(uuidgen)",
						"type": "text",
						"disabled": true
					}
				],
				"body": {
					"mode": "raw",
					"raw": ""
				},
				"url": {
					"raw": "{{testTasksURL}}/{{task}}",
					"host": [
						"{{testTasksURL}}"
					],
					"path": [
						"{{task}}"
					]
				}
			},
			"response": []
		},
		{
			"name": "Update Task",
			"event": [
				{
					"listen": "prerequest",
					"script": {
						"exec": [
							""
						],
						"type": "text/javascript"
					}
				},
				{
					"listen": "test",
					"script": {
						"exec": [
							"",
							"// Positive Test - Status Code (204) - this is the only way to confirm the 'content' property got updated. Endpoint responds with empty body.",
							"pm.test(\"Test for 204 status\", () => pm.response.to.have.status(204))",
							"",
							"// Positive Test - Check for empty response",
							"pm.test(\"Test Empty Response\", ()=> pm.expect(pm.response.body).to.be.equals(undefined)",
							")",
							"// Positive Test - Response Header has Date",
							"pm.test(\"Response Header has 'Date'\", () => pm.response.to.have.header('Date'))",
							"",
							"// Positive Test - Response Time",
							"let milliseconds = parseInt(pm.environment.get(\"milliseconds\"))",
							"pm.test(\"Test Response Time is < \"+milliseconds+\" ms\", () =>",
							"    pm.expect(pm.response.responseTime).to.be.below(milliseconds)",
							")"
						],
						"type": "text/javascript"
					}
				}
			],
			"request": {
				"method": "POST",
				"header": [
					{
						"key": "Content-Type",
						"value": "application/json",
						"type": "text"
					},
					{
						"key": "X-Request-Id",
						"value": "{{$randomUUID}}",
						"type": "text"
					}
				],
				"body": {
					"mode": "raw",
					"raw": "{\n    \"content\": \"{{updateContentValue}}\"\n}"
				},
				"url": {
					"raw": "{{testTasksURL}}/{{task}}",
					"host": [
						"{{testTasksURL}}"
					],
					"path": [
						"{{task}}"
					]
				}
			},
			"response": []
		},
		{
			"name": "Close a Task - Change status to \"Complete\"",
			"event": [
				{
					"listen": "prerequest",
					"script": {
						"exec": [
							""
						],
						"type": "text/javascript"
					}
				},
				{
					"listen": "test",
					"script": {
						"exec": [
							"// **** Unable to test jsonSchema, content because endpoint responds with an empty body ****",
							"",
							"let milliseconds = parseInt(pm.environment.get(\"milliseconds\"))",
							"",
							"// Positive Test - Status Code (204)",
							"pm.test(\"Test for 204 status\", () => {",
							"    if (pm.response.to.have.status(204)){",
							"        // If we were able to \"close\" task change env variable status",
							"        pm.environment.set(\"taskStatus\", \"closed\")",
							"    }  ",
							"})",
							"",
							"// Positive Test - Check for empty response",
							"pm.test(\"Test Empty Response\", () => pm.expect(pm.response.body).to.be.equals(undefined))",
							"// Positive Test - Response Time",
							"pm.test(\"Test Response Time is < \"+milliseconds+\" ms\", () =>  ",
							"    pm.expect(pm.response.responseTime).to.be.below(milliseconds)",
							")"
						],
						"type": "text/javascript"
					}
				}
			],
			"request": {
				"method": "POST",
				"header": [],
				"body": {
					"mode": "raw",
					"raw": ""
				},
				"url": {
					"raw": "{{testTasksURL}}/{{task}}/close",
					"host": [
						"{{testTasksURL}}"
					],
					"path": [
						"{{task}}",
						"close"
					]
				}
			},
			"response": []
		},
		{
			"name": "Reopen a Task",
			"event": [
				{
					"listen": "prerequest",
					"script": {
						"exec": [
							""
						],
						"type": "text/javascript"
					}
				},
				{
					"listen": "test",
					"script": {
						"exec": [
							"// *** Unable to test jsonSchema, content because endpoint responds with an empty body ***",
							"",
							"let milliseconds = parseInt(pm.environment.get(\"milliseconds\"))",
							"",
							"// Positive Test - Status Code (204)",
							"pm.test(\"Test for 204 status\", () => {",
							"   if (pm.response.to.have.status(204)) ",
							"       // Update task Status",
							"       pm.environment.set(\"taskStatus\", \"open\")",
							"})",
							"",
							"// Positive Test - Check for empty response",
							"pm.test(\"Test Empty Response\", ()=> pm.expect(pm.response.body).to.be.equals(undefined))",
							"",
							"// Positive Test - Response Time",
							"pm.test(\"Test Response Time is < \"+milliseconds+\" ms\", () => ",
							"    pm.expect(pm.response.responseTime).to.be.below(milliseconds)",
							")"
						],
						"type": "text/javascript"
					}
				}
			],
			"request": {
				"method": "POST",
				"header": [
					{
						"key": "Content-Type",
						"value": "application/json",
						"type": "text",
						"disabled": true
					}
				],
				"body": {
					"mode": "raw",
					"raw": ""
				},
				"url": {
					"raw": "{{testTasksURL}}/{{task}}/reopen",
					"host": [
						"{{testTasksURL}}"
					],
					"path": [
						"{{task}}",
						"reopen"
					]
				}
			},
			"response": []
		},
		{
			"name": "Delete a Task",
			"event": [
				{
					"listen": "test",
					"script": {
						"exec": [
							"let milliseconds = parseInt(pm.environment.get(\"milliseconds\"))",
							"",
							"// Positive Test - Status Code (204)",
							"pm.test(\"Test for 204 status\", ()=>  pm.response.to.have.status(204))",
							"// Positive Test - Check for empty response",
							"pm.test(\"Test Empty Response\", ()=> ",
							"    pm.expect(pm.response.body).to.be.equals(undefined)",
							")",
							"// Positive Test - Response Time",
							"pm.test(\"Test Response Time is < \"+milliseconds+\" ms\", ()=> ",
							"    pm.expect(pm.response.responseTime).to.be.below(milliseconds)",
							")",
							""
						],
						"type": "text/javascript"
					}
				},
				{
					"listen": "prerequest",
					"script": {
						"exec": [
							""
						],
						"type": "text/javascript"
					}
				}
			],
			"request": {
				"method": "DELETE",
				"header": [],
				"body": {
					"mode": "raw",
					"raw": ""
				},
				"url": {
					"raw": "{{testTasksURL}}/{{task}}",
					"host": [
						"{{testTasksURL}}"
					],
					"path": [
						"{{task}}"
					]
				}
			},
			"response": []
		},
		{
			"name": "Delete ALL Tasks - Cleanup",
			"event": [
				{
					"listen": "test",
					"script": {
						"exec": [
							"    let bearerToken = \"Authorization: Bearer \"+pm.environment.get(\"bearerToken\")",
							"    let jsonData = pm.response.json()",
							"    const idArray = []",
							"    ",
							"    jsonData.forEach(function(value,index) { ",
							"        idArray.push(jsonData[index].id)",
							"    })",
							"    console.log(\"Number of Tasks to get deleted ->\", idArray.length)",
							"",
							"    for (let id of idArray) {",
							"    // Delete Request",
							"    let deleteURL = pm.environment.get(\"testTasksURL\")+\"/\"+id",
							"    console.log(\"Delete URL - \"+ deleteURL)",
							"    const deleteRequest = {",
							"        url: deleteURL,",
							"        method: 'DELETE',",
							"        header: bearerToken",
							"    }",
							"    pm.sendRequest(deleteRequest)",
							"    }",
							""
						],
						"type": "text/javascript"
					}
				}
			],
			"request": {
				"method": "GET",
				"header": [],
				"url": {
					"raw": "{{testTasksURL}}",
					"host": [
						"{{testTasksURL}}"
					]
				}
			},
			"response": []
		},
		{
			"name": "Create Multiple Tasks with predefined values in CSV - csvPostmanTaskData.csv",
			"event": [
				{
					"listen": "test",
					"script": {
						"exec": [
							"",
							"var jsonData = pm.response.json()",
							"var csvContentData  = pm.variables.get(\"csvContent\")",
							"",
							"console.log(\"Content = \"+csvContentData)",
							"",
							"pm.test(\"Test Task Content and Due String matches the values from CSV File\", ()=> {",
							"    pm.expect(jsonData.content).to.contains(csvContentData)",
							"})"
						],
						"type": "text/javascript"
					}
				}
			],
			"request": {
				"method": "POST",
				"header": [
					{
						"key": "Content-Type",
						"value": "application/json",
						"type": "text"
					},
					{
						"key": "X-Requested-Id",
						"value": "$(uuidgen)",
						"type": "text"
					}
				],
				"body": {
					"mode": "raw",
					"raw": "{\n    \"content\": \"{{csvContent}}\", \n    \"due_lang\": \"en\", \n    \"priority\": 4\n}",
					"options": {
						"raw": {
							"language": "json"
						}
					}
				},
				"url": {
					"raw": "{{testTasksURL}}",
					"host": [
						"{{testTasksURL}}"
					]
				}
			},
			"response": []
		}
	],
	"auth": {
		"type": "bearer",
		"bearer": [
			{
				"key": "token",
				"value": "{{bearerToken}}",
				"type": "string"
			}
		]
	},
	"event": [
		{
			"listen": "prerequest",
			"script": {
				"type": "text/javascript",
				"exec": [
					""
				]
			}
		},
		{
			"listen": "test",
			"script": {
				"type": "text/javascript",
				"exec": [
					""
				]
			}
		}
	]
}