{
	"_id": "618f192e820c19759de840ea",
	"userId": "507f1f77bcf86cd799439011",
	"courseId": "507f191e810c19729de860ea",
	"isPaid": true,
	"paymentMethod": "cash",
	"dateOfPayment": "2020-03-10T15:00:00.00Z"
	
}