time,quant
0,9
1,10
2,8
3,13
4,11
5,12
6,8
7,7
8,12
9,11
10,12
11,17
12,10
13,11
14,10
15,15
16,12
17,12
18,9
19,7
20,13
21,12
22,15
23,18
24,11
25,12
26,11
27,16
28,13
29,15
30,9
31,8
32,15
33,14
34,15
35,20
36,13
37,13
38,13
39,19
40,15
41,17
42,10
43,8
44,16
45,16
46,17
47,23
