{
  "MAPF": "CBS",
  "SAPF": "TDSP",
  "costFunction": "SIC",
  "heuristic": "",
  "nAgents": 20,
  "nNodes": 40,
  "connect": [
    [      1,      1,      0,      0,      0,      0,      0,      0,      0,      0,      1,      0,      0,      0,      0,      0,      0,      0,      0,      0,      0,      0,      0,      0,      0,      0,      0,      0,      0,      0,      0,      0,      0,      0,      0,      0,      0,      0,      0,      0    ],
    [      1,      1,      1,      0,      0,      0,      0,      0,      0,      0,      0,      0,      0,      0,      0,      0,      0,      0,      0,      0,      0,      0,      0,      0,      0,      0,      0,      0,      0,      0,      0,      0,      0,      0,      0,      0,      0,      0,      0,      0    ],
    [      0,      1,      1,      1,      0,      0,      0,      0,      0,      0,      0,      0,      0,      0,      0,      0,      0,      0,      0,      0,      0,      0,      0,      0,      0,      0,      0,      0,      0,      0,      0,      0,      0,      0,      0,      0,      0,      0,      0,      0    ],
    [      0,      0,      1,      1,      1,      0,      0,      0,      0,      0,      0,      0,      0,      0,      0,      0,      0,      0,      0,      0,      0,      0,      0,      0,      0,      0,      0,      0,      0,      0,      0,      0,      0,      0,      0,      0,      0,      0,      0,      0    ],
    [      0,      0,      0,      1,      1,      1,      0,      0,      0,      0,      0,      0,      0,      0,      0,      0,      0,      0,      0,      0,      0,      0,      0,      0,      0,      0,      0,      0,      0,      0,      0,      0,      0,      0,      0,      0,      0,      0,      0,      0    ],
    [      0,      0,      0,      0,      1,      1,      1,      0,      0,      0,      0,      0,      0,      0,      0,      0,      0,      0,      0,      0,      0,      0,      0,      0,      0,      0,      0,      0,      0,      0,      0,      0,      0,      0,      0,      0,      0,      0,      0,      0    ],
    [      0,      0,      0,      0,      0,      1,      1,      1,      0,      0,      0,      0,      0,      0,      0,      0,      0,      0,      0,      0,      0,      0,      0,      0,      0,      0,      0,      0,      0,      0,      0,      0,      0,      0,      0,      0,      0,      0,      0,      0    ],
    [      0,      0,      0,      0,      0,      0,      1,      1,      1,      0,      0,      0,      0,      0,      0,      0,      0,      0,      0,      0,      0,      0,      0,      0,      0,      0,      0,      0,      0,      0,      0,      0,      0,      0,      0,      0,      0,      0,      0,      0    ],
    [      0,      0,      0,      0,      0,      0,      0,      1,      1,      10,      0,      0,      0,      0,      0,      0,      0,      0,      0,      0,      0,      0,      0,      0,      0,      0,      0,      0,      0,      0,      0,      0,      0,      0,      0,      0,      0,      0,      0,      0    ],
    [      0,      0,      0,      0,      0,      0,      0,      0,      10,      1,      0,      0,      0,      0,      0,      0,      0,      0,      0,      1,      0,      0,      0,      0,      0,      0,      0,      0,      0,      0,      0,      0,      0,      0,      0,      0,      0,      0,      0,      0    ],
    [      1,      0,      0,      0,      0,      0,      0,      0,      0,      0,      1,      1,      0,      0,      0,      0,      0,      0,      0,      0,      1,      0,      0,      0,      0,      0,      0,      0,      0,      0,      0,      0,      0,      0,      0,      0,      0,      0,      0,      0    ],
    [      0,      0,      0,      0,      0,      0,      0,      0,      0,      0,      1,      1,      1,      0,      0,      0,      0,      0,      0,      0,      0,      0,      0,      0,      0,      0,      0,      0,      0,      0,      0,      0,      0,      0,      0,      0,      0,      0,      0,      0    ],
    [      0,      0,      0,      0,      0,      0,      0,      0,      0,      0,      0,      1,      1,      1,      0,      0,      0,      0,      0,      0,      0,      0,      0,      0,      0,      0,      0,      0,      0,      0,      0,      0,      0,      0,      0,      0,      0,      0,      0,      0    ],
    [      0,      0,      0,      0,      0,      0,      0,      0,      0,      0,      0,      0,      1,      1,      1,      0,      0,      0,      0,      0,      0,      0,      0,      0,      0,      0,      0,      0,      0,      0,      0,      0,      0,      0,      0,      0,      0,      0,      0,      0    ],
    [      0,      0,      0,      0,      0,      0,      0,      0,      0,      0,      0,      0,      0,      1,      1,      1,      0,      0,      0,      0,      0,      0,      0,      0,      0,      0,      0,      0,      0,      0,      0,      0,      0,      0,      0,      0,      0,      0,      0,      0    ],
    [      0,      0,      0,      0,      0,      0,      0,      0,      0,      0,      0,      0,      0,      0,      1,      1,      1,      0,      0,      0,      0,      0,      0,      0,      0,      0,      0,      0,      0,      0,      0,      0,      0,      0,      0,      0,      0,      0,      0,      0    ],
    [      0,      0,      0,      0,      0,      0,      0,      0,      0,      0,      0,      0,      0,      0,      0,      1,      1,      1,      0,      0,      0,      0,      0,      0,      0,      0,      0,      0,      0,      0,      0,      0,      0,      0,      0,      0,      0,      0,      0,      0    ],
    [      0,      0,      0,      0,      0,      0,      0,      0,      0,      0,      0,      0,      0,      0,      0,      0,      1,      1,      1,      0,      0,      0,      0,      0,      0,      0,      0,      0,      0,      0,      0,      0,      0,      0,      0,      0,      0,      0,      0,      0    ],
    [      0,      0,      0,      0,      0,      0,      0,      0,      0,      0,      0,      0,      0,      0,      0,      0,      0,      1,      1,      10,      0,      0,      0,      0,      0,      0,      0,      0,      0,      0,      0,      0,      0,      0,      0,      0,      0,      0,      0,      0    ],
    [      0,      0,      0,      0,      0,      0,      0,      0,      0,      1,      0,      0,      0,      0,      0,      0,      0,      0,      10,      1,      0,      0,      0,      0,      0,      0,      0,      0,      0,      1,      0,      0,      0,      0,      0,      0,      0,      0,      0,      0    ],
    [      0,      0,      0,      0,      0,      0,      0,      0,      0,      0,      1,      0,      0,      0,      0,      0,      0,      0,      0,      0,      1,      1,      0,      0,      0,      0,      0,      0,      0,      0,      1,      0,      0,      0,      0,      0,      0,      0,      0,      0    ],
    [      0,      0,      0,      0,      0,      0,      0,      0,      0,      0,      0,      0,      0,      0,      0,      0,      0,      0,      0,      0,      1,      1,      1,      0,      0,      0,      0,      0,      0,      0,      0,      0,      0,      0,      0,      0,      0,      0,      0,      0    ],
    [      0,      0,      0,      0,      0,      0,      0,      0,      0,      0,      0,      0,      0,      0,      0,      0,      0,      0,      0,      0,      0,      1,      1,      1,      0,      0,      0,      0,      0,      0,      0,      0,      0,      0,      0,      0,      0,      0,      0,      0    ],
    [      0,      0,      0,      0,      0,      0,      0,      0,      0,      0,      0,      0,      0,      0,      0,      0,      0,      0,      0,      0,      0,      0,      1,      1,      1,      0,      0,      0,      0,      0,      0,      0,      0,      0,      0,      0,      0,      0,      0,      0    ],
    [      0,      0,      0,      0,      0,      0,      0,      0,      0,      0,      0,      0,      0,      0,      0,      0,      0,      0,      0,      0,      0,      0,      0,      1,      1,      1,      0,      0,      0,      0,      0,      0,      0,      0,      0,      0,      0,      0,      0,      0    ],
    [      0,      0,      0,      0,      0,      0,      0,      0,      0,      0,      0,      0,      0,      0,      0,      0,      0,      0,      0,      0,      0,      0,      0,      0,      1,      1,      1,      0,      0,      0,      0,      0,      0,      0,      0,      0,      0,      0,      0,      0    ],
    [      0,      0,      0,      0,      0,      0,      0,      0,      0,      0,      0,      0,      0,      0,      0,      0,      0,      0,      0,      0,      0,      0,      0,      0,      0,      1,      1,      1,      0,      0,      0,      0,      0,      0,      0,      0,      0,      0,      0,      0    ],
    [      0,      0,      0,      0,      0,      0,      0,      0,      0,      0,      0,      0,      0,      0,      0,      0,      0,      0,      0,      0,      0,      0,      0,      0,      0,      0,      1,      1,      1,      0,      0,      0,      0,      0,      0,      0,      0,      0,      0,      0    ],
    [      0,      0,      0,      0,      0,      0,      0,      0,      0,      0,      0,      0,      0,      0,      0,      0,      0,      0,      0,      0,      0,      0,      0,      0,      0,      0,      0,      1,      1,      10,      0,      0,      0,      0,      0,      0,      0,      0,      0,      0    ],
    [      0,      0,      0,      0,      0,      0,      0,      0,      0,      0,      0,      0,      0,      0,      0,      0,      0,      0,      0,      1,      0,      0,      0,      0,      0,      0,      0,      0,      10,      1,      0,      0,      0,      0,      0,      0,      0,      0,      0,      1    ],
    [      0,      0,      0,      0,      0,      0,      0,      0,      0,      0,      0,      0,      0,      0,      0,      0,      0,      0,      0,      0,      1,      0,      0,      0,      0,      0,      0,      0,      0,      0,      1,      1,      0,      0,      0,      0,      0,      0,      0,      0    ],
    [      0,      0,      0,      0,      0,      0,      0,      0,      0,      0,      0,      0,      0,      0,      0,      0,      0,      0,      0,      0,      0,      0,      0,      0,      0,      0,      0,      0,      0,      0,      1,      1,      1,      0,      0,      0,      0,      0,      0,      0    ],
    [      0,      0,      0,      0,      0,      0,      0,      0,      0,      0,      0,      0,      0,      0,      0,      0,      0,      0,      0,      0,      0,      0,      0,      0,      0,      0,      0,      0,      0,      0,      0,      1,      1,      1,      0,      0,      0,      0,      0,      0    ],
    [      0,      0,      0,      0,      0,      0,      0,      0,      0,      0,      0,      0,      0,      0,      0,      0,      0,      0,      0,      0,      0,      0,      0,      0,      0,      0,      0,      0,      0,      0,      0,      0,      1,      1,      1,      0,      0,      0,      0,      0    ],
    [      0,      0,      0,      0,      0,      0,      0,      0,      0,      0,      0,      0,      0,      0,      0,      0,      0,      0,      0,      0,      0,      0,      0,      0,      0,      0,      0,      0,      0,      0,      0,      0,      0,      1,      1,      1,      0,      0,      0,      0    ],
    [      0,      0,      0,      0,      0,      0,      0,      0,      0,      0,      0,      0,      0,      0,      0,      0,      0,      0,      0,      0,      0,      0,      0,      0,      0,      0,      0,      0,      0,      0,      0,      0,      0,      0,      1,      1,      1,      0,      0,      0    ],
    [      0,      0,      0,      0,      0,      0,      0,      0,      0,      0,      0,      0,      0,      0,      0,      0,      0,      0,      0,      0,      0,      0,      0,      0,      0,      0,      0,      0,      0,      0,      0,      0,      0,      0,      0,      1,      1,      1,      0,      0    ],
    [      0,      0,      0,      0,      0,      0,      0,      0,      0,      0,      0,      0,      0,      0,      0,      0,      0,      0,      0,      0,      0,      0,      0,      0,      0,      0,      0,      0,      0,      0,      0,      0,      0,      0,      0,      0,      1,      1,      1,      0    ],
    [      0,      0,      0,      0,      0,      0,      0,      0,      0,      0,      0,      0,      0,      0,      0,      0,      0,      0,      0,      0,      0,      0,      0,      0,      0,      0,      0,      0,      0,      0,      0,      0,      0,      0,      0,      0,      0,      1,      1,      10    ],
    [      0,      0,      0,      0,      0,      0,      0,      0,      0,      0,      0,      0,      0,      0,      0,      0,      0,      0,      0,      0,      0,      0,      0,      0,      0,      0,      0,      0,      0,      1,      0,      0,      0,      0,      0,      0,      0,      0,      10,      1    ]
  ],
  "nodes": [
    [      1713,      17,      13,      0    ],
    [      1714,      17,      14,      1    ],
    [      1715,      17,      15,      2    ],
    [      1716,      17,      16,      3    ],
    [      1717,      17,      17,      4    ],
    [      1718,      17,      18,      5    ],
    [      1719,      17,      19,      6    ],
    [      1720,      17,      20,      7    ],
    [      1721,      17,      21,      8    ],
    [      1722,      17,      22,      9    ],
    [      1813,      18,      13,      10    ],
    [      1814,      18,      14,      11    ],
    [      1815,      18,      15,      12    ],
    [      1816,      18,      16,      13    ],
    [      1817,      18,      17,      14    ],
    [      1818,      18,      18,      15    ],
    [      1819,      18,      19,      16    ],
    [      1820,      18,      20,      17    ],
    [      1821,      18,      21,      18    ],
    [      1822,      18,      22,      19    ],
    [      1913,      19,      13,      20    ],
    [      1914,      19,      14,      21    ],
    [      1915,      19,      15,      22    ],
    [      1916,      19,      16,      23    ],
    [      1917,      19,      17,      24    ],
    [      1918,      19,      18,      25    ],
    [      1919,      19,      19,      26    ],
    [      1920,      19,      20,      27    ],
    [      1921,      19,      21,      28    ],
    [      1922,      19,      22,      29    ],
    [      2013,      20,      13,      30    ],
    [      2014,      20,      14,      31    ],
    [      2015,      20,      15,      32    ],
    [      2016,      20,      16,      33    ],
    [      2017,      20,      17,      34    ],
    [      2018,      20,      18,      35    ],
    [      2019,      20,      19,      36    ],
    [      2020,      20,      20,      37    ],
    [      2021,      20,      21,      38    ],
    [      2022,      20,      22,      39    ]
  ],
  "agents": [    {
      "ID": 0,
      "initPos": [        1920,        19,        20,        27      ],
      "endPos": [        1713,        17,        13,        0      ],
      "goalPos": [
        [          1822,          18,          22,          19        ],
        [          1722,          17,          22,          9        ],
        [          1717,          17,          17,          4        ],
        [          1822,          18,          22,          19        ],
        [          1813,          18,          13,          10        ]
      ]
    },
    {
      "ID": 1,
      "initPos": [        1820,        18,        20,        17      ],
      "endPos": [        1718,        17,        18,        5      ],
      "goalPos": [
        [          2014,          20,          14,          31        ],
        [          1815,          18,          15,          12        ],
        [          1819,          18,          19,          16        ],
        [          1920,          19,          20,          27        ],
        [          1819,          18,          19,          16        ]
      ]
    },
    {
      "ID": 2,
      "initPos": [        1815,        18,        15,        12      ],
      "endPos": [        1719,        17,        19,        6      ],
      "goalPos": [
        [          1721,          17,          21,          8        ],
        [          1717,          17,          17,          4        ],
        [          1920,          19,          20,          27        ],
        [          1915,          19,          15,          22        ],
        [          2017,          20,          17,          34        ]
      ]
    },
    {
      "ID": 3,
      "initPos": [        1717,        17,        17,        4      ],
      "endPos": [        1715,        17,        15,        2      ],
      "goalPos": [
        [          1816,          18,          16,          13        ],
        [          1920,          19,          20,          27        ],
        [          1717,          17,          17,          4        ],
        [          1816,          18,          16,          13        ],
        [          1813,          18,          13,          10        ]
      ]
    },
    {
      "ID": 4,
      "initPos": [        1915,        19,        15,        22      ],
      "endPos": [        1817,        18,        17,        14      ],
      "goalPos": [
        [          1815,          18,          15,          12        ],
        [          1717,          17,          17,          4        ],
        [          1815,          18,          15,          12        ],
        [          1921,          19,          21,          28        ],
        [          2013,          20,          13,          30        ]
      ]
    },
    {
      "ID": 5,
      "initPos": [        1919,        19,        19,        26      ],
      "endPos": [        1917,        19,        17,        24      ],
      "goalPos": [
        [          2013,          20,          13,          30        ],
        [          1919,          19,          19,          26        ],
        [          1915,          19,          15,          22        ],
        [          1816,          18,          16,          13        ],
        [          2022,          20,          22,          39        ]
      ]
    },
    {
      "ID": 6,
      "initPos": [        1822,        18,        22,        19      ],
      "endPos": [        1821,        18,        21,        18      ],
      "goalPos": [
        [          1820,          18,          20,          17        ],
        [          1717,          17,          17,          4        ],
        [          2020,          20,          20,          37        ],
        [          1716,          17,          16,          3        ],
        [          1819,          18,          19,          16        ]
      ]
    },
    {
      "ID": 7,
      "initPos": [        1716,        17,        16,        3      ],
      "endPos": [        2016,        20,        16,        33      ],
      "goalPos": [
        [          1813,          18,          13,          10        ],
        [          1820,          18,          20,          17        ],
        [          2020,          20,          20,          37        ],
        [          2022,          20,          22,          39        ],
        [          1820,          18,          20,          17        ]
      ]
    },
    {
      "ID": 8,
      "initPos": [        1721,        17,        21,        8      ],
      "endPos": [        1818,        18,        18,        15      ],
      "goalPos": [
        [          1716,          17,          16,          3        ],
        [          2020,          20,          20,          37        ],
        [          1819,          18,          19,          16        ],
        [          1816,          18,          16,          13        ],
        [          1822,          18,          22,          19        ]
      ]
    },
    {
      "ID": 9,
      "initPos": [        2022,        20,        22,        39      ],
      "endPos": [        1918,        19,        18,        25      ],
      "goalPos": [
        [          1722,          17,          22,          9        ],
        [          1721,          17,          21,          8        ],
        [          2013,          20,          13,          30        ],
        [          1822,          18,          22,          19        ],
        [          1717,          17,          17,          4        ]
      ]
    },
    {
      "ID": 10,
      "initPos": [        1813,        18,        13,        10      ],
      "endPos": [        1916,        19,        16,        23      ],
      "goalPos": [
        [          1919,          19,          19,          26        ],
        [          1822,          18,          22,          19        ],
        [          1915,          19,          15,          22        ],
        [          1716,          17,          16,          3        ],
        [          1717,          17,          17,          4        ]
      ]
    },
    {
      "ID": 11,
      "initPos": [        2017,        20,        17,        34      ],
      "endPos": [        1913,        19,        13,        20      ],
      "goalPos": [
        [          1815,          18,          15,          12        ],
        [          1822,          18,          22,          19        ],
        [          1816,          18,          16,          13        ],
        [          1716,          17,          16,          3        ],
        [          1815,          18,          15,          12        ]
      ]
    },
    {
      "ID": 12,
      "initPos": [        1722,        17,        22,        9      ],
      "endPos": [        1814,        18,        14,        11      ],
      "goalPos": [
        [          2020,          20,          20,          37        ],
        [          1820,          18,          20,          17        ],
        [          1716,          17,          16,          3        ],
        [          2013,          20,          13,          30        ],
        [          1722,          17,          22,          9        ]
      ]
    },
    {
      "ID": 13,
      "initPos": [        2013,        20,        13,        30      ],
      "endPos": [        2021,        20,        21,        38      ],
      "goalPos": [
        [          1716,          17,          16,          3        ],
        [          1921,          19,          21,          28        ],
        [          2014,          20,          14,          31        ],
        [          1920,          19,          20,          27        ],
        [          1915,          19,          15,          22        ]
      ]
    },
    {
      "ID": 14,
      "initPos": [        2014,        20,        14,        31      ],
      "endPos": [        1922,        19,        22,        29      ],
      "goalPos": [
        [          1920,          19,          20,          27        ],
        [          2019,          20,          19,          36        ],
        [          2017,          20,          17,          34        ],
        [          2014,          20,          14,          31        ],
        [          1919,          19,          19,          26        ]
      ]
    },
    {
      "ID": 15,
      "initPos": [        1819,        18,        19,        16      ],
      "endPos": [        1714,        17,        14,        1      ],
      "goalPos": [
        [          2014,          20,          14,          31        ],
        [          1822,          18,          22,          19        ],
        [          2017,          20,          17,          34        ],
        [          1815,          18,          15,          12        ],
        [          1820,          18,          20,          17        ]
      ]
    },
    {
      "ID": 16,
      "initPos": [        2020,        20,        20,        37      ],
      "endPos": [        2015,        20,        15,        32      ],
      "goalPos": [
        [          1722,          17,          22,          9        ],
        [          1816,          18,          16,          13        ],
        [          1915,          19,          15,          22        ],
        [          1820,          18,          20,          17        ],
        [          2013,          20,          13,          30        ]
      ]
    },
    {
      "ID": 17,
      "initPos": [        2019,        20,        19,        36      ],
      "endPos": [        2018,        20,        18,        35      ],
      "goalPos": [
        [          1722,          17,          22,          9        ],
        [          2022,          20,          22,          39        ],
        [          2020,          20,          20,          37        ],
        [          1721,          17,          21,          8        ],
        [          1717,          17,          17,          4        ]
      ]
    },
    {
      "ID": 18,
      "initPos": [        1921,        19,        21,        28      ],
      "endPos": [        1914,        19,        14,        21      ],
      "goalPos": [
        [          1721,          17,          21,          8        ],
        [          1920,          19,          20,          27        ],
        [          1816,          18,          16,          13        ],
        [          2013,          20,          13,          30        ],
        [          1716,          17,          16,          3        ]
      ]
    },
    {
      "ID": 19,
      "initPos": [        1816,        18,        16,        13      ],
      "endPos": [        1720,        17,        20,        7      ],
      "goalPos": [
        [          1919,          19,          19,          26        ],
        [          1915,          19,          15,          22        ],
        [          1920,          19,          20,          27        ],
        [          2019,          20,          19,          36        ],
        [          1820,          18,          20,          17        ]
      ]
    }
  ]
}