{
  "MAPF": "CBS",
  "SAPF": "TDSP",
  "costFunction": "SIC",
  "heuristic": "",
  "nAgents": 20,
  "nNodes": 29,
  "connect": [
    [      1,      1,      0,      0,      0,      0,      0,      0,      0,      0,      1,      0,      0,      0,      0,      0,      0,      0,      0,      0,      0,      0,      0,      0,      0,      0,      0,      0,      0    ],
    [      1,      1,      1,      0,      0,      0,      0,      0,      0,      0,      0,      0,      0,      0,      0,      0,      0,      0,      0,      0,      0,      0,      0,      0,      0,      0,      0,      0,      0    ],
    [      0,      1,      1,      1,      0,      0,      0,      0,      0,      0,      0,      0,      0,      0,      0,      0,      0,      0,      0,      0,      0,      0,      0,      0,      0,      0,      0,      0,      0    ],
    [      0,      0,      1,      1,      1,      0,      0,      0,      0,      0,      0,      0,      0,      0,      0,      0,      0,      0,      0,      0,      0,      0,      0,      0,      0,      0,      0,      0,      0    ],
    [      0,      0,      0,      1,      1,      1,      0,      0,      0,      0,      0,      0,      0,      0,      0,      0,      0,      0,      0,      0,      0,      0,      0,      0,      0,      0,      0,      0,      0    ],
    [      0,      0,      0,      0,      1,      1,      1,      0,      0,      0,      0,      0,      0,      0,      0,      0,      0,      0,      0,      0,      0,      0,      0,      0,      0,      0,      0,      0,      0    ],
    [      0,      0,      0,      0,      0,      1,      1,      1,      0,      0,      0,      0,      0,      0,      0,      0,      0,      0,      0,      0,      0,      0,      0,      0,      0,      0,      0,      0,      0    ],
    [      0,      0,      0,      0,      0,      0,      1,      1,      1,      0,      0,      0,      0,      0,      0,      0,      0,      0,      0,      0,      0,      0,      0,      0,      0,      0,      0,      0,      0    ],
    [      0,      0,      0,      0,      0,      0,      0,      1,      1,      10,      0,      0,      0,      0,      0,      0,      0,      0,      0,      0,      0,      0,      0,      0,      0,      0,      0,      0,      0    ],
    [      0,      0,      0,      0,      0,      0,      0,      0,      10,      1,      0,      0,      0,      0,      0,      0,      0,      0,      0,      1,      0,      0,      0,      0,      0,      0,      0,      0,      0    ],
    [      1,      0,      0,      0,      0,      0,      0,      0,      0,      0,      1,      1,      0,      0,      0,      0,      0,      0,      0,      0,      1,      0,      0,      0,      0,      0,      0,      0,      0    ],
    [      0,      0,      0,      0,      0,      0,      0,      0,      0,      0,      1,      1,      1,      0,      0,      0,      0,      0,      0,      0,      0,      0,      0,      0,      0,      0,      0,      0,      0    ],
    [      0,      0,      0,      0,      0,      0,      0,      0,      0,      0,      0,      1,      1,      1,      0,      0,      0,      0,      0,      0,      0,      0,      0,      0,      0,      0,      0,      0,      0    ],
    [      0,      0,      0,      0,      0,      0,      0,      0,      0,      0,      0,      0,      1,      1,      1,      0,      0,      0,      0,      0,      0,      0,      0,      0,      0,      0,      0,      0,      0    ],
    [      0,      0,      0,      0,      0,      0,      0,      0,      0,      0,      0,      0,      0,      1,      1,      1,      0,      0,      0,      0,      0,      0,      0,      0,      0,      0,      0,      0,      0    ],
    [      0,      0,      0,      0,      0,      0,      0,      0,      0,      0,      0,      0,      0,      0,      1,      1,      1,      0,      0,      0,      0,      0,      0,      0,      0,      0,      0,      0,      0    ],
    [      0,      0,      0,      0,      0,      0,      0,      0,      0,      0,      0,      0,      0,      0,      0,      1,      1,      1,      0,      0,      0,      0,      0,      0,      0,      0,      0,      0,      0    ],
    [      0,      0,      0,      0,      0,      0,      0,      0,      0,      0,      0,      0,      0,      0,      0,      0,      1,      1,      1,      0,      0,      0,      0,      0,      0,      0,      0,      0,      0    ],
    [      0,      0,      0,      0,      0,      0,      0,      0,      0,      0,      0,      0,      0,      0,      0,      0,      0,      1,      1,      10,      0,      0,      0,      0,      0,      0,      0,      0,      0    ],
    [      0,      0,      0,      0,      0,      0,      0,      0,      0,      1,      0,      0,      0,      0,      0,      0,      0,      0,      10,      1,      0,      0,      0,      0,      0,      0,      0,      0,      0    ],
    [      0,      0,      0,      0,      0,      0,      0,      0,      0,      0,      1,      0,      0,      0,      0,      0,      0,      0,      0,      0,      1,      1,      0,      0,      0,      0,      0,      0,      0    ],
    [      0,      0,      0,      0,      0,      0,      0,      0,      0,      0,      0,      0,      0,      0,      0,      0,      0,      0,      0,      0,      1,      1,      1,      0,      0,      0,      0,      0,      0    ],
    [      0,      0,      0,      0,      0,      0,      0,      0,      0,      0,      0,      0,      0,      0,      0,      0,      0,      0,      0,      0,      0,      1,      1,      1,      0,      0,      0,      0,      0    ],
    [      0,      0,      0,      0,      0,      0,      0,      0,      0,      0,      0,      0,      0,      0,      0,      0,      0,      0,      0,      0,      0,      0,      1,      1,      1,      0,      0,      0,      0    ],
    [      0,      0,      0,      0,      0,      0,      0,      0,      0,      0,      0,      0,      0,      0,      0,      0,      0,      0,      0,      0,      0,      0,      0,      1,      1,      1,      0,      0,      0    ],
    [      0,      0,      0,      0,      0,      0,      0,      0,      0,      0,      0,      0,      0,      0,      0,      0,      0,      0,      0,      0,      0,      0,      0,      0,      1,      1,      1,      0,      0    ],
    [      0,      0,      0,      0,      0,      0,      0,      0,      0,      0,      0,      0,      0,      0,      0,      0,      0,      0,      0,      0,      0,      0,      0,      0,      0,      1,      1,      1,      0    ],
    [      0,      0,      0,      0,      0,      0,      0,      0,      0,      0,      0,      0,      0,      0,      0,      0,      0,      0,      0,      0,      0,      0,      0,      0,      0,      0,      1,      1,      1    ],
    [      0,      0,      0,      0,      0,      0,      0,      0,      0,      0,      0,      0,      0,      0,      0,      0,      0,      0,      0,      0,      0,      0,      0,      0,      0,      0,      0,      1,      1    ]
  ],
  "nodes": [
    [      2113,      21,      13,      0    ],
    [      2114,      21,      14,      1    ],
    [      2115,      21,      15,      2    ],
    [      2116,      21,      16,      3    ],
    [      2117,      21,      17,      4    ],
    [      2118,      21,      18,      5    ],
    [      2119,      21,      19,      6    ],
    [      2120,      21,      20,      7    ],
    [      2121,      21,      21,      8    ],
    [      2122,      21,      22,      9    ],
    [      2213,      22,      13,      10    ],
    [      2214,      22,      14,      11    ],
    [      2215,      22,      15,      12    ],
    [      2216,      22,      16,      13    ],
    [      2217,      22,      17,      14    ],
    [      2218,      22,      18,      15    ],
    [      2219,      22,      19,      16    ],
    [      2220,      22,      20,      17    ],
    [      2221,      22,      21,      18    ],
    [      2222,      22,      22,      19    ],
    [      2313,      23,      13,      20    ],
    [      2314,      23,      14,      21    ],
    [      2315,      23,      15,      22    ],
    [      2316,      23,      16,      23    ],
    [      2317,      23,      17,      24    ],
    [      2318,      23,      18,      25    ],
    [      2319,      23,      19,      26    ],
    [      2320,      23,      20,      27    ],
    [      2321,      23,      21,      28    ]
  ],
  "agents": [    {
      "ID": 0,
      "initPos": [        2221,        22,        21,        18      ],
      "endPos": [        2221,        22,        21,        18      ],
      "goalPos": [
        [          2217,          22,          17,          14        ],
        [          2118,          21,          18,          5        ]
      ]
    },
    {
      "ID": 1,
      "initPos": [        2120,        21,        20,        7      ],
      "endPos": [        2120,        21,        20,        7      ],
      "goalPos": [
        [          2216,          22,          16,          13        ],
        [          2119,          21,          19,          6        ]
      ]
    },
    {
      "ID": 2,
      "initPos": [        2220,        22,        20,        17      ],
      "endPos": [        2220,        22,        20,        17      ],
      "goalPos": [
        [          2118,          21,          18,          5        ],
        [          2217,          22,          17,          14        ]
      ]
    },
    {
      "ID": 3,
      "initPos": [        2113,        21,        13,        0      ],
      "endPos": [        2113,        21,        13,        0      ],
      "goalPos": [
        [          2121,          21,          21,          8        ],
        [          2217,          22,          17,          14        ]
      ]
    },
    {
      "ID": 4,
      "initPos": [        2115,        21,        15,        2      ],
      "endPos": [        2115,        21,        15,        2      ],
      "goalPos": [
        [          2216,          22,          16,          13        ],
        [          2320,          23,          20,          27        ]
      ]
    },
    {
      "ID": 5,
      "initPos": [        2319,        23,        19,        26      ],
      "endPos": [        2319,        23,        19,        26      ],
      "goalPos": [
        [          2118,          21,          18,          5        ],
        [          2321,          23,          21,          28        ]
      ]
    },
    {
      "ID": 6,
      "initPos": [        2318,        23,        18,        25      ],
      "endPos": [        2318,        23,        18,        25      ],
      "goalPos": [
        [          2217,          22,          17,          14        ],
        [          2121,          21,          21,          8        ]
      ]
    },
    {
      "ID": 7,
      "initPos": [        2317,        23,        17,        24      ],
      "endPos": [        2317,        23,        17,        24      ],
      "goalPos": [
        [          2217,          22,          17,          14        ],
        [          2314,          23,          14,          21        ]
      ]
    },
    {
      "ID": 8,
      "initPos": [        2313,        23,        13,        20      ],
      "endPos": [        2313,        23,        13,        20      ],
      "goalPos": [
        [          2216,          22,          16,          13        ],
        [          2316,          23,          16,          23        ]
      ]
    },
    {
      "ID": 9,
      "initPos": [        2117,        21,        17,        4      ],
      "endPos": [        2117,        21,        17,        4      ],
      "goalPos": [
        [          2320,          23,          20,          27        ],
        [          2118,          21,          18,          5        ]
      ]
    },
    {
      "ID": 10,
      "initPos": [        2219,        22,        19,        16      ],
      "endPos": [        2219,        22,        19,        16      ],
      "goalPos": [
        [          2217,          22,          17,          14        ],
        [          2321,          23,          21,          28        ]
      ]
    },
    {
      "ID": 11,
      "initPos": [        2214,        22,        14,        11      ],
      "endPos": [        2214,        22,        14,        11      ],
      "goalPos": [
        [          2217,          22,          17,          14        ],
        [          2321,          23,          21,          28        ]
      ]
    },
    {
      "ID": 12,
      "initPos": [        2218,        22,        18,        15      ],
      "endPos": [        2218,        22,        18,        15      ],
      "goalPos": [
        [          2119,          21,          19,          6        ],
        [          2316,          23,          16,          23        ]
      ]
    },
    {
      "ID": 13,
      "initPos": [        2114,        21,        14,        1      ],
      "endPos": [        2114,        21,        14,        1      ],
      "goalPos": [
        [          2217,          22,          17,          14        ],
        [          2316,          23,          16,          23        ]
      ]
    },
    {
      "ID": 14,
      "initPos": [        2222,        22,        22,        19      ],
      "endPos": [        2222,        22,        22,        19      ],
      "goalPos": [
        [          2118,          21,          18,          5        ],
        [          2121,          21,          21,          8        ]
      ]
    },
    {
      "ID": 15,
      "initPos": [        2213,        22,        13,        10      ],
      "endPos": [        2213,        22,        13,        10      ],
      "goalPos": [
        [          2118,          21,          18,          5        ],
        [          2217,          22,          17,          14        ]
      ]
    },
    {
      "ID": 16,
      "initPos": [        2315,        23,        15,        22      ],
      "endPos": [        2315,        23,        15,        22      ],
      "goalPos": [
        [          2320,          23,          20,          27        ],
        [          2321,          23,          21,          28        ]
      ]
    },
    {
      "ID": 17,
      "initPos": [        2215,        22,        15,        12      ],
      "endPos": [        2215,        22,        15,        12      ],
      "goalPos": [
        [          2119,          21,          19,          6        ],
        [          2321,          23,          21,          28        ]
      ]
    },
    {
      "ID": 18,
      "initPos": [        2116,        21,        16,        3      ],
      "endPos": [        2116,        21,        16,        3      ],
      "goalPos": [
        [          2316,          23,          16,          23        ],
        [          2119,          21,          19,          6        ]
      ]
    },
    {
      "ID": 19,
      "initPos": [        2122,        21,        22,        9      ],
      "endPos": [        2122,        21,        22,        9      ],
      "goalPos": [
        [          2119,          21,          19,          6        ],
        [          2316,          23,          16,          23        ]
      ]
    }
  ]
}