{
  "MAPF": "CBS",
  "SAPF": "TDSP",
  "costFunction": "SIC",
  "heuristic": "",
  "nAgents": 10,
  "nNodes": 29,
  "connect": [
    [      1,      1,      0,      0,      0,      0,      0,      0,      0,      0,      1,      0,      0,      0,      0,      0,      0,      0,      0,      0,      0,      0,      0,      0,      0,      0,      0,      0,      0    ],
    [      1,      1,      1,      0,      0,      0,      0,      0,      0,      0,      0,      0,      0,      0,      0,      0,      0,      0,      0,      0,      0,      0,      0,      0,      0,      0,      0,      0,      0    ],
    [      0,      1,      1,      1,      0,      0,      0,      0,      0,      0,      0,      0,      0,      0,      0,      0,      0,      0,      0,      0,      0,      0,      0,      0,      0,      0,      0,      0,      0    ],
    [      0,      0,      1,      1,      1,      0,      0,      0,      0,      0,      0,      0,      0,      0,      0,      0,      0,      0,      0,      0,      0,      0,      0,      0,      0,      0,      0,      0,      0    ],
    [      0,      0,      0,      1,      1,      1,      0,      0,      0,      0,      0,      0,      0,      0,      0,      0,      0,      0,      0,      0,      0,      0,      0,      0,      0,      0,      0,      0,      0    ],
    [      0,      0,      0,      0,      1,      1,      1,      0,      0,      0,      0,      0,      0,      0,      0,      0,      0,      0,      0,      0,      0,      0,      0,      0,      0,      0,      0,      0,      0    ],
    [      0,      0,      0,      0,      0,      1,      1,      1,      0,      0,      0,      0,      0,      0,      0,      0,      0,      0,      0,      0,      0,      0,      0,      0,      0,      0,      0,      0,      0    ],
    [      0,      0,      0,      0,      0,      0,      1,      1,      1,      0,      0,      0,      0,      0,      0,      0,      0,      0,      0,      0,      0,      0,      0,      0,      0,      0,      0,      0,      0    ],
    [      0,      0,      0,      0,      0,      0,      0,      1,      1,      10,      0,      0,      0,      0,      0,      0,      0,      0,      0,      0,      0,      0,      0,      0,      0,      0,      0,      0,      0    ],
    [      0,      0,      0,      0,      0,      0,      0,      0,      10,      1,      0,      0,      0,      0,      0,      0,      0,      0,      0,      1,      0,      0,      0,      0,      0,      0,      0,      0,      0    ],
    [      1,      0,      0,      0,      0,      0,      0,      0,      0,      0,      1,      1,      0,      0,      0,      0,      0,      0,      0,      0,      1,      0,      0,      0,      0,      0,      0,      0,      0    ],
    [      0,      0,      0,      0,      0,      0,      0,      0,      0,      0,      1,      1,      1,      0,      0,      0,      0,      0,      0,      0,      0,      0,      0,      0,      0,      0,      0,      0,      0    ],
    [      0,      0,      0,      0,      0,      0,      0,      0,      0,      0,      0,      1,      1,      1,      0,      0,      0,      0,      0,      0,      0,      0,      0,      0,      0,      0,      0,      0,      0    ],
    [      0,      0,      0,      0,      0,      0,      0,      0,      0,      0,      0,      0,      1,      1,      1,      0,      0,      0,      0,      0,      0,      0,      0,      0,      0,      0,      0,      0,      0    ],
    [      0,      0,      0,      0,      0,      0,      0,      0,      0,      0,      0,      0,      0,      1,      1,      1,      0,      0,      0,      0,      0,      0,      0,      0,      0,      0,      0,      0,      0    ],
    [      0,      0,      0,      0,      0,      0,      0,      0,      0,      0,      0,      0,      0,      0,      1,      1,      1,      0,      0,      0,      0,      0,      0,      0,      0,      0,      0,      0,      0    ],
    [      0,      0,      0,      0,      0,      0,      0,      0,      0,      0,      0,      0,      0,      0,      0,      1,      1,      1,      0,      0,      0,      0,      0,      0,      0,      0,      0,      0,      0    ],
    [      0,      0,      0,      0,      0,      0,      0,      0,      0,      0,      0,      0,      0,      0,      0,      0,      1,      1,      1,      0,      0,      0,      0,      0,      0,      0,      0,      0,      0    ],
    [      0,      0,      0,      0,      0,      0,      0,      0,      0,      0,      0,      0,      0,      0,      0,      0,      0,      1,      1,      10,      0,      0,      0,      0,      0,      0,      0,      0,      0    ],
    [      0,      0,      0,      0,      0,      0,      0,      0,      0,      1,      0,      0,      0,      0,      0,      0,      0,      0,      10,      1,      0,      0,      0,      0,      0,      0,      0,      0,      0    ],
    [      0,      0,      0,      0,      0,      0,      0,      0,      0,      0,      1,      0,      0,      0,      0,      0,      0,      0,      0,      0,      1,      1,      0,      0,      0,      0,      0,      0,      0    ],
    [      0,      0,      0,      0,      0,      0,      0,      0,      0,      0,      0,      0,      0,      0,      0,      0,      0,      0,      0,      0,      1,      1,      1,      0,      0,      0,      0,      0,      0    ],
    [      0,      0,      0,      0,      0,      0,      0,      0,      0,      0,      0,      0,      0,      0,      0,      0,      0,      0,      0,      0,      0,      1,      1,      1,      0,      0,      0,      0,      0    ],
    [      0,      0,      0,      0,      0,      0,      0,      0,      0,      0,      0,      0,      0,      0,      0,      0,      0,      0,      0,      0,      0,      0,      1,      1,      1,      0,      0,      0,      0    ],
    [      0,      0,      0,      0,      0,      0,      0,      0,      0,      0,      0,      0,      0,      0,      0,      0,      0,      0,      0,      0,      0,      0,      0,      1,      1,      1,      0,      0,      0    ],
    [      0,      0,      0,      0,      0,      0,      0,      0,      0,      0,      0,      0,      0,      0,      0,      0,      0,      0,      0,      0,      0,      0,      0,      0,      1,      1,      1,      0,      0    ],
    [      0,      0,      0,      0,      0,      0,      0,      0,      0,      0,      0,      0,      0,      0,      0,      0,      0,      0,      0,      0,      0,      0,      0,      0,      0,      1,      1,      1,      0    ],
    [      0,      0,      0,      0,      0,      0,      0,      0,      0,      0,      0,      0,      0,      0,      0,      0,      0,      0,      0,      0,      0,      0,      0,      0,      0,      0,      1,      1,      1    ],
    [      0,      0,      0,      0,      0,      0,      0,      0,      0,      0,      0,      0,      0,      0,      0,      0,      0,      0,      0,      0,      0,      0,      0,      0,      0,      0,      0,      1,      1    ]
  ],
  "nodes": [
    [      2113,      21,      13,      0    ],
    [      2114,      21,      14,      1    ],
    [      2115,      21,      15,      2    ],
    [      2116,      21,      16,      3    ],
    [      2117,      21,      17,      4    ],
    [      2118,      21,      18,      5    ],
    [      2119,      21,      19,      6    ],
    [      2120,      21,      20,      7    ],
    [      2121,      21,      21,      8    ],
    [      2122,      21,      22,      9    ],
    [      2213,      22,      13,      10    ],
    [      2214,      22,      14,      11    ],
    [      2215,      22,      15,      12    ],
    [      2216,      22,      16,      13    ],
    [      2217,      22,      17,      14    ],
    [      2218,      22,      18,      15    ],
    [      2219,      22,      19,      16    ],
    [      2220,      22,      20,      17    ],
    [      2221,      22,      21,      18    ],
    [      2222,      22,      22,      19    ],
    [      2313,      23,      13,      20    ],
    [      2314,      23,      14,      21    ],
    [      2315,      23,      15,      22    ],
    [      2316,      23,      16,      23    ],
    [      2317,      23,      17,      24    ],
    [      2318,      23,      18,      25    ],
    [      2319,      23,      19,      26    ],
    [      2320,      23,      20,      27    ],
    [      2321,      23,      21,      28    ]
  ],
  "agents": [    {
      "ID": 0,
      "initPos": [        2118,        21,        18,        5      ],
      "endPos": [        2319,        23,        19,        26      ],
      "goalPos": [
        [          2114,          21,          14,          1        ],
        [          2118,          21,          18,          5        ],
        [          2115,          21,          15,          2        ],
        [          2213,          22,          13,          10        ],
        [          2321,          23,          21,          28        ]
      ]
    },
    {
      "ID": 1,
      "initPos": [        2120,        21,        20,        7      ],
      "endPos": [        2314,        23,        14,        21      ],
      "goalPos": [
        [          2315,          23,          15,          22        ],
        [          2213,          22,          13,          10        ],
        [          2118,          21,          18,          5        ],
        [          2222,          22,          22,          19        ],
        [          2320,          23,          20,          27        ]
      ]
    },
    {
      "ID": 2,
      "initPos": [        2115,        21,        15,        2      ],
      "endPos": [        2119,        21,        19,        6      ],
      "goalPos": [
        [          2118,          21,          18,          5        ],
        [          2219,          22,          19,          16        ],
        [          2117,          21,          17,          4        ],
        [          2217,          22,          17,          14        ],
        [          2115,          21,          15,          2        ]
      ]
    },
    {
      "ID": 3,
      "initPos": [        2114,        21,        14,        1      ],
      "endPos": [        2313,        23,        13,        20      ],
      "goalPos": [
        [          2222,          22,          22,          19        ],
        [          2217,          22,          17,          14        ],
        [          2113,          21,          13,          0        ],
        [          2120,          21,          20,          7        ],
        [          2117,          21,          17,          4        ]
      ]
    },
    {
      "ID": 4,
      "initPos": [        2321,        23,        21,        28      ],
      "endPos": [        2216,        22,        16,        13      ],
      "goalPos": [
        [          2214,          22,          14,          11        ],
        [          2320,          23,          20,          27        ],
        [          2113,          21,          13,          0        ],
        [          2320,          23,          20,          27        ],
        [          2219,          22,          19,          16        ]
      ]
    },
    {
      "ID": 5,
      "initPos": [        2117,        21,        17,        4      ],
      "endPos": [        2215,        22,        15,        12      ],
      "goalPos": [
        [          2118,          21,          18,          5        ],
        [          2221,          22,          21,          18        ],
        [          2113,          21,          13,          0        ],
        [          2213,          22,          13,          10        ],
        [          2115,          21,          15,          2        ]
      ]
    },
    {
      "ID": 6,
      "initPos": [        2113,        21,        13,        0      ],
      "endPos": [        2116,        21,        16,        3      ],
      "goalPos": [
        [          2221,          22,          21,          18        ],
        [          2220,          22,          20,          17        ],
        [          2120,          21,          20,          7        ],
        [          2220,          22,          20,          17        ],
        [          2118,          21,          18,          5        ]
      ]
    },
    {
      "ID": 7,
      "initPos": [        2122,        21,        22,        9      ],
      "endPos": [        2121,        21,        21,        8      ],
      "goalPos": [
        [          2214,          22,          14,          11        ],
        [          2318,          23,          18,          25        ],
        [          2222,          22,          22,          19        ],
        [          2114,          21,          14,          1        ],
        [          2115,          21,          15,          2        ]
      ]
    },
    {
      "ID": 8,
      "initPos": [        2315,        23,        15,        22      ],
      "endPos": [        2316,        23,        16,        23      ],
      "goalPos": [
        [          2317,          23,          17,          24        ],
        [          2113,          21,          13,          0        ],
        [          2219,          22,          19,          16        ],
        [          2217,          22,          17,          14        ],
        [          2117,          21,          17,          4        ]
      ]
    },
    {
      "ID": 9,
      "initPos": [        2217,        22,        17,        14      ],
      "endPos": [        2218,        22,        18,        15      ],
      "goalPos": [
        [          2320,          23,          20,          27        ],
        [          2113,          21,          13,          0        ],
        [          2118,          21,          18,          5        ],
        [          2320,          23,          20,          27        ],
        [          2219,          22,          19,          16        ]
      ]
    }
  ]
}