{
  "MAPF": "CBS",
  "SAPF": "TDSP",
  "costFunction": "SIC",
  "heuristic": "",
  "nNodes": 54,
  "nodes": [
    [      429,      74.10000000000001,      6.5,      0    ],
    [      430,      74.10000000000001,      7.800000000000001,      1    ],
    [      431,      75.4,      6.5,      2    ],
    [      432,      75.4,      7.800000000000001,      3    ],
    [      433,      76.7,      6.5,      4    ],
    [      434,      76.7,      7.800000000000001,      5    ],
    [      435,      78,      6.5,      6    ],
    [      436,      78,      7.800000000000001,      7    ],
    [      437,      79.3,      6.5,      8    ],
    [      438,      79.3,      7.800000000000001,      9    ],
    [      439,      80.60000000000001,      6.5,      10    ],
    [      440,      80.60000000000001,      7.800000000000001,      11    ],
    [      441,      81.9,      6.5,      12    ],
    [      442,      81.9,      7.800000000000001,      13    ],
    [      443,      83.2,      6.5,      14    ],
    [      444,      83.2,      7.800000000000001,      15    ],
    [      445,      84.5,      6.5,      16    ],
    [      446,      84.5,      7.800000000000001,      17    ],
    [      447,      85.8,      6.5,      18    ],
    [      448,      85.8,      7.800000000000001,      19    ],
    [      449,      87.10000000000001,      6.5,      20    ],
    [      450,      87.10000000000001,      7.800000000000001,      21    ],
    [      451,      88.4,      6.5,      22    ],
    [      452,      88.4,      7.800000000000001,      23    ],
    [      453,      89.7,      6.5,      24    ],
    [      454,      89.7,      7.800000000000001,      25    ],
    [      455,      91,      6.5,      26    ],
    [      456,      91,      7.800000000000001,      27    ],
    [      457,      92.3,      6.5,      28    ],
    [      458,      92.3,      7.800000000000001,      29    ],
    [      459,      93.60000000000001,      6.5,      30    ],
    [      460,      93.60000000000001,      7.800000000000001,      31    ],
    [      461,      94.9,      6.5,      32    ],
    [      462,      94.9,      7.800000000000001,      33    ],
    [      463,      96.2,      6.5,      34    ],
    [      464,      96.2,      7.800000000000001,      35    ],
    [      465,      97.5,      6.5,      36    ],
    [      466,      97.5,      7.800000000000001,      37    ],
    [      467,      98.8,      6.5,      38    ],
    [      468,      98.8,      7.800000000000001,      39    ],
    [      469,      100.10000000000001,      6.5,      40    ],
    [      470,      100.10000000000001,      7.800000000000001,      41    ],
    [      471,      101.4,      6.5,      42    ],
    [      472,      101.4,      7.800000000000001,      43    ],
    [      473,      102.7,      6.5,      44    ],
    [      474,      102.7,      7.800000000000001,      45    ],
    [      475,      104,      6.5,      46    ],
    [      476,      104,      7.800000000000001,      47    ],
    [      477,      105.3,      6.5,      48    ],
    [      478,      105.3,      7.800000000000001,      49    ],
    [      479,      106.60000000000001,      6.5,      50    ],
    [      480,      106.60000000000001,      7.800000000000001,      51    ],
    [      481,      107.9,      6.5,      52    ],
    [      482,      107.9,      7.800000000000001,      53    ]
  ],
  "connect": [
    [      1,      1,      1,      0,      0,      0,      0,      0,      0,      0,      0,      0,      0,      0,      0,      0,      0,      0,      0,      0,      0,      0,      0,      0,      0,      0,      0,      0,      0,      0,      0,      0,      0,      0,      0,      0,      0,      0,      0,      0,      0,      0,      0,      0,      0,      0,      0,      0,      0,      0,      0,      0,      0,      0    ],
    [      1,      1,      0,      1,      0,      0,      0,      0,      0,      0,      0,      0,      0,      0,      0,      0,      0,      0,      0,      0,      0,      0,      0,      0,      0,      0,      0,      0,      0,      0,      0,      0,      0,      0,      0,      0,      0,      0,      0,      0,      0,      0,      0,      0,      0,      0,      0,      0,      0,      0,      0,      0,      0,      0    ],
    [      1,      0,      1,      1,      1,      0,      0,      0,      0,      0,      0,      0,      0,      0,      0,      0,      0,      0,      0,      0,      0,      0,      0,      0,      0,      0,      0,      0,      0,      0,      0,      0,      0,      0,      0,      0,      0,      0,      0,      0,      0,      0,      0,      0,      0,      0,      0,      0,      0,      0,      0,      0,      0,      0    ],
    [      0,      1,      1,      1,      0,      1,      0,      0,      0,      0,      0,      0,      0,      0,      0,      0,      0,      0,      0,      0,      0,      0,      0,      0,      0,      0,      0,      0,      0,      0,      0,      0,      0,      0,      0,      0,      0,      0,      0,      0,      0,      0,      0,      0,      0,      0,      0,      0,      0,      0,      0,      0,      0,      0    ],
    [      0,      0,      1,      0,      1,      1,      1,      0,      0,      0,      0,      0,      0,      0,      0,      0,      0,      0,      0,      0,      0,      0,      0,      0,      0,      0,      0,      0,      0,      0,      0,      0,      0,      0,      0,      0,      0,      0,      0,      0,      0,      0,      0,      0,      0,      0,      0,      0,      0,      0,      0,      0,      0,      0    ],
    [      0,      0,      0,      1,      1,      1,      0,      1,      0,      0,      0,      0,      0,      0,      0,      0,      0,      0,      0,      0,      0,      0,      0,      0,      0,      0,      0,      0,      0,      0,      0,      0,      0,      0,      0,      0,      0,      0,      0,      0,      0,      0,      0,      0,      0,      0,      0,      0,      0,      0,      0,      0,      0,      0    ],
    [      0,      0,      0,      0,      1,      0,      1,      1,      1,      0,      0,      0,      0,      0,      0,      0,      0,      0,      0,      0,      0,      0,      0,      0,      0,      0,      0,      0,      0,      0,      0,      0,      0,      0,      0,      0,      0,      0,      0,      0,      0,      0,      0,      0,      0,      0,      0,      0,      0,      0,      0,      0,      0,      0    ],
    [      0,      0,      0,      0,      0,      1,      1,      1,      0,      1,      0,      0,      0,      0,      0,      0,      0,      0,      0,      0,      0,      0,      0,      0,      0,      0,      0,      0,      0,      0,      0,      0,      0,      0,      0,      0,      0,      0,      0,      0,      0,      0,      0,      0,      0,      0,      0,      0,      0,      0,      0,      0,      0,      0    ],
    [      0,      0,      0,      0,      0,      0,      1,      0,      1,      1,      1,      0,      0,      0,      0,      0,      0,      0,      0,      0,      0,      0,      0,      0,      0,      0,      0,      0,      0,      0,      0,      0,      0,      0,      0,      0,      0,      0,      0,      0,      0,      0,      0,      0,      0,      0,      0,      0,      0,      0,      0,      0,      0,      0    ],
    [      0,      0,      0,      0,      0,      0,      0,      1,      1,      1,      0,      1,      0,      0,      0,      0,      0,      0,      0,      0,      0,      0,      0,      0,      0,      0,      0,      0,      0,      0,      0,      0,      0,      0,      0,      0,      0,      0,      0,      0,      0,      0,      0,      0,      0,      0,      0,      0,      0,      0,      0,      0,      0,      0    ],
    [      0,      0,      0,      0,      0,      0,      0,      0,      1,      0,      1,      1,      1,      0,      0,      0,      0,      0,      0,      0,      0,      0,      0,      0,      0,      0,      0,      0,      0,      0,      0,      0,      0,      0,      0,      0,      0,      0,      0,      0,      0,      0,      0,      0,      0,      0,      0,      0,      0,      0,      0,      0,      0,      0    ],
    [      0,      0,      0,      0,      0,      0,      0,      0,      0,      1,      1,      1,      0,      1,      0,      0,      0,      0,      0,      0,      0,      0,      0,      0,      0,      0,      0,      0,      0,      0,      0,      0,      0,      0,      0,      0,      0,      0,      0,      0,      0,      0,      0,      0,      0,      0,      0,      0,      0,      0,      0,      0,      0,      0    ],
    [      0,      0,      0,      0,      0,      0,      0,      0,      0,      0,      1,      0,      1,      1,      1,      0,      0,      0,      0,      0,      0,      0,      0,      0,      0,      0,      0,      0,      0,      0,      0,      0,      0,      0,      0,      0,      0,      0,      0,      0,      0,      0,      0,      0,      0,      0,      0,      0,      0,      0,      0,      0,      0,      0    ],
    [      0,      0,      0,      0,      0,      0,      0,      0,      0,      0,      0,      1,      1,      1,      0,      1,      0,      0,      0,      0,      0,      0,      0,      0,      0,      0,      0,      0,      0,      0,      0,      0,      0,      0,      0,      0,      0,      0,      0,      0,      0,      0,      0,      0,      0,      0,      0,      0,      0,      0,      0,      0,      0,      0    ],
    [      0,      0,      0,      0,      0,      0,      0,      0,      0,      0,      0,      0,      1,      0,      1,      1,      1,      0,      0,      0,      0,      0,      0,      0,      0,      0,      0,      0,      0,      0,      0,      0,      0,      0,      0,      0,      0,      0,      0,      0,      0,      0,      0,      0,      0,      0,      0,      0,      0,      0,      0,      0,      0,      0    ],
    [      0,      0,      0,      0,      0,      0,      0,      0,      0,      0,      0,      0,      0,      1,      1,      1,      0,      1,      0,      0,      0,      0,      0,      0,      0,      0,      0,      0,      0,      0,      0,      0,      0,      0,      0,      0,      0,      0,      0,      0,      0,      0,      0,      0,      0,      0,      0,      0,      0,      0,      0,      0,      0,      0    ],
    [      0,      0,      0,      0,      0,      0,      0,      0,      0,      0,      0,      0,      0,      0,      1,      0,      1,      1,      1,      0,      0,      0,      0,      0,      0,      0,      0,      0,      0,      0,      0,      0,      0,      0,      0,      0,      0,      0,      0,      0,      0,      0,      0,      0,      0,      0,      0,      0,      0,      0,      0,      0,      0,      0    ],
    [      0,      0,      0,      0,      0,      0,      0,      0,      0,      0,      0,      0,      0,      0,      0,      1,      1,      1,      0,      1,      0,      0,      0,      0,      0,      0,      0,      0,      0,      0,      0,      0,      0,      0,      0,      0,      0,      0,      0,      0,      0,      0,      0,      0,      0,      0,      0,      0,      0,      0,      0,      0,      0,      0    ],
    [      0,      0,      0,      0,      0,      0,      0,      0,      0,      0,      0,      0,      0,      0,      0,      0,      1,      0,      1,      1,      1,      0,      0,      0,      0,      0,      0,      0,      0,      0,      0,      0,      0,      0,      0,      0,      0,      0,      0,      0,      0,      0,      0,      0,      0,      0,      0,      0,      0,      0,      0,      0,      0,      0    ],
    [      0,      0,      0,      0,      0,      0,      0,      0,      0,      0,      0,      0,      0,      0,      0,      0,      0,      1,      1,      1,      0,      1,      0,      0,      0,      0,      0,      0,      0,      0,      0,      0,      0,      0,      0,      0,      0,      0,      0,      0,      0,      0,      0,      0,      0,      0,      0,      0,      0,      0,      0,      0,      0,      0    ],
    [      0,      0,      0,      0,      0,      0,      0,      0,      0,      0,      0,      0,      0,      0,      0,      0,      0,      0,      1,      0,      1,      1,      1,      0,      0,      0,      0,      0,      0,      0,      0,      0,      0,      0,      0,      0,      0,      0,      0,      0,      0,      0,      0,      0,      0,      0,      0,      0,      0,      0,      0,      0,      0,      0    ],
    [      0,      0,      0,      0,      0,      0,      0,      0,      0,      0,      0,      0,      0,      0,      0,      0,      0,      0,      0,      1,      1,      1,      0,      1,      0,      0,      0,      0,      0,      0,      0,      0,      0,      0,      0,      0,      0,      0,      0,      0,      0,      0,      0,      0,      0,      0,      0,      0,      0,      0,      0,      0,      0,      0    ],
    [      0,      0,      0,      0,      0,      0,      0,      0,      0,      0,      0,      0,      0,      0,      0,      0,      0,      0,      0,      0,      1,      0,      1,      1,      1,      0,      0,      0,      0,      0,      0,      0,      0,      0,      0,      0,      0,      0,      0,      0,      0,      0,      0,      0,      0,      0,      0,      0,      0,      0,      0,      0,      0,      0    ],
    [      0,      0,      0,      0,      0,      0,      0,      0,      0,      0,      0,      0,      0,      0,      0,      0,      0,      0,      0,      0,      0,      1,      1,      1,      0,      1,      0,      0,      0,      0,      0,      0,      0,      0,      0,      0,      0,      0,      0,      0,      0,      0,      0,      0,      0,      0,      0,      0,      0,      0,      0,      0,      0,      0    ],
    [      0,      0,      0,      0,      0,      0,      0,      0,      0,      0,      0,      0,      0,      0,      0,      0,      0,      0,      0,      0,      0,      0,      1,      0,      1,      1,      1,      0,      0,      0,      0,      0,      0,      0,      0,      0,      0,      0,      0,      0,      0,      0,      0,      0,      0,      0,      0,      0,      0,      0,      0,      0,      0,      0    ],
    [      0,      0,      0,      0,      0,      0,      0,      0,      0,      0,      0,      0,      0,      0,      0,      0,      0,      0,      0,      0,      0,      0,      0,      1,      1,      1,      0,      1,      0,      0,      0,      0,      0,      0,      0,      0,      0,      0,      0,      0,      0,      0,      0,      0,      0,      0,      0,      0,      0,      0,      0,      0,      0,      0    ],
    [      0,      0,      0,      0,      0,      0,      0,      0,      0,      0,      0,      0,      0,      0,      0,      0,      0,      0,      0,      0,      0,      0,      0,      0,      1,      0,      1,      1,      1,      0,      0,      0,      0,      0,      0,      0,      0,      0,      0,      0,      0,      0,      0,      0,      0,      0,      0,      0,      0,      0,      0,      0,      0,      0    ],
    [      0,      0,      0,      0,      0,      0,      0,      0,      0,      0,      0,      0,      0,      0,      0,      0,      0,      0,      0,      0,      0,      0,      0,      0,      0,      1,      1,      1,      0,      1,      0,      0,      0,      0,      0,      0,      0,      0,      0,      0,      0,      0,      0,      0,      0,      0,      0,      0,      0,      0,      0,      0,      0,      0    ],
    [      0,      0,      0,      0,      0,      0,      0,      0,      0,      0,      0,      0,      0,      0,      0,      0,      0,      0,      0,      0,      0,      0,      0,      0,      0,      0,      1,      0,      1,      1,      1,      0,      0,      0,      0,      0,      0,      0,      0,      0,      0,      0,      0,      0,      0,      0,      0,      0,      0,      0,      0,      0,      0,      0    ],
    [      0,      0,      0,      0,      0,      0,      0,      0,      0,      0,      0,      0,      0,      0,      0,      0,      0,      0,      0,      0,      0,      0,      0,      0,      0,      0,      0,      1,      1,      1,      0,      1,      0,      0,      0,      0,      0,      0,      0,      0,      0,      0,      0,      0,      0,      0,      0,      0,      0,      0,      0,      0,      0,      0    ],
    [      0,      0,      0,      0,      0,      0,      0,      0,      0,      0,      0,      0,      0,      0,      0,      0,      0,      0,      0,      0,      0,      0,      0,      0,      0,      0,      0,      0,      1,      0,      1,      1,      1,      0,      0,      0,      0,      0,      0,      0,      0,      0,      0,      0,      0,      0,      0,      0,      0,      0,      0,      0,      0,      0    ],
    [      0,      0,      0,      0,      0,      0,      0,      0,      0,      0,      0,      0,      0,      0,      0,      0,      0,      0,      0,      0,      0,      0,      0,      0,      0,      0,      0,      0,      0,      1,      1,      1,      0,      1,      0,      0,      0,      0,      0,      0,      0,      0,      0,      0,      0,      0,      0,      0,      0,      0,      0,      0,      0,      0    ],
    [      0,      0,      0,      0,      0,      0,      0,      0,      0,      0,      0,      0,      0,      0,      0,      0,      0,      0,      0,      0,      0,      0,      0,      0,      0,      0,      0,      0,      0,      0,      1,      0,      1,      1,      1,      0,      0,      0,      0,      0,      0,      0,      0,      0,      0,      0,      0,      0,      0,      0,      0,      0,      0,      0    ],
    [      0,      0,      0,      0,      0,      0,      0,      0,      0,      0,      0,      0,      0,      0,      0,      0,      0,      0,      0,      0,      0,      0,      0,      0,      0,      0,      0,      0,      0,      0,      0,      1,      1,      1,      0,      1,      0,      0,      0,      0,      0,      0,      0,      0,      0,      0,      0,      0,      0,      0,      0,      0,      0,      0    ],
    [      0,      0,      0,      0,      0,      0,      0,      0,      0,      0,      0,      0,      0,      0,      0,      0,      0,      0,      0,      0,      0,      0,      0,      0,      0,      0,      0,      0,      0,      0,      0,      0,      1,      0,      1,      1,      1,      0,      0,      0,      0,      0,      0,      0,      0,      0,      0,      0,      0,      0,      0,      0,      0,      0    ],
    [      0,      0,      0,      0,      0,      0,      0,      0,      0,      0,      0,      0,      0,      0,      0,      0,      0,      0,      0,      0,      0,      0,      0,      0,      0,      0,      0,      0,      0,      0,      0,      0,      0,      1,      1,      1,      0,      1,      0,      0,      0,      0,      0,      0,      0,      0,      0,      0,      0,      0,      0,      0,      0,      0    ],
    [      0,      0,      0,      0,      0,      0,      0,      0,      0,      0,      0,      0,      0,      0,      0,      0,      0,      0,      0,      0,      0,      0,      0,      0,      0,      0,      0,      0,      0,      0,      0,      0,      0,      0,      1,      0,      1,      1,      1,      0,      0,      0,      0,      0,      0,      0,      0,      0,      0,      0,      0,      0,      0,      0    ],
    [      0,      0,      0,      0,      0,      0,      0,      0,      0,      0,      0,      0,      0,      0,      0,      0,      0,      0,      0,      0,      0,      0,      0,      0,      0,      0,      0,      0,      0,      0,      0,      0,      0,      0,      0,      1,      1,      1,      0,      1,      0,      0,      0,      0,      0,      0,      0,      0,      0,      0,      0,      0,      0,      0    ],
    [      0,      0,      0,      0,      0,      0,      0,      0,      0,      0,      0,      0,      0,      0,      0,      0,      0,      0,      0,      0,      0,      0,      0,      0,      0,      0,      0,      0,      0,      0,      0,      0,      0,      0,      0,      0,      1,      0,      1,      1,      1,      0,      0,      0,      0,      0,      0,      0,      0,      0,      0,      0,      0,      0    ],
    [      0,      0,      0,      0,      0,      0,      0,      0,      0,      0,      0,      0,      0,      0,      0,      0,      0,      0,      0,      0,      0,      0,      0,      0,      0,      0,      0,      0,      0,      0,      0,      0,      0,      0,      0,      0,      0,      1,      1,      1,      0,      1,      0,      0,      0,      0,      0,      0,      0,      0,      0,      0,      0,      0    ],
    [      0,      0,      0,      0,      0,      0,      0,      0,      0,      0,      0,      0,      0,      0,      0,      0,      0,      0,      0,      0,      0,      0,      0,      0,      0,      0,      0,      0,      0,      0,      0,      0,      0,      0,      0,      0,      0,      0,      1,      0,      1,      1,      1,      0,      0,      0,      0,      0,      0,      0,      0,      0,      0,      0    ],
    [      0,      0,      0,      0,      0,      0,      0,      0,      0,      0,      0,      0,      0,      0,      0,      0,      0,      0,      0,      0,      0,      0,      0,      0,      0,      0,      0,      0,      0,      0,      0,      0,      0,      0,      0,      0,      0,      0,      0,      1,      1,      1,      0,      1,      0,      0,      0,      0,      0,      0,      0,      0,      0,      0    ],
    [      0,      0,      0,      0,      0,      0,      0,      0,      0,      0,      0,      0,      0,      0,      0,      0,      0,      0,      0,      0,      0,      0,      0,      0,      0,      0,      0,      0,      0,      0,      0,      0,      0,      0,      0,      0,      0,      0,      0,      0,      1,      0,      1,      1,      1,      0,      0,      0,      0,      0,      0,      0,      0,      0    ],
    [      0,      0,      0,      0,      0,      0,      0,      0,      0,      0,      0,      0,      0,      0,      0,      0,      0,      0,      0,      0,      0,      0,      0,      0,      0,      0,      0,      0,      0,      0,      0,      0,      0,      0,      0,      0,      0,      0,      0,      0,      0,      1,      1,      1,      0,      1,      0,      0,      0,      0,      0,      0,      0,      0    ],
    [      0,      0,      0,      0,      0,      0,      0,      0,      0,      0,      0,      0,      0,      0,      0,      0,      0,      0,      0,      0,      0,      0,      0,      0,      0,      0,      0,      0,      0,      0,      0,      0,      0,      0,      0,      0,      0,      0,      0,      0,      0,      0,      1,      0,      1,      1,      1,      0,      0,      0,      0,      0,      0,      0    ],
    [      0,      0,      0,      0,      0,      0,      0,      0,      0,      0,      0,      0,      0,      0,      0,      0,      0,      0,      0,      0,      0,      0,      0,      0,      0,      0,      0,      0,      0,      0,      0,      0,      0,      0,      0,      0,      0,      0,      0,      0,      0,      0,      0,      1,      1,      1,      0,      1,      0,      0,      0,      0,      0,      0    ],
    [      0,      0,      0,      0,      0,      0,      0,      0,      0,      0,      0,      0,      0,      0,      0,      0,      0,      0,      0,      0,      0,      0,      0,      0,      0,      0,      0,      0,      0,      0,      0,      0,      0,      0,      0,      0,      0,      0,      0,      0,      0,      0,      0,      0,      1,      0,      1,      1,      1,      0,      0,      0,      0,      0    ],
    [      0,      0,      0,      0,      0,      0,      0,      0,      0,      0,      0,      0,      0,      0,      0,      0,      0,      0,      0,      0,      0,      0,      0,      0,      0,      0,      0,      0,      0,      0,      0,      0,      0,      0,      0,      0,      0,      0,      0,      0,      0,      0,      0,      0,      0,      1,      1,      1,      0,      1,      0,      0,      0,      0    ],
    [      0,      0,      0,      0,      0,      0,      0,      0,      0,      0,      0,      0,      0,      0,      0,      0,      0,      0,      0,      0,      0,      0,      0,      0,      0,      0,      0,      0,      0,      0,      0,      0,      0,      0,      0,      0,      0,      0,      0,      0,      0,      0,      0,      0,      0,      0,      1,      0,      1,      1,      1,      0,      0,      0    ],
    [      0,      0,      0,      0,      0,      0,      0,      0,      0,      0,      0,      0,      0,      0,      0,      0,      0,      0,      0,      0,      0,      0,      0,      0,      0,      0,      0,      0,      0,      0,      0,      0,      0,      0,      0,      0,      0,      0,      0,      0,      0,      0,      0,      0,      0,      0,      0,      1,      1,      1,      0,      1,      0,      0    ],
    [      0,      0,      0,      0,      0,      0,      0,      0,      0,      0,      0,      0,      0,      0,      0,      0,      0,      0,      0,      0,      0,      0,      0,      0,      0,      0,      0,      0,      0,      0,      0,      0,      0,      0,      0,      0,      0,      0,      0,      0,      0,      0,      0,      0,      0,      0,      0,      0,      1,      0,      1,      1,      1,      0    ],
    [      0,      0,      0,      0,      0,      0,      0,      0,      0,      0,      0,      0,      0,      0,      0,      0,      0,      0,      0,      0,      0,      0,      0,      0,      0,      0,      0,      0,      0,      0,      0,      0,      0,      0,      0,      0,      0,      0,      0,      0,      0,      0,      0,      0,      0,      0,      0,      0,      0,      1,      1,      1,      0,      1    ],
    [      0,      0,      0,      0,      0,      0,      0,      0,      0,      0,      0,      0,      0,      0,      0,      0,      0,      0,      0,      0,      0,      0,      0,      0,      0,      0,      0,      0,      0,      0,      0,      0,      0,      0,      0,      0,      0,      0,      0,      0,      0,      0,      0,      0,      0,      0,      0,      0,      0,      0,      1,      0,      1,      1    ],
    [      0,      0,      0,      0,      0,      0,      0,      0,      0,      0,      0,      0,      0,      0,      0,      0,      0,      0,      0,      0,      0,      0,      0,      0,      0,      0,      0,      0,      0,      0,      0,      0,      0,      0,      0,      0,      0,      0,      0,      0,      0,      0,      0,      0,      0,      0,      0,      0,      0,      0,      0,      1,      1,      1    ]
  ],
  "nAgents": 20,
  "agents": [    {
      "ID": 0,
      "initPos": [        471,        101.4,        6.5,        42      ],
      "endPos": [        467,        98.8,        6.5,        38      ],
      "goalPos": [
        [          457,          92.3,          6.5,          28        ],
        [          456,          91,          7.800000000000001,          27        ],
        [          480,          106.60000000000001,          7.800000000000001,          51        ],
        [          438,          79.3,          7.800000000000001,          9        ],
        [          482,          107.9,          7.800000000000001,          53        ],
        [          452,          88.4,          7.800000000000001,          23        ],
        [          462,          94.9,          7.800000000000001,          33        ],
        [          469,          100.10000000000001,          6.5,          40        ],
        [          431,          75.4,          6.5,          2        ],
        [          433,          76.7,          6.5,          4        ],
        [          471,          101.4,          6.5,          42        ],
        [          456,          91,          7.800000000000001,          27        ],
        [          471,          101.4,          6.5,          42        ],
        [          439,          80.60000000000001,          6.5,          10        ],
        [          447,          85.8,          6.5,          18        ],
        [          442,          81.9,          7.800000000000001,          13        ],
        [          445,          84.5,          6.5,          16        ],
        [          448,          85.8,          7.800000000000001,          19        ],
        [          462,          94.9,          7.800000000000001,          33        ],
        [          479,          106.60000000000001,          6.5,          50        ]
      ]
    },
    {
      "ID": 1,
      "initPos": [        478,        105.3,        7.800000000000001,        49      ],
      "endPos": [        474,        102.7,        7.800000000000001,        45      ],
      "goalPos": [
        [          431,          75.4,          6.5,          2        ],
        [          469,          100.10000000000001,          6.5,          40        ],
        [          434,          76.7,          7.800000000000001,          5        ],
        [          457,          92.3,          6.5,          28        ],
        [          430,          74.10000000000001,          7.800000000000001,          1        ],
        [          462,          94.9,          7.800000000000001,          33        ],
        [          430,          74.10000000000001,          7.800000000000001,          1        ],
        [          456,          91,          7.800000000000001,          27        ],
        [          437,          79.3,          6.5,          8        ],
        [          458,          92.3,          7.800000000000001,          29        ],
        [          459,          93.60000000000001,          6.5,          30        ],
        [          471,          101.4,          6.5,          42        ],
        [          446,          84.5,          7.800000000000001,          17        ],
        [          435,          78,          6.5,          6        ],
        [          439,          80.60000000000001,          6.5,          10        ],
        [          473,          102.7,          6.5,          44        ],
        [          441,          81.9,          6.5,          12        ],
        [          469,          100.10000000000001,          6.5,          40        ],
        [          441,          81.9,          6.5,          12        ],
        [          439,          80.60000000000001,          6.5,          10        ]
      ]
    },
    {
      "ID": 2,
      "initPos": [        456,        91,        7.800000000000001,        27      ],
      "endPos": [        470,        100.10000000000001,        7.800000000000001,        41      ],
      "goalPos": [
        [          482,          107.9,          7.800000000000001,          53        ],
        [          441,          81.9,          6.5,          12        ],
        [          443,          83.2,          6.5,          14        ],
        [          445,          84.5,          6.5,          16        ],
        [          448,          85.8,          7.800000000000001,          19        ],
        [          473,          102.7,          6.5,          44        ],
        [          433,          76.7,          6.5,          4        ],
        [          480,          106.60000000000001,          7.800000000000001,          51        ],
        [          473,          102.7,          6.5,          44        ],
        [          457,          92.3,          6.5,          28        ],
        [          437,          79.3,          6.5,          8        ],
        [          429,          74.10000000000001,          6.5,          0        ],
        [          436,          78,          7.800000000000001,          7        ],
        [          476,          104,          7.800000000000001,          47        ],
        [          471,          101.4,          6.5,          42        ],
        [          478,          105.3,          7.800000000000001,          49        ],
        [          453,          89.7,          6.5,          24        ],
        [          446,          84.5,          7.800000000000001,          17        ],
        [          448,          85.8,          7.800000000000001,          19        ],
        [          455,          91,          6.5,          26        ]
      ]
    },
    {
      "ID": 3,
      "initPos": [        429,        74.10000000000001,        6.5,        0      ],
      "endPos": [        440,        80.60000000000001,        7.800000000000001,        11      ],
      "goalPos": [
        [          458,          92.3,          7.800000000000001,          29        ],
        [          442,          81.9,          7.800000000000001,          13        ],
        [          478,          105.3,          7.800000000000001,          49        ],
        [          436,          78,          7.800000000000001,          7        ],
        [          441,          81.9,          6.5,          12        ],
        [          480,          106.60000000000001,          7.800000000000001,          51        ],
        [          438,          79.3,          7.800000000000001,          9        ],
        [          443,          83.2,          6.5,          14        ],
        [          447,          85.8,          6.5,          18        ],
        [          442,          81.9,          7.800000000000001,          13        ],
        [          469,          100.10000000000001,          6.5,          40        ],
        [          445,          84.5,          6.5,          16        ],
        [          457,          92.3,          6.5,          28        ],
        [          478,          105.3,          7.800000000000001,          49        ],
        [          429,          74.10000000000001,          6.5,          0        ],
        [          430,          74.10000000000001,          7.800000000000001,          1        ],
        [          453,          89.7,          6.5,          24        ],
        [          462,          94.9,          7.800000000000001,          33        ],
        [          441,          81.9,          6.5,          12        ],
        [          478,          105.3,          7.800000000000001,          49        ]
      ]
    },
    {
      "ID": 4,
      "initPos": [        437,        79.3,        6.5,        8      ],
      "endPos": [        449,        87.10000000000001,        6.5,        20      ],
      "goalPos": [
        [          443,          83.2,          6.5,          14        ],
        [          455,          91,          6.5,          26        ],
        [          448,          85.8,          7.800000000000001,          19        ],
        [          478,          105.3,          7.800000000000001,          49        ],
        [          443,          83.2,          6.5,          14        ],
        [          455,          91,          6.5,          26        ],
        [          476,          104,          7.800000000000001,          47        ],
        [          437,          79.3,          6.5,          8        ],
        [          436,          78,          7.800000000000001,          7        ],
        [          469,          100.10000000000001,          6.5,          40        ],
        [          447,          85.8,          6.5,          18        ],
        [          433,          76.7,          6.5,          4        ],
        [          452,          88.4,          7.800000000000001,          23        ],
        [          437,          79.3,          6.5,          8        ],
        [          430,          74.10000000000001,          7.800000000000001,          1        ],
        [          462,          94.9,          7.800000000000001,          33        ],
        [          457,          92.3,          6.5,          28        ],
        [          453,          89.7,          6.5,          24        ],
        [          469,          100.10000000000001,          6.5,          40        ],
        [          476,          104,          7.800000000000001,          47        ]
      ]
    },
    {
      "ID": 5,
      "initPos": [        473,        102.7,        6.5,        44      ],
      "endPos": [        450,        87.10000000000001,        7.800000000000001,        21      ],
      "goalPos": [
        [          434,          76.7,          7.800000000000001,          5        ],
        [          469,          100.10000000000001,          6.5,          40        ],
        [          458,          92.3,          7.800000000000001,          29        ],
        [          435,          78,          6.5,          6        ],
        [          482,          107.9,          7.800000000000001,          53        ],
        [          471,          101.4,          6.5,          42        ],
        [          446,          84.5,          7.800000000000001,          17        ],
        [          456,          91,          7.800000000000001,          27        ],
        [          459,          93.60000000000001,          6.5,          30        ],
        [          442,          81.9,          7.800000000000001,          13        ],
        [          446,          84.5,          7.800000000000001,          17        ],
        [          442,          81.9,          7.800000000000001,          13        ],
        [          457,          92.3,          6.5,          28        ],
        [          471,          101.4,          6.5,          42        ],
        [          435,          78,          6.5,          6        ],
        [          456,          91,          7.800000000000001,          27        ],
        [          459,          93.60000000000001,          6.5,          30        ],
        [          439,          80.60000000000001,          6.5,          10        ],
        [          458,          92.3,          7.800000000000001,          29        ],
        [          447,          85.8,          6.5,          18        ]
      ]
    },
    {
      "ID": 6,
      "initPos": [        457,        92.3,        6.5,        28      ],
      "endPos": [        460,        93.60000000000001,        7.800000000000001,        31      ],
      "goalPos": [
        [          447,          85.8,          6.5,          18        ],
        [          432,          75.4,          7.800000000000001,          3        ],
        [          433,          76.7,          6.5,          4        ],
        [          473,          102.7,          6.5,          44        ],
        [          439,          80.60000000000001,          6.5,          10        ],
        [          443,          83.2,          6.5,          14        ],
        [          433,          76.7,          6.5,          4        ],
        [          469,          100.10000000000001,          6.5,          40        ],
        [          441,          81.9,          6.5,          12        ],
        [          476,          104,          7.800000000000001,          47        ],
        [          479,          106.60000000000001,          6.5,          50        ],
        [          436,          78,          7.800000000000001,          7        ],
        [          471,          101.4,          6.5,          42        ],
        [          436,          78,          7.800000000000001,          7        ],
        [          473,          102.7,          6.5,          44        ],
        [          459,          93.60000000000001,          6.5,          30        ],
        [          433,          76.7,          6.5,          4        ],
        [          432,          75.4,          7.800000000000001,          3        ],
        [          452,          88.4,          7.800000000000001,          23        ],
        [          478,          105.3,          7.800000000000001,          49        ]
      ]
    },
    {
      "ID": 7,
      "initPos": [        433,        76.7,        6.5,        4      ],
      "endPos": [        451,        88.4,        6.5,        22      ],
      "goalPos": [
        [          446,          84.5,          7.800000000000001,          17        ],
        [          438,          79.3,          7.800000000000001,          9        ],
        [          429,          74.10000000000001,          6.5,          0        ],
        [          480,          106.60000000000001,          7.800000000000001,          51        ],
        [          462,          94.9,          7.800000000000001,          33        ],
        [          479,          106.60000000000001,          6.5,          50        ],
        [          452,          88.4,          7.800000000000001,          23        ],
        [          436,          78,          7.800000000000001,          7        ],
        [          441,          81.9,          6.5,          12        ],
        [          435,          78,          6.5,          6        ],
        [          439,          80.60000000000001,          6.5,          10        ],
        [          455,          91,          6.5,          26        ],
        [          446,          84.5,          7.800000000000001,          17        ],
        [          459,          93.60000000000001,          6.5,          30        ],
        [          434,          76.7,          7.800000000000001,          5        ],
        [          442,          81.9,          7.800000000000001,          13        ],
        [          431,          75.4,          6.5,          2        ],
        [          442,          81.9,          7.800000000000001,          13        ],
        [          437,          79.3,          6.5,          8        ],
        [          431,          75.4,          6.5,          2        ]
      ]
    },
    {
      "ID": 8,
      "initPos": [        447,        85.8,        6.5,        18      ],
      "endPos": [        461,        94.9,        6.5,        32      ],
      "goalPos": [
        [          443,          83.2,          6.5,          14        ],
        [          448,          85.8,          7.800000000000001,          19        ],
        [          452,          88.4,          7.800000000000001,          23        ],
        [          448,          85.8,          7.800000000000001,          19        ],
        [          482,          107.9,          7.800000000000001,          53        ],
        [          471,          101.4,          6.5,          42        ],
        [          480,          106.60000000000001,          7.800000000000001,          51        ],
        [          445,          84.5,          6.5,          16        ],
        [          453,          89.7,          6.5,          24        ],
        [          469,          100.10000000000001,          6.5,          40        ],
        [          473,          102.7,          6.5,          44        ],
        [          438,          79.3,          7.800000000000001,          9        ],
        [          446,          84.5,          7.800000000000001,          17        ],
        [          480,          106.60000000000001,          7.800000000000001,          51        ],
        [          457,          92.3,          6.5,          28        ],
        [          479,          106.60000000000001,          6.5,          50        ],
        [          448,          85.8,          7.800000000000001,          19        ],
        [          433,          76.7,          6.5,          4        ],
        [          429,          74.10000000000001,          6.5,          0        ],
        [          448,          85.8,          7.800000000000001,          19        ]
      ]
    },
    {
      "ID": 9,
      "initPos": [        442,        81.9,        7.800000000000001,        13      ],
      "endPos": [        481,        107.9,        6.5,        52      ],
      "goalPos": [
        [          431,          75.4,          6.5,          2        ],
        [          439,          80.60000000000001,          6.5,          10        ],
        [          446,          84.5,          7.800000000000001,          17        ],
        [          448,          85.8,          7.800000000000001,          19        ],
        [          438,          79.3,          7.800000000000001,          9        ],
        [          478,          105.3,          7.800000000000001,          49        ],
        [          441,          81.9,          6.5,          12        ],
        [          480,          106.60000000000001,          7.800000000000001,          51        ],
        [          441,          81.9,          6.5,          12        ],
        [          458,          92.3,          7.800000000000001,          29        ],
        [          442,          81.9,          7.800000000000001,          13        ],
        [          479,          106.60000000000001,          6.5,          50        ],
        [          442,          81.9,          7.800000000000001,          13        ],
        [          476,          104,          7.800000000000001,          47        ],
        [          453,          89.7,          6.5,          24        ],
        [          459,          93.60000000000001,          6.5,          30        ],
        [          476,          104,          7.800000000000001,          47        ],
        [          434,          76.7,          7.800000000000001,          5        ],
        [          429,          74.10000000000001,          6.5,          0        ],
        [          435,          78,          6.5,          6        ]
      ]
    },
    {
      "ID": 10,
      "initPos": [        431,        75.4,        6.5,        2      ],
      "endPos": [        444,        83.2,        7.800000000000001,        15      ],
      "goalPos": [
        [          478,          105.3,          7.800000000000001,          49        ],
        [          479,          106.60000000000001,          6.5,          50        ],
        [          453,          89.7,          6.5,          24        ],
        [          443,          83.2,          6.5,          14        ],
        [          455,          91,          6.5,          26        ],
        [          437,          79.3,          6.5,          8        ],
        [          430,          74.10000000000001,          7.800000000000001,          1        ],
        [          435,          78,          6.5,          6        ],
        [          471,          101.4,          6.5,          42        ],
        [          434,          76.7,          7.800000000000001,          5        ],
        [          438,          79.3,          7.800000000000001,          9        ],
        [          480,          106.60000000000001,          7.800000000000001,          51        ],
        [          473,          102.7,          6.5,          44        ],
        [          459,          93.60000000000001,          6.5,          30        ],
        [          453,          89.7,          6.5,          24        ],
        [          458,          92.3,          7.800000000000001,          29        ],
        [          476,          104,          7.800000000000001,          47        ],
        [          438,          79.3,          7.800000000000001,          9        ],
        [          447,          85.8,          6.5,          18        ],
        [          429,          74.10000000000001,          6.5,          0        ]
      ]
    },
    {
      "ID": 11,
      "initPos": [        452,        88.4,        7.800000000000001,        23      ],
      "endPos": [        468,        98.8,        7.800000000000001,        39      ],
      "goalPos": [
        [          439,          80.60000000000001,          6.5,          10        ],
        [          471,          101.4,          6.5,          42        ],
        [          457,          92.3,          6.5,          28        ],
        [          447,          85.8,          6.5,          18        ],
        [          429,          74.10000000000001,          6.5,          0        ],
        [          480,          106.60000000000001,          7.800000000000001,          51        ],
        [          435,          78,          6.5,          6        ],
        [          453,          89.7,          6.5,          24        ],
        [          473,          102.7,          6.5,          44        ],
        [          478,          105.3,          7.800000000000001,          49        ],
        [          445,          84.5,          6.5,          16        ],
        [          469,          100.10000000000001,          6.5,          40        ],
        [          455,          91,          6.5,          26        ],
        [          441,          81.9,          6.5,          12        ],
        [          473,          102.7,          6.5,          44        ],
        [          432,          75.4,          7.800000000000001,          3        ],
        [          433,          76.7,          6.5,          4        ],
        [          447,          85.8,          6.5,          18        ],
        [          459,          93.60000000000001,          6.5,          30        ],
        [          471,          101.4,          6.5,          42        ]
      ]
    },
    {
      "ID": 12,
      "initPos": [        435,        78,        6.5,        6      ],
      "endPos": [        475,        104,        6.5,        46      ],
      "goalPos": [
        [          429,          74.10000000000001,          6.5,          0        ],
        [          438,          79.3,          7.800000000000001,          9        ],
        [          441,          81.9,          6.5,          12        ],
        [          479,          106.60000000000001,          6.5,          50        ],
        [          442,          81.9,          7.800000000000001,          13        ],
        [          459,          93.60000000000001,          6.5,          30        ],
        [          480,          106.60000000000001,          7.800000000000001,          51        ],
        [          430,          74.10000000000001,          7.800000000000001,          1        ],
        [          445,          84.5,          6.5,          16        ],
        [          456,          91,          7.800000000000001,          27        ],
        [          453,          89.7,          6.5,          24        ],
        [          456,          91,          7.800000000000001,          27        ],
        [          482,          107.9,          7.800000000000001,          53        ],
        [          459,          93.60000000000001,          6.5,          30        ],
        [          476,          104,          7.800000000000001,          47        ],
        [          436,          78,          7.800000000000001,          7        ],
        [          435,          78,          6.5,          6        ],
        [          443,          83.2,          6.5,          14        ],
        [          442,          81.9,          7.800000000000001,          13        ],
        [          439,          80.60000000000001,          6.5,          10        ]
      ]
    },
    {
      "ID": 13,
      "initPos": [        436,        78,        7.800000000000001,        7      ],
      "endPos": [        472,        101.4,        7.800000000000001,        43      ],
      "goalPos": [
        [          458,          92.3,          7.800000000000001,          29        ],
        [          478,          105.3,          7.800000000000001,          49        ],
        [          471,          101.4,          6.5,          42        ],
        [          452,          88.4,          7.800000000000001,          23        ],
        [          453,          89.7,          6.5,          24        ],
        [          455,          91,          6.5,          26        ],
        [          476,          104,          7.800000000000001,          47        ],
        [          433,          76.7,          6.5,          4        ],
        [          439,          80.60000000000001,          6.5,          10        ],
        [          446,          84.5,          7.800000000000001,          17        ],
        [          448,          85.8,          7.800000000000001,          19        ],
        [          435,          78,          6.5,          6        ],
        [          462,          94.9,          7.800000000000001,          33        ],
        [          455,          91,          6.5,          26        ],
        [          458,          92.3,          7.800000000000001,          29        ],
        [          435,          78,          6.5,          6        ],
        [          448,          85.8,          7.800000000000001,          19        ],
        [          478,          105.3,          7.800000000000001,          49        ],
        [          476,          104,          7.800000000000001,          47        ],
        [          482,          107.9,          7.800000000000001,          53        ]
      ]
    },
    {
      "ID": 14,
      "initPos": [        469,        100.10000000000001,        6.5,        40      ],
      "endPos": [        466,        97.5,        7.800000000000001,        37      ],
      "goalPos": [
        [          447,          85.8,          6.5,          18        ],
        [          432,          75.4,          7.800000000000001,          3        ],
        [          443,          83.2,          6.5,          14        ],
        [          434,          76.7,          7.800000000000001,          5        ],
        [          482,          107.9,          7.800000000000001,          53        ],
        [          446,          84.5,          7.800000000000001,          17        ],
        [          459,          93.60000000000001,          6.5,          30        ],
        [          469,          100.10000000000001,          6.5,          40        ],
        [          443,          83.2,          6.5,          14        ],
        [          429,          74.10000000000001,          6.5,          0        ],
        [          456,          91,          7.800000000000001,          27        ],
        [          439,          80.60000000000001,          6.5,          10        ],
        [          457,          92.3,          6.5,          28        ],
        [          469,          100.10000000000001,          6.5,          40        ],
        [          459,          93.60000000000001,          6.5,          30        ],
        [          438,          79.3,          7.800000000000001,          9        ],
        [          446,          84.5,          7.800000000000001,          17        ],
        [          462,          94.9,          7.800000000000001,          33        ],
        [          433,          76.7,          6.5,          4        ],
        [          435,          78,          6.5,          6        ]
      ]
    },
    {
      "ID": 15,
      "initPos": [        458,        92.3,        7.800000000000001,        29      ],
      "endPos": [        454,        89.7,        7.800000000000001,        25      ],
      "goalPos": [
        [          456,          91,          7.800000000000001,          27        ],
        [          469,          100.10000000000001,          6.5,          40        ],
        [          443,          83.2,          6.5,          14        ],
        [          447,          85.8,          6.5,          18        ],
        [          476,          104,          7.800000000000001,          47        ],
        [          456,          91,          7.800000000000001,          27        ],
        [          437,          79.3,          6.5,          8        ],
        [          448,          85.8,          7.800000000000001,          19        ],
        [          430,          74.10000000000001,          7.800000000000001,          1        ],
        [          456,          91,          7.800000000000001,          27        ],
        [          431,          75.4,          6.5,          2        ],
        [          442,          81.9,          7.800000000000001,          13        ],
        [          473,          102.7,          6.5,          44        ],
        [          432,          75.4,          7.800000000000001,          3        ],
        [          445,          84.5,          6.5,          16        ],
        [          430,          74.10000000000001,          7.800000000000001,          1        ],
        [          482,          107.9,          7.800000000000001,          53        ],
        [          437,          79.3,          6.5,          8        ],
        [          430,          74.10000000000001,          7.800000000000001,          1        ],
        [          437,          79.3,          6.5,          8        ]
      ]
    },
    {
      "ID": 16,
      "initPos": [        455,        91,        6.5,        26      ],
      "endPos": [        465,        97.5,        6.5,        36      ],
      "goalPos": [
        [          430,          74.10000000000001,          7.800000000000001,          1        ],
        [          442,          81.9,          7.800000000000001,          13        ],
        [          429,          74.10000000000001,          6.5,          0        ],
        [          455,          91,          6.5,          26        ],
        [          452,          88.4,          7.800000000000001,          23        ],
        [          479,          106.60000000000001,          6.5,          50        ],
        [          436,          78,          7.800000000000001,          7        ],
        [          430,          74.10000000000001,          7.800000000000001,          1        ],
        [          443,          83.2,          6.5,          14        ],
        [          431,          75.4,          6.5,          2        ],
        [          453,          89.7,          6.5,          24        ],
        [          458,          92.3,          7.800000000000001,          29        ],
        [          456,          91,          7.800000000000001,          27        ],
        [          478,          105.3,          7.800000000000001,          49        ],
        [          433,          76.7,          6.5,          4        ],
        [          437,          79.3,          6.5,          8        ],
        [          430,          74.10000000000001,          7.800000000000001,          1        ],
        [          469,          100.10000000000001,          6.5,          40        ],
        [          479,          106.60000000000001,          6.5,          50        ],
        [          438,          79.3,          7.800000000000001,          9        ]
      ]
    },
    {
      "ID": 17,
      "initPos": [        443,        83.2,        6.5,        14      ],
      "endPos": [        464,        96.2,        7.800000000000001,        35      ],
      "goalPos": [
        [          448,          85.8,          7.800000000000001,          19        ],
        [          434,          76.7,          7.800000000000001,          5        ],
        [          469,          100.10000000000001,          6.5,          40        ],
        [          456,          91,          7.800000000000001,          27        ],
        [          437,          79.3,          6.5,          8        ],
        [          442,          81.9,          7.800000000000001,          13        ],
        [          433,          76.7,          6.5,          4        ],
        [          482,          107.9,          7.800000000000001,          53        ],
        [          462,          94.9,          7.800000000000001,          33        ],
        [          458,          92.3,          7.800000000000001,          29        ],
        [          462,          94.9,          7.800000000000001,          33        ],
        [          435,          78,          6.5,          6        ],
        [          446,          84.5,          7.800000000000001,          17        ],
        [          471,          101.4,          6.5,          42        ],
        [          452,          88.4,          7.800000000000001,          23        ],
        [          438,          79.3,          7.800000000000001,          9        ],
        [          429,          74.10000000000001,          6.5,          0        ],
        [          473,          102.7,          6.5,          44        ],
        [          447,          85.8,          6.5,          18        ],
        [          434,          76.7,          7.800000000000001,          5        ]
      ]
    },
    {
      "ID": 18,
      "initPos": [        445,        84.5,        6.5,        16      ],
      "endPos": [        463,        96.2,        6.5,        34      ],
      "goalPos": [
        [          482,          107.9,          7.800000000000001,          53        ],
        [          480,          106.60000000000001,          7.800000000000001,          51        ],
        [          476,          104,          7.800000000000001,          47        ],
        [          446,          84.5,          7.800000000000001,          17        ],
        [          471,          101.4,          6.5,          42        ],
        [          443,          83.2,          6.5,          14        ],
        [          458,          92.3,          7.800000000000001,          29        ],
        [          479,          106.60000000000001,          6.5,          50        ],
        [          447,          85.8,          6.5,          18        ],
        [          462,          94.9,          7.800000000000001,          33        ],
        [          459,          93.60000000000001,          6.5,          30        ],
        [          436,          78,          7.800000000000001,          7        ],
        [          442,          81.9,          7.800000000000001,          13        ],
        [          452,          88.4,          7.800000000000001,          23        ],
        [          462,          94.9,          7.800000000000001,          33        ],
        [          435,          78,          6.5,          6        ],
        [          471,          101.4,          6.5,          42        ],
        [          445,          84.5,          6.5,          16        ],
        [          433,          76.7,          6.5,          4        ],
        [          462,          94.9,          7.800000000000001,          33        ]
      ]
    },
    {
      "ID": 19,
      "initPos": [        453,        89.7,        6.5,        24      ],
      "endPos": [        477,        105.3,        6.5,        48      ],
      "goalPos": [
        [          433,          76.7,          6.5,          4        ],
        [          462,          94.9,          7.800000000000001,          33        ],
        [          430,          74.10000000000001,          7.800000000000001,          1        ],
        [          434,          76.7,          7.800000000000001,          5        ],
        [          459,          93.60000000000001,          6.5,          30        ],
        [          478,          105.3,          7.800000000000001,          49        ],
        [          456,          91,          7.800000000000001,          27        ],
        [          457,          92.3,          6.5,          28        ],
        [          438,          79.3,          7.800000000000001,          9        ],
        [          469,          100.10000000000001,          6.5,          40        ],
        [          452,          88.4,          7.800000000000001,          23        ],
        [          459,          93.60000000000001,          6.5,          30        ],
        [          462,          94.9,          7.800000000000001,          33        ],
        [          458,          92.3,          7.800000000000001,          29        ],
        [          473,          102.7,          6.5,          44        ],
        [          457,          92.3,          6.5,          28        ],
        [          446,          84.5,          7.800000000000001,          17        ],
        [          437,          79.3,          6.5,          8        ],
        [          473,          102.7,          6.5,          44        ],
        [          434,          76.7,          7.800000000000001,          5        ]
      ]
    }
  ]
}