{
  "MAPF": "CBS",
  "SAPF": "TDSP",
  "costFunction": "SIC",
  "heuristic": "",
  "nNodes": 54,
  "nodes": [
    [      429,      74.10000000000001,      6.5,      0    ],
    [      430,      74.10000000000001,      7.800000000000001,      1    ],
    [      431,      75.4,      6.5,      2    ],
    [      432,      75.4,      7.800000000000001,      3    ],
    [      433,      76.7,      6.5,      4    ],
    [      434,      76.7,      7.800000000000001,      5    ],
    [      435,      78,      6.5,      6    ],
    [      436,      78,      7.800000000000001,      7    ],
    [      437,      79.3,      6.5,      8    ],
    [      438,      79.3,      7.800000000000001,      9    ],
    [      439,      80.60000000000001,      6.5,      10    ],
    [      440,      80.60000000000001,      7.800000000000001,      11    ],
    [      441,      81.9,      6.5,      12    ],
    [      442,      81.9,      7.800000000000001,      13    ],
    [      443,      83.2,      6.5,      14    ],
    [      444,      83.2,      7.800000000000001,      15    ],
    [      445,      84.5,      6.5,      16    ],
    [      446,      84.5,      7.800000000000001,      17    ],
    [      447,      85.8,      6.5,      18    ],
    [      448,      85.8,      7.800000000000001,      19    ],
    [      449,      87.10000000000001,      6.5,      20    ],
    [      450,      87.10000000000001,      7.800000000000001,      21    ],
    [      451,      88.4,      6.5,      22    ],
    [      452,      88.4,      7.800000000000001,      23    ],
    [      453,      89.7,      6.5,      24    ],
    [      454,      89.7,      7.800000000000001,      25    ],
    [      455,      91,      6.5,      26    ],
    [      456,      91,      7.800000000000001,      27    ],
    [      457,      92.3,      6.5,      28    ],
    [      458,      92.3,      7.800000000000001,      29    ],
    [      459,      93.60000000000001,      6.5,      30    ],
    [      460,      93.60000000000001,      7.800000000000001,      31    ],
    [      461,      94.9,      6.5,      32    ],
    [      462,      94.9,      7.800000000000001,      33    ],
    [      463,      96.2,      6.5,      34    ],
    [      464,      96.2,      7.800000000000001,      35    ],
    [      465,      97.5,      6.5,      36    ],
    [      466,      97.5,      7.800000000000001,      37    ],
    [      467,      98.8,      6.5,      38    ],
    [      468,      98.8,      7.800000000000001,      39    ],
    [      469,      100.10000000000001,      6.5,      40    ],
    [      470,      100.10000000000001,      7.800000000000001,      41    ],
    [      471,      101.4,      6.5,      42    ],
    [      472,      101.4,      7.800000000000001,      43    ],
    [      473,      102.7,      6.5,      44    ],
    [      474,      102.7,      7.800000000000001,      45    ],
    [      475,      104,      6.5,      46    ],
    [      476,      104,      7.800000000000001,      47    ],
    [      477,      105.3,      6.5,      48    ],
    [      478,      105.3,      7.800000000000001,      49    ],
    [      479,      106.60000000000001,      6.5,      50    ],
    [      480,      106.60000000000001,      7.800000000000001,      51    ],
    [      481,      107.9,      6.5,      52    ],
    [      482,      107.9,      7.800000000000001,      53    ]
  ],
  "connect": [
    [      1,      1,      1,      0,      0,      0,      0,      0,      0,      0,      0,      0,      0,      0,      0,      0,      0,      0,      0,      0,      0,      0,      0,      0,      0,      0,      0,      0,      0,      0,      0,      0,      0,      0,      0,      0,      0,      0,      0,      0,      0,      0,      0,      0,      0,      0,      0,      0,      0,      0,      0,      0,      0,      0    ],
    [      1,      1,      0,      1,      0,      0,      0,      0,      0,      0,      0,      0,      0,      0,      0,      0,      0,      0,      0,      0,      0,      0,      0,      0,      0,      0,      0,      0,      0,      0,      0,      0,      0,      0,      0,      0,      0,      0,      0,      0,      0,      0,      0,      0,      0,      0,      0,      0,      0,      0,      0,      0,      0,      0    ],
    [      1,      0,      1,      1,      1,      0,      0,      0,      0,      0,      0,      0,      0,      0,      0,      0,      0,      0,      0,      0,      0,      0,      0,      0,      0,      0,      0,      0,      0,      0,      0,      0,      0,      0,      0,      0,      0,      0,      0,      0,      0,      0,      0,      0,      0,      0,      0,      0,      0,      0,      0,      0,      0,      0    ],
    [      0,      1,      1,      1,      0,      1,      0,      0,      0,      0,      0,      0,      0,      0,      0,      0,      0,      0,      0,      0,      0,      0,      0,      0,      0,      0,      0,      0,      0,      0,      0,      0,      0,      0,      0,      0,      0,      0,      0,      0,      0,      0,      0,      0,      0,      0,      0,      0,      0,      0,      0,      0,      0,      0    ],
    [      0,      0,      1,      0,      1,      1,      1,      0,      0,      0,      0,      0,      0,      0,      0,      0,      0,      0,      0,      0,      0,      0,      0,      0,      0,      0,      0,      0,      0,      0,      0,      0,      0,      0,      0,      0,      0,      0,      0,      0,      0,      0,      0,      0,      0,      0,      0,      0,      0,      0,      0,      0,      0,      0    ],
    [      0,      0,      0,      1,      1,      1,      0,      1,      0,      0,      0,      0,      0,      0,      0,      0,      0,      0,      0,      0,      0,      0,      0,      0,      0,      0,      0,      0,      0,      0,      0,      0,      0,      0,      0,      0,      0,      0,      0,      0,      0,      0,      0,      0,      0,      0,      0,      0,      0,      0,      0,      0,      0,      0    ],
    [      0,      0,      0,      0,      1,      0,      1,      1,      1,      0,      0,      0,      0,      0,      0,      0,      0,      0,      0,      0,      0,      0,      0,      0,      0,      0,      0,      0,      0,      0,      0,      0,      0,      0,      0,      0,      0,      0,      0,      0,      0,      0,      0,      0,      0,      0,      0,      0,      0,      0,      0,      0,      0,      0    ],
    [      0,      0,      0,      0,      0,      1,      1,      1,      0,      1,      0,      0,      0,      0,      0,      0,      0,      0,      0,      0,      0,      0,      0,      0,      0,      0,      0,      0,      0,      0,      0,      0,      0,      0,      0,      0,      0,      0,      0,      0,      0,      0,      0,      0,      0,      0,      0,      0,      0,      0,      0,      0,      0,      0    ],
    [      0,      0,      0,      0,      0,      0,      1,      0,      1,      1,      1,      0,      0,      0,      0,      0,      0,      0,      0,      0,      0,      0,      0,      0,      0,      0,      0,      0,      0,      0,      0,      0,      0,      0,      0,      0,      0,      0,      0,      0,      0,      0,      0,      0,      0,      0,      0,      0,      0,      0,      0,      0,      0,      0    ],
    [      0,      0,      0,      0,      0,      0,      0,      1,      1,      1,      0,      1,      0,      0,      0,      0,      0,      0,      0,      0,      0,      0,      0,      0,      0,      0,      0,      0,      0,      0,      0,      0,      0,      0,      0,      0,      0,      0,      0,      0,      0,      0,      0,      0,      0,      0,      0,      0,      0,      0,      0,      0,      0,      0    ],
    [      0,      0,      0,      0,      0,      0,      0,      0,      1,      0,      1,      1,      1,      0,      0,      0,      0,      0,      0,      0,      0,      0,      0,      0,      0,      0,      0,      0,      0,      0,      0,      0,      0,      0,      0,      0,      0,      0,      0,      0,      0,      0,      0,      0,      0,      0,      0,      0,      0,      0,      0,      0,      0,      0    ],
    [      0,      0,      0,      0,      0,      0,      0,      0,      0,      1,      1,      1,      0,      1,      0,      0,      0,      0,      0,      0,      0,      0,      0,      0,      0,      0,      0,      0,      0,      0,      0,      0,      0,      0,      0,      0,      0,      0,      0,      0,      0,      0,      0,      0,      0,      0,      0,      0,      0,      0,      0,      0,      0,      0    ],
    [      0,      0,      0,      0,      0,      0,      0,      0,      0,      0,      1,      0,      1,      1,      1,      0,      0,      0,      0,      0,      0,      0,      0,      0,      0,      0,      0,      0,      0,      0,      0,      0,      0,      0,      0,      0,      0,      0,      0,      0,      0,      0,      0,      0,      0,      0,      0,      0,      0,      0,      0,      0,      0,      0    ],
    [      0,      0,      0,      0,      0,      0,      0,      0,      0,      0,      0,      1,      1,      1,      0,      1,      0,      0,      0,      0,      0,      0,      0,      0,      0,      0,      0,      0,      0,      0,      0,      0,      0,      0,      0,      0,      0,      0,      0,      0,      0,      0,      0,      0,      0,      0,      0,      0,      0,      0,      0,      0,      0,      0    ],
    [      0,      0,      0,      0,      0,      0,      0,      0,      0,      0,      0,      0,      1,      0,      1,      1,      1,      0,      0,      0,      0,      0,      0,      0,      0,      0,      0,      0,      0,      0,      0,      0,      0,      0,      0,      0,      0,      0,      0,      0,      0,      0,      0,      0,      0,      0,      0,      0,      0,      0,      0,      0,      0,      0    ],
    [      0,      0,      0,      0,      0,      0,      0,      0,      0,      0,      0,      0,      0,      1,      1,      1,      0,      1,      0,      0,      0,      0,      0,      0,      0,      0,      0,      0,      0,      0,      0,      0,      0,      0,      0,      0,      0,      0,      0,      0,      0,      0,      0,      0,      0,      0,      0,      0,      0,      0,      0,      0,      0,      0    ],
    [      0,      0,      0,      0,      0,      0,      0,      0,      0,      0,      0,      0,      0,      0,      1,      0,      1,      1,      1,      0,      0,      0,      0,      0,      0,      0,      0,      0,      0,      0,      0,      0,      0,      0,      0,      0,      0,      0,      0,      0,      0,      0,      0,      0,      0,      0,      0,      0,      0,      0,      0,      0,      0,      0    ],
    [      0,      0,      0,      0,      0,      0,      0,      0,      0,      0,      0,      0,      0,      0,      0,      1,      1,      1,      0,      1,      0,      0,      0,      0,      0,      0,      0,      0,      0,      0,      0,      0,      0,      0,      0,      0,      0,      0,      0,      0,      0,      0,      0,      0,      0,      0,      0,      0,      0,      0,      0,      0,      0,      0    ],
    [      0,      0,      0,      0,      0,      0,      0,      0,      0,      0,      0,      0,      0,      0,      0,      0,      1,      0,      1,      1,      1,      0,      0,      0,      0,      0,      0,      0,      0,      0,      0,      0,      0,      0,      0,      0,      0,      0,      0,      0,      0,      0,      0,      0,      0,      0,      0,      0,      0,      0,      0,      0,      0,      0    ],
    [      0,      0,      0,      0,      0,      0,      0,      0,      0,      0,      0,      0,      0,      0,      0,      0,      0,      1,      1,      1,      0,      1,      0,      0,      0,      0,      0,      0,      0,      0,      0,      0,      0,      0,      0,      0,      0,      0,      0,      0,      0,      0,      0,      0,      0,      0,      0,      0,      0,      0,      0,      0,      0,      0    ],
    [      0,      0,      0,      0,      0,      0,      0,      0,      0,      0,      0,      0,      0,      0,      0,      0,      0,      0,      1,      0,      1,      1,      1,      0,      0,      0,      0,      0,      0,      0,      0,      0,      0,      0,      0,      0,      0,      0,      0,      0,      0,      0,      0,      0,      0,      0,      0,      0,      0,      0,      0,      0,      0,      0    ],
    [      0,      0,      0,      0,      0,      0,      0,      0,      0,      0,      0,      0,      0,      0,      0,      0,      0,      0,      0,      1,      1,      1,      0,      1,      0,      0,      0,      0,      0,      0,      0,      0,      0,      0,      0,      0,      0,      0,      0,      0,      0,      0,      0,      0,      0,      0,      0,      0,      0,      0,      0,      0,      0,      0    ],
    [      0,      0,      0,      0,      0,      0,      0,      0,      0,      0,      0,      0,      0,      0,      0,      0,      0,      0,      0,      0,      1,      0,      1,      1,      1,      0,      0,      0,      0,      0,      0,      0,      0,      0,      0,      0,      0,      0,      0,      0,      0,      0,      0,      0,      0,      0,      0,      0,      0,      0,      0,      0,      0,      0    ],
    [      0,      0,      0,      0,      0,      0,      0,      0,      0,      0,      0,      0,      0,      0,      0,      0,      0,      0,      0,      0,      0,      1,      1,      1,      0,      1,      0,      0,      0,      0,      0,      0,      0,      0,      0,      0,      0,      0,      0,      0,      0,      0,      0,      0,      0,      0,      0,      0,      0,      0,      0,      0,      0,      0    ],
    [      0,      0,      0,      0,      0,      0,      0,      0,      0,      0,      0,      0,      0,      0,      0,      0,      0,      0,      0,      0,      0,      0,      1,      0,      1,      1,      1,      0,      0,      0,      0,      0,      0,      0,      0,      0,      0,      0,      0,      0,      0,      0,      0,      0,      0,      0,      0,      0,      0,      0,      0,      0,      0,      0    ],
    [      0,      0,      0,      0,      0,      0,      0,      0,      0,      0,      0,      0,      0,      0,      0,      0,      0,      0,      0,      0,      0,      0,      0,      1,      1,      1,      0,      1,      0,      0,      0,      0,      0,      0,      0,      0,      0,      0,      0,      0,      0,      0,      0,      0,      0,      0,      0,      0,      0,      0,      0,      0,      0,      0    ],
    [      0,      0,      0,      0,      0,      0,      0,      0,      0,      0,      0,      0,      0,      0,      0,      0,      0,      0,      0,      0,      0,      0,      0,      0,      1,      0,      1,      1,      1,      0,      0,      0,      0,      0,      0,      0,      0,      0,      0,      0,      0,      0,      0,      0,      0,      0,      0,      0,      0,      0,      0,      0,      0,      0    ],
    [      0,      0,      0,      0,      0,      0,      0,      0,      0,      0,      0,      0,      0,      0,      0,      0,      0,      0,      0,      0,      0,      0,      0,      0,      0,      1,      1,      1,      0,      1,      0,      0,      0,      0,      0,      0,      0,      0,      0,      0,      0,      0,      0,      0,      0,      0,      0,      0,      0,      0,      0,      0,      0,      0    ],
    [      0,      0,      0,      0,      0,      0,      0,      0,      0,      0,      0,      0,      0,      0,      0,      0,      0,      0,      0,      0,      0,      0,      0,      0,      0,      0,      1,      0,      1,      1,      1,      0,      0,      0,      0,      0,      0,      0,      0,      0,      0,      0,      0,      0,      0,      0,      0,      0,      0,      0,      0,      0,      0,      0    ],
    [      0,      0,      0,      0,      0,      0,      0,      0,      0,      0,      0,      0,      0,      0,      0,      0,      0,      0,      0,      0,      0,      0,      0,      0,      0,      0,      0,      1,      1,      1,      0,      1,      0,      0,      0,      0,      0,      0,      0,      0,      0,      0,      0,      0,      0,      0,      0,      0,      0,      0,      0,      0,      0,      0    ],
    [      0,      0,      0,      0,      0,      0,      0,      0,      0,      0,      0,      0,      0,      0,      0,      0,      0,      0,      0,      0,      0,      0,      0,      0,      0,      0,      0,      0,      1,      0,      1,      1,      1,      0,      0,      0,      0,      0,      0,      0,      0,      0,      0,      0,      0,      0,      0,      0,      0,      0,      0,      0,      0,      0    ],
    [      0,      0,      0,      0,      0,      0,      0,      0,      0,      0,      0,      0,      0,      0,      0,      0,      0,      0,      0,      0,      0,      0,      0,      0,      0,      0,      0,      0,      0,      1,      1,      1,      0,      1,      0,      0,      0,      0,      0,      0,      0,      0,      0,      0,      0,      0,      0,      0,      0,      0,      0,      0,      0,      0    ],
    [      0,      0,      0,      0,      0,      0,      0,      0,      0,      0,      0,      0,      0,      0,      0,      0,      0,      0,      0,      0,      0,      0,      0,      0,      0,      0,      0,      0,      0,      0,      1,      0,      1,      1,      1,      0,      0,      0,      0,      0,      0,      0,      0,      0,      0,      0,      0,      0,      0,      0,      0,      0,      0,      0    ],
    [      0,      0,      0,      0,      0,      0,      0,      0,      0,      0,      0,      0,      0,      0,      0,      0,      0,      0,      0,      0,      0,      0,      0,      0,      0,      0,      0,      0,      0,      0,      0,      1,      1,      1,      0,      1,      0,      0,      0,      0,      0,      0,      0,      0,      0,      0,      0,      0,      0,      0,      0,      0,      0,      0    ],
    [      0,      0,      0,      0,      0,      0,      0,      0,      0,      0,      0,      0,      0,      0,      0,      0,      0,      0,      0,      0,      0,      0,      0,      0,      0,      0,      0,      0,      0,      0,      0,      0,      1,      0,      1,      1,      1,      0,      0,      0,      0,      0,      0,      0,      0,      0,      0,      0,      0,      0,      0,      0,      0,      0    ],
    [      0,      0,      0,      0,      0,      0,      0,      0,      0,      0,      0,      0,      0,      0,      0,      0,      0,      0,      0,      0,      0,      0,      0,      0,      0,      0,      0,      0,      0,      0,      0,      0,      0,      1,      1,      1,      0,      1,      0,      0,      0,      0,      0,      0,      0,      0,      0,      0,      0,      0,      0,      0,      0,      0    ],
    [      0,      0,      0,      0,      0,      0,      0,      0,      0,      0,      0,      0,      0,      0,      0,      0,      0,      0,      0,      0,      0,      0,      0,      0,      0,      0,      0,      0,      0,      0,      0,      0,      0,      0,      1,      0,      1,      1,      1,      0,      0,      0,      0,      0,      0,      0,      0,      0,      0,      0,      0,      0,      0,      0    ],
    [      0,      0,      0,      0,      0,      0,      0,      0,      0,      0,      0,      0,      0,      0,      0,      0,      0,      0,      0,      0,      0,      0,      0,      0,      0,      0,      0,      0,      0,      0,      0,      0,      0,      0,      0,      1,      1,      1,      0,      1,      0,      0,      0,      0,      0,      0,      0,      0,      0,      0,      0,      0,      0,      0    ],
    [      0,      0,      0,      0,      0,      0,      0,      0,      0,      0,      0,      0,      0,      0,      0,      0,      0,      0,      0,      0,      0,      0,      0,      0,      0,      0,      0,      0,      0,      0,      0,      0,      0,      0,      0,      0,      1,      0,      1,      1,      1,      0,      0,      0,      0,      0,      0,      0,      0,      0,      0,      0,      0,      0    ],
    [      0,      0,      0,      0,      0,      0,      0,      0,      0,      0,      0,      0,      0,      0,      0,      0,      0,      0,      0,      0,      0,      0,      0,      0,      0,      0,      0,      0,      0,      0,      0,      0,      0,      0,      0,      0,      0,      1,      1,      1,      0,      1,      0,      0,      0,      0,      0,      0,      0,      0,      0,      0,      0,      0    ],
    [      0,      0,      0,      0,      0,      0,      0,      0,      0,      0,      0,      0,      0,      0,      0,      0,      0,      0,      0,      0,      0,      0,      0,      0,      0,      0,      0,      0,      0,      0,      0,      0,      0,      0,      0,      0,      0,      0,      1,      0,      1,      1,      1,      0,      0,      0,      0,      0,      0,      0,      0,      0,      0,      0    ],
    [      0,      0,      0,      0,      0,      0,      0,      0,      0,      0,      0,      0,      0,      0,      0,      0,      0,      0,      0,      0,      0,      0,      0,      0,      0,      0,      0,      0,      0,      0,      0,      0,      0,      0,      0,      0,      0,      0,      0,      1,      1,      1,      0,      1,      0,      0,      0,      0,      0,      0,      0,      0,      0,      0    ],
    [      0,      0,      0,      0,      0,      0,      0,      0,      0,      0,      0,      0,      0,      0,      0,      0,      0,      0,      0,      0,      0,      0,      0,      0,      0,      0,      0,      0,      0,      0,      0,      0,      0,      0,      0,      0,      0,      0,      0,      0,      1,      0,      1,      1,      1,      0,      0,      0,      0,      0,      0,      0,      0,      0    ],
    [      0,      0,      0,      0,      0,      0,      0,      0,      0,      0,      0,      0,      0,      0,      0,      0,      0,      0,      0,      0,      0,      0,      0,      0,      0,      0,      0,      0,      0,      0,      0,      0,      0,      0,      0,      0,      0,      0,      0,      0,      0,      1,      1,      1,      0,      1,      0,      0,      0,      0,      0,      0,      0,      0    ],
    [      0,      0,      0,      0,      0,      0,      0,      0,      0,      0,      0,      0,      0,      0,      0,      0,      0,      0,      0,      0,      0,      0,      0,      0,      0,      0,      0,      0,      0,      0,      0,      0,      0,      0,      0,      0,      0,      0,      0,      0,      0,      0,      1,      0,      1,      1,      1,      0,      0,      0,      0,      0,      0,      0    ],
    [      0,      0,      0,      0,      0,      0,      0,      0,      0,      0,      0,      0,      0,      0,      0,      0,      0,      0,      0,      0,      0,      0,      0,      0,      0,      0,      0,      0,      0,      0,      0,      0,      0,      0,      0,      0,      0,      0,      0,      0,      0,      0,      0,      1,      1,      1,      0,      1,      0,      0,      0,      0,      0,      0    ],
    [      0,      0,      0,      0,      0,      0,      0,      0,      0,      0,      0,      0,      0,      0,      0,      0,      0,      0,      0,      0,      0,      0,      0,      0,      0,      0,      0,      0,      0,      0,      0,      0,      0,      0,      0,      0,      0,      0,      0,      0,      0,      0,      0,      0,      1,      0,      1,      1,      1,      0,      0,      0,      0,      0    ],
    [      0,      0,      0,      0,      0,      0,      0,      0,      0,      0,      0,      0,      0,      0,      0,      0,      0,      0,      0,      0,      0,      0,      0,      0,      0,      0,      0,      0,      0,      0,      0,      0,      0,      0,      0,      0,      0,      0,      0,      0,      0,      0,      0,      0,      0,      1,      1,      1,      0,      1,      0,      0,      0,      0    ],
    [      0,      0,      0,      0,      0,      0,      0,      0,      0,      0,      0,      0,      0,      0,      0,      0,      0,      0,      0,      0,      0,      0,      0,      0,      0,      0,      0,      0,      0,      0,      0,      0,      0,      0,      0,      0,      0,      0,      0,      0,      0,      0,      0,      0,      0,      0,      1,      0,      1,      1,      1,      0,      0,      0    ],
    [      0,      0,      0,      0,      0,      0,      0,      0,      0,      0,      0,      0,      0,      0,      0,      0,      0,      0,      0,      0,      0,      0,      0,      0,      0,      0,      0,      0,      0,      0,      0,      0,      0,      0,      0,      0,      0,      0,      0,      0,      0,      0,      0,      0,      0,      0,      0,      1,      1,      1,      0,      1,      0,      0    ],
    [      0,      0,      0,      0,      0,      0,      0,      0,      0,      0,      0,      0,      0,      0,      0,      0,      0,      0,      0,      0,      0,      0,      0,      0,      0,      0,      0,      0,      0,      0,      0,      0,      0,      0,      0,      0,      0,      0,      0,      0,      0,      0,      0,      0,      0,      0,      0,      0,      1,      0,      1,      1,      1,      0    ],
    [      0,      0,      0,      0,      0,      0,      0,      0,      0,      0,      0,      0,      0,      0,      0,      0,      0,      0,      0,      0,      0,      0,      0,      0,      0,      0,      0,      0,      0,      0,      0,      0,      0,      0,      0,      0,      0,      0,      0,      0,      0,      0,      0,      0,      0,      0,      0,      0,      0,      1,      1,      1,      0,      1    ],
    [      0,      0,      0,      0,      0,      0,      0,      0,      0,      0,      0,      0,      0,      0,      0,      0,      0,      0,      0,      0,      0,      0,      0,      0,      0,      0,      0,      0,      0,      0,      0,      0,      0,      0,      0,      0,      0,      0,      0,      0,      0,      0,      0,      0,      0,      0,      0,      0,      0,      0,      1,      0,      1,      1    ],
    [      0,      0,      0,      0,      0,      0,      0,      0,      0,      0,      0,      0,      0,      0,      0,      0,      0,      0,      0,      0,      0,      0,      0,      0,      0,      0,      0,      0,      0,      0,      0,      0,      0,      0,      0,      0,      0,      0,      0,      0,      0,      0,      0,      0,      0,      0,      0,      0,      0,      0,      0,      1,      1,      1    ]
  ],
  "nAgents": 5,
  "agents": [    {
      "ID": 0,
      "initPos": [        465,        97.5,        6.5,        36      ],
      "endPos": [        462,        94.9,        7.800000000000001,        33      ],
      "goalPos": [
        [          448,          85.8,          7.800000000000001,          19        ],
        [          440,          80.60000000000001,          7.800000000000001,          11        ],
        [          477,          105.3,          6.5,          48        ],
        [          443,          83.2,          6.5,          14        ],
        [          463,          96.2,          6.5,          34        ],
        [          480,          106.60000000000001,          7.800000000000001,          51        ],
        [          482,          107.9,          7.800000000000001,          53        ],
        [          470,          100.10000000000001,          7.800000000000001,          41        ],
        [          467,          98.8,          6.5,          38        ],
        [          442,          81.9,          7.800000000000001,          13        ],
        [          436,          78,          7.800000000000001,          7        ],
        [          459,          93.60000000000001,          6.5,          30        ],
        [          469,          100.10000000000001,          6.5,          40        ],
        [          450,          87.10000000000001,          7.800000000000001,          21        ],
        [          464,          96.2,          7.800000000000001,          35        ],
        [          463,          96.2,          6.5,          34        ],
        [          456,          91,          7.800000000000001,          27        ],
        [          477,          105.3,          6.5,          48        ],
        [          429,          74.10000000000001,          6.5,          0        ],
        [          480,          106.60000000000001,          7.800000000000001,          51        ]
      ]
    },
    {
      "ID": 1,
      "initPos": [        456,        91,        7.800000000000001,        27      ],
      "endPos": [        478,        105.3,        7.800000000000001,        49      ],
      "goalPos": [
        [          444,          83.2,          7.800000000000001,          15        ],
        [          438,          79.3,          7.800000000000001,          9        ],
        [          477,          105.3,          6.5,          48        ],
        [          474,          102.7,          7.800000000000001,          45        ],
        [          438,          79.3,          7.800000000000001,          9        ],
        [          448,          85.8,          7.800000000000001,          19        ],
        [          436,          78,          7.800000000000001,          7        ],
        [          450,          87.10000000000001,          7.800000000000001,          21        ],
        [          442,          81.9,          7.800000000000001,          13        ],
        [          458,          92.3,          7.800000000000001,          29        ],
        [          446,          84.5,          7.800000000000001,          17        ],
        [          429,          74.10000000000001,          6.5,          0        ],
        [          446,          84.5,          7.800000000000001,          17        ],
        [          472,          101.4,          7.800000000000001,          43        ],
        [          457,          92.3,          6.5,          28        ],
        [          438,          79.3,          7.800000000000001,          9        ],
        [          436,          78,          7.800000000000001,          7        ],
        [          455,          91,          6.5,          26        ],
        [          465,          97.5,          6.5,          36        ],
        [          437,          79.3,          6.5,          8        ]
      ]
    },
    {
      "ID": 2,
      "initPos": [        430,        74.10000000000001,        7.800000000000001,        1      ],
      "endPos": [        447,        85.8,        6.5,        18      ],
      "goalPos": [
        [          440,          80.60000000000001,          7.800000000000001,          11        ],
        [          480,          106.60000000000001,          7.800000000000001,          51        ],
        [          467,          98.8,          6.5,          38        ],
        [          474,          102.7,          7.800000000000001,          45        ],
        [          481,          107.9,          6.5,          52        ],
        [          463,          96.2,          6.5,          34        ],
        [          448,          85.8,          7.800000000000001,          19        ],
        [          475,          104,          6.5,          46        ],
        [          471,          101.4,          6.5,          42        ],
        [          480,          106.60000000000001,          7.800000000000001,          51        ],
        [          435,          78,          6.5,          6        ],
        [          441,          81.9,          6.5,          12        ],
        [          464,          96.2,          7.800000000000001,          35        ],
        [          449,          87.10000000000001,          6.5,          20        ],
        [          450,          87.10000000000001,          7.800000000000001,          21        ],
        [          464,          96.2,          7.800000000000001,          35        ],
        [          457,          92.3,          6.5,          28        ],
        [          432,          75.4,          7.800000000000001,          3        ],
        [          480,          106.60000000000001,          7.800000000000001,          51        ],
        [          457,          92.3,          6.5,          28        ]
      ]
    },
    {
      "ID": 3,
      "initPos": [        470,        100.10000000000001,        7.800000000000001,        41      ],
      "endPos": [        439,        80.60000000000001,        6.5,        10      ],
      "goalPos": [
        [          476,          104,          7.800000000000001,          47        ],
        [          469,          100.10000000000001,          6.5,          40        ],
        [          465,          97.5,          6.5,          36        ],
        [          470,          100.10000000000001,          7.800000000000001,          41        ],
        [          461,          94.9,          6.5,          32        ],
        [          454,          89.7,          7.800000000000001,          25        ],
        [          473,          102.7,          6.5,          44        ],
        [          471,          101.4,          6.5,          42        ],
        [          461,          94.9,          6.5,          32        ],
        [          480,          106.60000000000001,          7.800000000000001,          51        ],
        [          431,          75.4,          6.5,          2        ],
        [          442,          81.9,          7.800000000000001,          13        ],
        [          452,          88.4,          7.800000000000001,          23        ],
        [          446,          84.5,          7.800000000000001,          17        ],
        [          455,          91,          6.5,          26        ],
        [          438,          79.3,          7.800000000000001,          9        ],
        [          459,          93.60000000000001,          6.5,          30        ],
        [          436,          78,          7.800000000000001,          7        ],
        [          449,          87.10000000000001,          6.5,          20        ],
        [          470,          100.10000000000001,          7.800000000000001,          41        ]
      ]
    },
    {
      "ID": 4,
      "initPos": [        449,        87.10000000000001,        6.5,        20      ],
      "endPos": [        460,        93.60000000000001,        7.800000000000001,        31      ],
      "goalPos": [
        [          456,          91,          7.800000000000001,          27        ],
        [          471,          101.4,          6.5,          42        ],
        [          468,          98.8,          7.800000000000001,          39        ],
        [          432,          75.4,          7.800000000000001,          3        ],
        [          442,          81.9,          7.800000000000001,          13        ],
        [          432,          75.4,          7.800000000000001,          3        ],
        [          454,          89.7,          7.800000000000001,          25        ],
        [          459,          93.60000000000001,          6.5,          30        ],
        [          430,          74.10000000000001,          7.800000000000001,          1        ],
        [          437,          79.3,          6.5,          8        ],
        [          445,          84.5,          6.5,          16        ],
        [          446,          84.5,          7.800000000000001,          17        ],
        [          432,          75.4,          7.800000000000001,          3        ],
        [          434,          76.7,          7.800000000000001,          5        ],
        [          465,          97.5,          6.5,          36        ],
        [          477,          105.3,          6.5,          48        ],
        [          468,          98.8,          7.800000000000001,          39        ],
        [          451,          88.4,          6.5,          22        ],
        [          480,          106.60000000000001,          7.800000000000001,          51        ],
        [          475,          104,          6.5,          46        ]
      ]
    }
  ]
}