{
  "MAPF": "CBS",
  "SAPF": "TDSP",
  "costFunction": "SIC",
  "heuristic": "",
  "nAgents": 20,
  "nNodes": 39,
  "connect": [
    [      1,      1,      0,      0,      0,      0,      0,      0,      0,      0,      0,      0,      0,      0,      0,      0,      0,      0,      0,      0,      0,      0,      0,      0,      0,      0,      0,      0,      0,      0,      0,      0,      0,      0,      0,      0,      0,      0,      0    ],
    [      1,      1,      1,      0,      0,      0,      0,      0,      0,      0,      0,      0,      0,      0,      0,      0,      0,      0,      0,      0,      0,      0,      0,      0,      0,      0,      0,      0,      0,      0,      0,      0,      0,      0,      0,      0,      0,      0,      0    ],
    [      0,      1,      1,      1,      0,      0,      0,      0,      0,      0,      0,      0,      0,      0,      0,      0,      0,      0,      0,      0,      0,      0,      0,      0,      0,      0,      0,      0,      0,      0,      0,      0,      0,      0,      0,      0,      0,      0,      0    ],
    [      0,      0,      1,      1,      1,      0,      0,      0,      0,      0,      0,      0,      0,      0,      0,      0,      0,      0,      0,      0,      0,      0,      0,      0,      0,      0,      0,      0,      0,      0,      0,      0,      0,      0,      0,      0,      0,      0,      0    ],
    [      0,      0,      0,      1,      1,      1,      0,      0,      0,      0,      0,      0,      0,      0,      0,      0,      0,      0,      0,      0,      0,      0,      0,      0,      0,      0,      0,      0,      0,      0,      0,      0,      0,      0,      0,      0,      0,      0,      0    ],
    [      0,      0,      0,      0,      1,      1,      1,      0,      0,      0,      0,      0,      0,      0,      0,      0,      0,      0,      0,      0,      0,      0,      0,      0,      0,      0,      0,      0,      0,      0,      0,      0,      0,      0,      0,      0,      0,      0,      0    ],
    [      0,      0,      0,      0,      0,      1,      1,      1,      0,      0,      0,      0,      0,      0,      0,      0,      0,      0,      0,      0,      0,      0,      0,      0,      0,      0,      0,      0,      0,      0,      0,      0,      0,      0,      0,      0,      0,      0,      0    ],
    [      0,      0,      0,      0,      0,      0,      1,      1,      1,      0,      0,      0,      0,      0,      0,      0,      0,      0,      0,      0,      0,      0,      0,      0,      0,      0,      0,      0,      0,      0,      0,      0,      0,      0,      0,      0,      0,      0,      0    ],
    [      0,      0,      0,      0,      0,      0,      0,      1,      1,      1,      0,      0,      0,      0,      0,      0,      0,      0,      0,      0,      0,      0,      0,      0,      0,      0,      0,      0,      0,      0,      0,      0,      0,      0,      0,      0,      0,      0,      0    ],
    [      0,      0,      0,      0,      0,      0,      0,      0,      1,      1,      1,      0,      0,      0,      0,      0,      0,      0,      0,      0,      0,      0,      0,      0,      0,      0,      0,      0,      0,      0,      0,      0,      0,      0,      0,      0,      0,      0,      0    ],
    [      0,      0,      0,      0,      0,      0,      0,      0,      0,      1,      1,      1,      0,      0,      0,      0,      0,      0,      0,      0,      0,      0,      0,      0,      0,      0,      0,      0,      0,      0,      0,      0,      0,      0,      0,      0,      0,      0,      0    ],
    [      0,      0,      0,      0,      0,      0,      0,      0,      0,      0,      1,      1,      1,      0,      0,      0,      0,      0,      0,      0,      0,      0,      0,      0,      0,      0,      0,      0,      0,      0,      0,      0,      0,      0,      0,      0,      0,      0,      0    ],
    [      0,      0,      0,      0,      0,      0,      0,      0,      0,      0,      0,      1,      1,      0,      0,      0,      0,      0,      0,      0,      0,      0,      0,      0,      0,      1,      0,      0,      0,      0,      0,      0,      0,      0,      0,      0,      0,      0,      0    ],
    [      0,      0,      0,      0,      0,      0,      0,      0,      0,      0,      0,      0,      0,      1,      1,      0,      0,      0,      0,      0,      0,      0,      0,      0,      0,      0,      0,      0,      0,      0,      0,      0,      0,      0,      0,      0,      0,      0,      0    ],
    [      0,      0,      0,      0,      0,      0,      0,      0,      0,      0,      0,      0,      0,      1,      1,      1,      0,      0,      0,      0,      0,      0,      0,      0,      0,      0,      0,      0,      0,      0,      0,      0,      0,      0,      0,      0,      0,      0,      0    ],
    [      0,      0,      0,      0,      0,      0,      0,      0,      0,      0,      0,      0,      0,      0,      1,      1,      1,      0,      0,      0,      0,      0,      0,      0,      0,      0,      0,      0,      0,      0,      0,      0,      0,      0,      0,      0,      0,      0,      0    ],
    [      0,      0,      0,      0,      0,      0,      0,      0,      0,      0,      0,      0,      0,      0,      0,      1,      1,      1,      0,      0,      0,      0,      0,      0,      0,      0,      0,      0,      0,      0,      0,      0,      0,      0,      0,      0,      0,      0,      0    ],
    [      0,      0,      0,      0,      0,      0,      0,      0,      0,      0,      0,      0,      0,      0,      0,      0,      1,      1,      1,      0,      0,      0,      0,      0,      0,      0,      0,      0,      0,      0,      0,      0,      0,      0,      0,      0,      0,      0,      0    ],
    [      0,      0,      0,      0,      0,      0,      0,      0,      0,      0,      0,      0,      0,      0,      0,      0,      0,      1,      1,      1,      0,      0,      0,      0,      0,      0,      0,      0,      0,      0,      0,      0,      0,      0,      0,      0,      0,      0,      0    ],
    [      0,      0,      0,      0,      0,      0,      0,      0,      0,      0,      0,      0,      0,      0,      0,      0,      0,      0,      1,      1,      1,      0,      0,      0,      0,      0,      0,      0,      0,      0,      0,      0,      0,      0,      0,      0,      0,      0,      0    ],
    [      0,      0,      0,      0,      0,      0,      0,      0,      0,      0,      0,      0,      0,      0,      0,      0,      0,      0,      0,      1,      1,      1,      0,      0,      0,      0,      0,      0,      0,      0,      0,      0,      0,      0,      0,      0,      0,      0,      0    ],
    [      0,      0,      0,      0,      0,      0,      0,      0,      0,      0,      0,      0,      0,      0,      0,      0,      0,      0,      0,      0,      1,      1,      1,      0,      0,      0,      0,      0,      0,      0,      0,      0,      0,      0,      0,      0,      0,      0,      0    ],
    [      0,      0,      0,      0,      0,      0,      0,      0,      0,      0,      0,      0,      0,      0,      0,      0,      0,      0,      0,      0,      0,      1,      1,      1,      0,      0,      0,      0,      0,      0,      0,      0,      0,      0,      0,      0,      0,      0,      0    ],
    [      0,      0,      0,      0,      0,      0,      0,      0,      0,      0,      0,      0,      0,      0,      0,      0,      0,      0,      0,      0,      0,      0,      1,      1,      1,      0,      0,      0,      0,      0,      0,      0,      0,      0,      0,      0,      0,      0,      0    ],
    [      0,      0,      0,      0,      0,      0,      0,      0,      0,      0,      0,      0,      0,      0,      0,      0,      0,      0,      0,      0,      0,      0,      0,      1,      1,      1,      0,      0,      0,      0,      0,      0,      0,      0,      0,      0,      0,      0,      0    ],
    [      0,      0,      0,      0,      0,      0,      0,      0,      0,      0,      0,      0,      1,      0,      0,      0,      0,      0,      0,      0,      0,      0,      0,      0,      1,      1,      0,      0,      0,      0,      0,      0,      0,      0,      0,      0,      0,      0,      1    ],
    [      0,      0,      0,      0,      0,      0,      0,      0,      0,      0,      0,      0,      0,      0,      0,      0,      0,      0,      0,      0,      0,      0,      0,      0,      0,      0,      1,      1,      0,      0,      0,      0,      0,      0,      0,      0,      0,      0,      0    ],
    [      0,      0,      0,      0,      0,      0,      0,      0,      0,      0,      0,      0,      0,      0,      0,      0,      0,      0,      0,      0,      0,      0,      0,      0,      0,      0,      1,      1,      1,      0,      0,      0,      0,      0,      0,      0,      0,      0,      0    ],
    [      0,      0,      0,      0,      0,      0,      0,      0,      0,      0,      0,      0,      0,      0,      0,      0,      0,      0,      0,      0,      0,      0,      0,      0,      0,      0,      0,      1,      1,      1,      0,      0,      0,      0,      0,      0,      0,      0,      0    ],
    [      0,      0,      0,      0,      0,      0,      0,      0,      0,      0,      0,      0,      0,      0,      0,      0,      0,      0,      0,      0,      0,      0,      0,      0,      0,      0,      0,      0,      1,      1,      1,      0,      0,      0,      0,      0,      0,      0,      0    ],
    [      0,      0,      0,      0,      0,      0,      0,      0,      0,      0,      0,      0,      0,      0,      0,      0,      0,      0,      0,      0,      0,      0,      0,      0,      0,      0,      0,      0,      0,      1,      1,      1,      0,      0,      0,      0,      0,      0,      0    ],
    [      0,      0,      0,      0,      0,      0,      0,      0,      0,      0,      0,      0,      0,      0,      0,      0,      0,      0,      0,      0,      0,      0,      0,      0,      0,      0,      0,      0,      0,      0,      1,      1,      1,      0,      0,      0,      0,      0,      0    ],
    [      0,      0,      0,      0,      0,      0,      0,      0,      0,      0,      0,      0,      0,      0,      0,      0,      0,      0,      0,      0,      0,      0,      0,      0,      0,      0,      0,      0,      0,      0,      0,      1,      1,      1,      0,      0,      0,      0,      0    ],
    [      0,      0,      0,      0,      0,      0,      0,      0,      0,      0,      0,      0,      0,      0,      0,      0,      0,      0,      0,      0,      0,      0,      0,      0,      0,      0,      0,      0,      0,      0,      0,      0,      1,      1,      1,      0,      0,      0,      0    ],
    [      0,      0,      0,      0,      0,      0,      0,      0,      0,      0,      0,      0,      0,      0,      0,      0,      0,      0,      0,      0,      0,      0,      0,      0,      0,      0,      0,      0,      0,      0,      0,      0,      0,      1,      1,      1,      0,      0,      0    ],
    [      0,      0,      0,      0,      0,      0,      0,      0,      0,      0,      0,      0,      0,      0,      0,      0,      0,      0,      0,      0,      0,      0,      0,      0,      0,      0,      0,      0,      0,      0,      0,      0,      0,      0,      1,      1,      1,      0,      0    ],
    [      0,      0,      0,      0,      0,      0,      0,      0,      0,      0,      0,      0,      0,      0,      0,      0,      0,      0,      0,      0,      0,      0,      0,      0,      0,      0,      0,      0,      0,      0,      0,      0,      0,      0,      0,      1,      1,      1,      0    ],
    [      0,      0,      0,      0,      0,      0,      0,      0,      0,      0,      0,      0,      0,      0,      0,      0,      0,      0,      0,      0,      0,      0,      0,      0,      0,      0,      0,      0,      0,      0,      0,      0,      0,      0,      0,      0,      1,      1,      1    ],
    [      0,      0,      0,      0,      0,      0,      0,      0,      0,      0,      0,      0,      0,      0,      0,      0,      0,      0,      0,      0,      0,      0,      0,      0,      0,      1,      0,      0,      0,      0,      0,      0,      0,      0,      0,      0,      0,      1,      1    ]
  ],
  "nodes": [
    [      2101,      21,      1,      0    ],
    [      2102,      21,      2,      1    ],
    [      2103,      21,      3,      2    ],
    [      2104,      21,      4,      3    ],
    [      2105,      21,      5,      4    ],
    [      2106,      21,      6,      5    ],
    [      2107,      21,      7,      6    ],
    [      2108,      21,      8,      7    ],
    [      2109,      21,      9,      8    ],
    [      2110,      21,      10,      9    ],
    [      2111,      21,      11,      10    ],
    [      2112,      21,      12,      11    ],
    [      2113,      21,      13,      12    ],
    [      2201,      22,      1,      13    ],
    [      2202,      22,      2,      14    ],
    [      2203,      22,      3,      15    ],
    [      2204,      22,      4,      16    ],
    [      2205,      22,      5,      17    ],
    [      2206,      22,      6,      18    ],
    [      2207,      22,      7,      19    ],
    [      2208,      22,      8,      20    ],
    [      2209,      22,      9,      21    ],
    [      2210,      22,      10,      22    ],
    [      2211,      22,      11,      23    ],
    [      2212,      22,      12,      24    ],
    [      2213,      22,      13,      25    ],
    [      2301,      23,      1,      26    ],
    [      2302,      23,      2,      27    ],
    [      2303,      23,      3,      28    ],
    [      2304,      23,      4,      29    ],
    [      2305,      23,      5,      30    ],
    [      2306,      23,      6,      31    ],
    [      2307,      23,      7,      32    ],
    [      2308,      23,      8,      33    ],
    [      2309,      23,      9,      34    ],
    [      2310,      23,      10,      35    ],
    [      2311,      23,      11,      36    ],
    [      2312,      23,      12,      37    ],
    [      2313,      23,      13,      38    ]
  ],
  "agents": [    {
      "ID": 0,
      "initPos": [        2110,        21,        10,        9      ],
      "endPos": [        2110,        21,        10,        9      ],
      "goalPos": [
        [          2205,          22,          5,          17        ],
        [          2310,          23,          10,          35        ],
        [          2205,          22,          5,          17        ],
        [          2304,          23,          4,          29        ],
        [          2109,          21,          9,          8        ]
      ]
    },
    {
      "ID": 1,
      "initPos": [        2313,        23,        13,        38      ],
      "endPos": [        2313,        23,        13,        38      ],
      "goalPos": [
        [          2203,          22,          3,          15        ],
        [          2213,          22,          13,          25        ],
        [          2305,          23,          5,          30        ],
        [          2104,          21,          4,          3        ],
        [          2203,          22,          3,          15        ]
      ]
    },
    {
      "ID": 2,
      "initPos": [        2312,        23,        12,        37      ],
      "endPos": [        2312,        23,        12,        37      ],
      "goalPos": [
        [          2204,          22,          4,          16        ],
        [          2108,          21,          8,          7        ],
        [          2301,          23,          1,          26        ],
        [          2205,          22,          5,          17        ],
        [          2109,          21,          9,          8        ]
      ]
    },
    {
      "ID": 3,
      "initPos": [        2308,        23,        8,        33      ],
      "endPos": [        2308,        23,        8,        33      ],
      "goalPos": [
        [          2306,          23,          6,          31        ],
        [          2304,          23,          4,          29        ],
        [          2102,          21,          2,          1        ],
        [          2204,          22,          4,          16        ],
        [          2102,          21,          2,          1        ]
      ]
    },
    {
      "ID": 4,
      "initPos": [        2212,        22,        12,        24      ],
      "endPos": [        2212,        22,        12,        24      ],
      "goalPos": [
        [          2301,          23,          1,          26        ],
        [          2104,          21,          4,          3        ],
        [          2205,          22,          5,          17        ],
        [          2107,          21,          7,          6        ],
        [          2213,          22,          13,          25        ]
      ]
    },
    {
      "ID": 5,
      "initPos": [        2101,        21,        1,        0      ],
      "endPos": [        2101,        21,        1,        0      ],
      "goalPos": [
        [          2104,          21,          4,          3        ],
        [          2205,          22,          5,          17        ],
        [          2204,          22,          4,          16        ],
        [          2102,          21,          2,          1        ],
        [          2204,          22,          4,          16        ]
      ]
    },
    {
      "ID": 6,
      "initPos": [        2207,        22,        7,        19      ],
      "endPos": [        2207,        22,        7,        19      ],
      "goalPos": [
        [          2104,          21,          4,          3        ],
        [          2305,          23,          5,          30        ],
        [          2113,          21,          13,          12        ],
        [          2213,          22,          13,          25        ],
        [          2113,          21,          13,          12        ]
      ]
    },
    {
      "ID": 7,
      "initPos": [        2208,        22,        8,        20      ],
      "endPos": [        2208,        22,        8,        20      ],
      "goalPos": [
        [          2306,          23,          6,          31        ],
        [          2203,          22,          3,          15        ],
        [          2205,          22,          5,          17        ],
        [          2109,          21,          9,          8        ],
        [          2107,          21,          7,          6        ]
      ]
    },
    {
      "ID": 8,
      "initPos": [        2210,        22,        10,        22      ],
      "endPos": [        2210,        22,        10,        22      ],
      "goalPos": [
        [          2205,          22,          5,          17        ],
        [          2304,          23,          4,          29        ],
        [          2111,          21,          11,          10        ],
        [          2209,          22,          9,          21        ],
        [          2109,          21,          9,          8        ]
      ]
    },
    {
      "ID": 9,
      "initPos": [        2206,        22,        6,        18      ],
      "endPos": [        2206,        22,        6,        18      ],
      "goalPos": [
        [          2104,          21,          4,          3        ],
        [          2209,          22,          9,          21        ],
        [          2102,          21,          2,          1        ],
        [          2108,          21,          8,          7        ],
        [          2309,          23,          9,          34        ]
      ]
    },
    {
      "ID": 10,
      "initPos": [        2103,        21,        3,        2      ],
      "endPos": [        2103,        21,        3,        2      ],
      "goalPos": [
        [          2102,          21,          2,          1        ],
        [          2310,          23,          10,          35        ],
        [          2209,          22,          9,          21        ],
        [          2305,          23,          5,          30        ],
        [          2213,          22,          13,          25        ]
      ]
    },
    {
      "ID": 11,
      "initPos": [        2105,        21,        5,        4      ],
      "endPos": [        2105,        21,        5,        4      ],
      "goalPos": [
        [          2301,          23,          1,          26        ],
        [          2201,          22,          1,          13        ],
        [          2203,          22,          3,          15        ],
        [          2111,          21,          11,          10        ],
        [          2310,          23,          10,          35        ]
      ]
    },
    {
      "ID": 12,
      "initPos": [        2106,        21,        6,        5      ],
      "endPos": [        2106,        21,        6,        5      ],
      "goalPos": [
        [          2209,          22,          9,          21        ],
        [          2304,          23,          4,          29        ],
        [          2301,          23,          1,          26        ],
        [          2209,          22,          9,          21        ],
        [          2305,          23,          5,          30        ]
      ]
    },
    {
      "ID": 13,
      "initPos": [        2211,        22,        11,        23      ],
      "endPos": [        2211,        22,        11,        23      ],
      "goalPos": [
        [          2310,          23,          10,          35        ],
        [          2213,          22,          13,          25        ],
        [          2104,          21,          4,          3        ],
        [          2213,          22,          13,          25        ],
        [          2203,          22,          3,          15        ]
      ]
    },
    {
      "ID": 14,
      "initPos": [        2112,        21,        12,        11      ],
      "endPos": [        2112,        21,        12,        11      ],
      "goalPos": [
        [          2309,          23,          9,          34        ],
        [          2113,          21,          13,          12        ],
        [          2310,          23,          10,          35        ],
        [          2111,          21,          11,          10        ],
        [          2301,          23,          1,          26        ]
      ]
    },
    {
      "ID": 15,
      "initPos": [        2202,        22,        2,        14      ],
      "endPos": [        2202,        22,        2,        14      ],
      "goalPos": [
        [          2209,          22,          9,          21        ],
        [          2102,          21,          2,          1        ],
        [          2113,          21,          13,          12        ],
        [          2201,          22,          1,          13        ],
        [          2209,          22,          9,          21        ]
      ]
    },
    {
      "ID": 16,
      "initPos": [        2311,        23,        11,        36      ],
      "endPos": [        2311,        23,        11,        36      ],
      "goalPos": [
        [          2305,          23,          5,          30        ],
        [          2108,          21,          8,          7        ],
        [          2209,          22,          9,          21        ],
        [          2305,          23,          5,          30        ],
        [          2309,          23,          9,          34        ]
      ]
    },
    {
      "ID": 17,
      "initPos": [        2302,        23,        2,        27      ],
      "endPos": [        2302,        23,        2,        27      ],
      "goalPos": [
        [          2109,          21,          9,          8        ],
        [          2310,          23,          10,          35        ],
        [          2113,          21,          13,          12        ],
        [          2204,          22,          4,          16        ],
        [          2306,          23,          6,          31        ]
      ]
    },
    {
      "ID": 18,
      "initPos": [        2307,        23,        7,        32      ],
      "endPos": [        2307,        23,        7,        32      ],
      "goalPos": [
        [          2309,          23,          9,          34        ],
        [          2107,          21,          7,          6        ],
        [          2213,          22,          13,          25        ],
        [          2204,          22,          4,          16        ],
        [          2203,          22,          3,          15        ]
      ]
    },
    {
      "ID": 19,
      "initPos": [        2303,        23,        3,        28      ],
      "endPos": [        2303,        23,        3,        28      ],
      "goalPos": [
        [          2109,          21,          9,          8        ],
        [          2102,          21,          2,          1        ],
        [          2209,          22,          9,          21        ],
        [          2305,          23,          5,          30        ],
        [          2107,          21,          7,          6        ]
      ]
    }
  ]
}