id,n_agent,n_goals
1,2,1
2,2,2
3,2,5
4,2,10
5,2,20
6,5,1
7,5,2
8,5,5
9,5,10
10,5,20
11,10,1
12,10,2
13,10,5
14,10,10
15,10,20
16,20,1
17,20,2
18,20,5
19,20,10
20,20,20
21,50,1
22,50,2
23,50,5
24,50,10
25,50,20
