{
  "MAPF": "CBS",
  "SAPF": "TDSP",
  "costFunction": "SIC",
  "heuristic": "",
  "nNodes": 54,
  "nodes": [
    [      429,      74.10000000000001,      6.5,      0    ],
    [      430,      74.10000000000001,      7.800000000000001,      1    ],
    [      431,      75.4,      6.5,      2    ],
    [      432,      75.4,      7.800000000000001,      3    ],
    [      433,      76.7,      6.5,      4    ],
    [      434,      76.7,      7.800000000000001,      5    ],
    [      435,      78,      6.5,      6    ],
    [      436,      78,      7.800000000000001,      7    ],
    [      437,      79.3,      6.5,      8    ],
    [      438,      79.3,      7.800000000000001,      9    ],
    [      439,      80.60000000000001,      6.5,      10    ],
    [      440,      80.60000000000001,      7.800000000000001,      11    ],
    [      441,      81.9,      6.5,      12    ],
    [      442,      81.9,      7.800000000000001,      13    ],
    [      443,      83.2,      6.5,      14    ],
    [      444,      83.2,      7.800000000000001,      15    ],
    [      445,      84.5,      6.5,      16    ],
    [      446,      84.5,      7.800000000000001,      17    ],
    [      447,      85.8,      6.5,      18    ],
    [      448,      85.8,      7.800000000000001,      19    ],
    [      449,      87.10000000000001,      6.5,      20    ],
    [      450,      87.10000000000001,      7.800000000000001,      21    ],
    [      451,      88.4,      6.5,      22    ],
    [      452,      88.4,      7.800000000000001,      23    ],
    [      453,      89.7,      6.5,      24    ],
    [      454,      89.7,      7.800000000000001,      25    ],
    [      455,      91,      6.5,      26    ],
    [      456,      91,      7.800000000000001,      27    ],
    [      457,      92.3,      6.5,      28    ],
    [      458,      92.3,      7.800000000000001,      29    ],
    [      459,      93.60000000000001,      6.5,      30    ],
    [      460,      93.60000000000001,      7.800000000000001,      31    ],
    [      461,      94.9,      6.5,      32    ],
    [      462,      94.9,      7.800000000000001,      33    ],
    [      463,      96.2,      6.5,      34    ],
    [      464,      96.2,      7.800000000000001,      35    ],
    [      465,      97.5,      6.5,      36    ],
    [      466,      97.5,      7.800000000000001,      37    ],
    [      467,      98.8,      6.5,      38    ],
    [      468,      98.8,      7.800000000000001,      39    ],
    [      469,      100.10000000000001,      6.5,      40    ],
    [      470,      100.10000000000001,      7.800000000000001,      41    ],
    [      471,      101.4,      6.5,      42    ],
    [      472,      101.4,      7.800000000000001,      43    ],
    [      473,      102.7,      6.5,      44    ],
    [      474,      102.7,      7.800000000000001,      45    ],
    [      475,      104,      6.5,      46    ],
    [      476,      104,      7.800000000000001,      47    ],
    [      477,      105.3,      6.5,      48    ],
    [      478,      105.3,      7.800000000000001,      49    ],
    [      479,      106.60000000000001,      6.5,      50    ],
    [      480,      106.60000000000001,      7.800000000000001,      51    ],
    [      481,      107.9,      6.5,      52    ],
    [      482,      107.9,      7.800000000000001,      53    ]
  ],
  "connect": [
    [      1,      1,      1,      0,      0,      0,      0,      0,      0,      0,      0,      0,      0,      0,      0,      0,      0,      0,      0,      0,      0,      0,      0,      0,      0,      0,      0,      0,      0,      0,      0,      0,      0,      0,      0,      0,      0,      0,      0,      0,      0,      0,      0,      0,      0,      0,      0,      0,      0,      0,      0,      0,      0,      0    ],
    [      1,      1,      0,      1,      0,      0,      0,      0,      0,      0,      0,      0,      0,      0,      0,      0,      0,      0,      0,      0,      0,      0,      0,      0,      0,      0,      0,      0,      0,      0,      0,      0,      0,      0,      0,      0,      0,      0,      0,      0,      0,      0,      0,      0,      0,      0,      0,      0,      0,      0,      0,      0,      0,      0    ],
    [      1,      0,      1,      1,      1,      0,      0,      0,      0,      0,      0,      0,      0,      0,      0,      0,      0,      0,      0,      0,      0,      0,      0,      0,      0,      0,      0,      0,      0,      0,      0,      0,      0,      0,      0,      0,      0,      0,      0,      0,      0,      0,      0,      0,      0,      0,      0,      0,      0,      0,      0,      0,      0,      0    ],
    [      0,      1,      1,      1,      0,      1,      0,      0,      0,      0,      0,      0,      0,      0,      0,      0,      0,      0,      0,      0,      0,      0,      0,      0,      0,      0,      0,      0,      0,      0,      0,      0,      0,      0,      0,      0,      0,      0,      0,      0,      0,      0,      0,      0,      0,      0,      0,      0,      0,      0,      0,      0,      0,      0    ],
    [      0,      0,      1,      0,      1,      1,      1,      0,      0,      0,      0,      0,      0,      0,      0,      0,      0,      0,      0,      0,      0,      0,      0,      0,      0,      0,      0,      0,      0,      0,      0,      0,      0,      0,      0,      0,      0,      0,      0,      0,      0,      0,      0,      0,      0,      0,      0,      0,      0,      0,      0,      0,      0,      0    ],
    [      0,      0,      0,      1,      1,      1,      0,      1,      0,      0,      0,      0,      0,      0,      0,      0,      0,      0,      0,      0,      0,      0,      0,      0,      0,      0,      0,      0,      0,      0,      0,      0,      0,      0,      0,      0,      0,      0,      0,      0,      0,      0,      0,      0,      0,      0,      0,      0,      0,      0,      0,      0,      0,      0    ],
    [      0,      0,      0,      0,      1,      0,      1,      1,      1,      0,      0,      0,      0,      0,      0,      0,      0,      0,      0,      0,      0,      0,      0,      0,      0,      0,      0,      0,      0,      0,      0,      0,      0,      0,      0,      0,      0,      0,      0,      0,      0,      0,      0,      0,      0,      0,      0,      0,      0,      0,      0,      0,      0,      0    ],
    [      0,      0,      0,      0,      0,      1,      1,      1,      0,      1,      0,      0,      0,      0,      0,      0,      0,      0,      0,      0,      0,      0,      0,      0,      0,      0,      0,      0,      0,      0,      0,      0,      0,      0,      0,      0,      0,      0,      0,      0,      0,      0,      0,      0,      0,      0,      0,      0,      0,      0,      0,      0,      0,      0    ],
    [      0,      0,      0,      0,      0,      0,      1,      0,      1,      1,      1,      0,      0,      0,      0,      0,      0,      0,      0,      0,      0,      0,      0,      0,      0,      0,      0,      0,      0,      0,      0,      0,      0,      0,      0,      0,      0,      0,      0,      0,      0,      0,      0,      0,      0,      0,      0,      0,      0,      0,      0,      0,      0,      0    ],
    [      0,      0,      0,      0,      0,      0,      0,      1,      1,      1,      0,      1,      0,      0,      0,      0,      0,      0,      0,      0,      0,      0,      0,      0,      0,      0,      0,      0,      0,      0,      0,      0,      0,      0,      0,      0,      0,      0,      0,      0,      0,      0,      0,      0,      0,      0,      0,      0,      0,      0,      0,      0,      0,      0    ],
    [      0,      0,      0,      0,      0,      0,      0,      0,      1,      0,      1,      1,      1,      0,      0,      0,      0,      0,      0,      0,      0,      0,      0,      0,      0,      0,      0,      0,      0,      0,      0,      0,      0,      0,      0,      0,      0,      0,      0,      0,      0,      0,      0,      0,      0,      0,      0,      0,      0,      0,      0,      0,      0,      0    ],
    [      0,      0,      0,      0,      0,      0,      0,      0,      0,      1,      1,      1,      0,      1,      0,      0,      0,      0,      0,      0,      0,      0,      0,      0,      0,      0,      0,      0,      0,      0,      0,      0,      0,      0,      0,      0,      0,      0,      0,      0,      0,      0,      0,      0,      0,      0,      0,      0,      0,      0,      0,      0,      0,      0    ],
    [      0,      0,      0,      0,      0,      0,      0,      0,      0,      0,      1,      0,      1,      1,      1,      0,      0,      0,      0,      0,      0,      0,      0,      0,      0,      0,      0,      0,      0,      0,      0,      0,      0,      0,      0,      0,      0,      0,      0,      0,      0,      0,      0,      0,      0,      0,      0,      0,      0,      0,      0,      0,      0,      0    ],
    [      0,      0,      0,      0,      0,      0,      0,      0,      0,      0,      0,      1,      1,      1,      0,      1,      0,      0,      0,      0,      0,      0,      0,      0,      0,      0,      0,      0,      0,      0,      0,      0,      0,      0,      0,      0,      0,      0,      0,      0,      0,      0,      0,      0,      0,      0,      0,      0,      0,      0,      0,      0,      0,      0    ],
    [      0,      0,      0,      0,      0,      0,      0,      0,      0,      0,      0,      0,      1,      0,      1,      1,      1,      0,      0,      0,      0,      0,      0,      0,      0,      0,      0,      0,      0,      0,      0,      0,      0,      0,      0,      0,      0,      0,      0,      0,      0,      0,      0,      0,      0,      0,      0,      0,      0,      0,      0,      0,      0,      0    ],
    [      0,      0,      0,      0,      0,      0,      0,      0,      0,      0,      0,      0,      0,      1,      1,      1,      0,      1,      0,      0,      0,      0,      0,      0,      0,      0,      0,      0,      0,      0,      0,      0,      0,      0,      0,      0,      0,      0,      0,      0,      0,      0,      0,      0,      0,      0,      0,      0,      0,      0,      0,      0,      0,      0    ],
    [      0,      0,      0,      0,      0,      0,      0,      0,      0,      0,      0,      0,      0,      0,      1,      0,      1,      1,      1,      0,      0,      0,      0,      0,      0,      0,      0,      0,      0,      0,      0,      0,      0,      0,      0,      0,      0,      0,      0,      0,      0,      0,      0,      0,      0,      0,      0,      0,      0,      0,      0,      0,      0,      0    ],
    [      0,      0,      0,      0,      0,      0,      0,      0,      0,      0,      0,      0,      0,      0,      0,      1,      1,      1,      0,      1,      0,      0,      0,      0,      0,      0,      0,      0,      0,      0,      0,      0,      0,      0,      0,      0,      0,      0,      0,      0,      0,      0,      0,      0,      0,      0,      0,      0,      0,      0,      0,      0,      0,      0    ],
    [      0,      0,      0,      0,      0,      0,      0,      0,      0,      0,      0,      0,      0,      0,      0,      0,      1,      0,      1,      1,      1,      0,      0,      0,      0,      0,      0,      0,      0,      0,      0,      0,      0,      0,      0,      0,      0,      0,      0,      0,      0,      0,      0,      0,      0,      0,      0,      0,      0,      0,      0,      0,      0,      0    ],
    [      0,      0,      0,      0,      0,      0,      0,      0,      0,      0,      0,      0,      0,      0,      0,      0,      0,      1,      1,      1,      0,      1,      0,      0,      0,      0,      0,      0,      0,      0,      0,      0,      0,      0,      0,      0,      0,      0,      0,      0,      0,      0,      0,      0,      0,      0,      0,      0,      0,      0,      0,      0,      0,      0    ],
    [      0,      0,      0,      0,      0,      0,      0,      0,      0,      0,      0,      0,      0,      0,      0,      0,      0,      0,      1,      0,      1,      1,      1,      0,      0,      0,      0,      0,      0,      0,      0,      0,      0,      0,      0,      0,      0,      0,      0,      0,      0,      0,      0,      0,      0,      0,      0,      0,      0,      0,      0,      0,      0,      0    ],
    [      0,      0,      0,      0,      0,      0,      0,      0,      0,      0,      0,      0,      0,      0,      0,      0,      0,      0,      0,      1,      1,      1,      0,      1,      0,      0,      0,      0,      0,      0,      0,      0,      0,      0,      0,      0,      0,      0,      0,      0,      0,      0,      0,      0,      0,      0,      0,      0,      0,      0,      0,      0,      0,      0    ],
    [      0,      0,      0,      0,      0,      0,      0,      0,      0,      0,      0,      0,      0,      0,      0,      0,      0,      0,      0,      0,      1,      0,      1,      1,      1,      0,      0,      0,      0,      0,      0,      0,      0,      0,      0,      0,      0,      0,      0,      0,      0,      0,      0,      0,      0,      0,      0,      0,      0,      0,      0,      0,      0,      0    ],
    [      0,      0,      0,      0,      0,      0,      0,      0,      0,      0,      0,      0,      0,      0,      0,      0,      0,      0,      0,      0,      0,      1,      1,      1,      0,      1,      0,      0,      0,      0,      0,      0,      0,      0,      0,      0,      0,      0,      0,      0,      0,      0,      0,      0,      0,      0,      0,      0,      0,      0,      0,      0,      0,      0    ],
    [      0,      0,      0,      0,      0,      0,      0,      0,      0,      0,      0,      0,      0,      0,      0,      0,      0,      0,      0,      0,      0,      0,      1,      0,      1,      1,      1,      0,      0,      0,      0,      0,      0,      0,      0,      0,      0,      0,      0,      0,      0,      0,      0,      0,      0,      0,      0,      0,      0,      0,      0,      0,      0,      0    ],
    [      0,      0,      0,      0,      0,      0,      0,      0,      0,      0,      0,      0,      0,      0,      0,      0,      0,      0,      0,      0,      0,      0,      0,      1,      1,      1,      0,      1,      0,      0,      0,      0,      0,      0,      0,      0,      0,      0,      0,      0,      0,      0,      0,      0,      0,      0,      0,      0,      0,      0,      0,      0,      0,      0    ],
    [      0,      0,      0,      0,      0,      0,      0,      0,      0,      0,      0,      0,      0,      0,      0,      0,      0,      0,      0,      0,      0,      0,      0,      0,      1,      0,      1,      1,      1,      0,      0,      0,      0,      0,      0,      0,      0,      0,      0,      0,      0,      0,      0,      0,      0,      0,      0,      0,      0,      0,      0,      0,      0,      0    ],
    [      0,      0,      0,      0,      0,      0,      0,      0,      0,      0,      0,      0,      0,      0,      0,      0,      0,      0,      0,      0,      0,      0,      0,      0,      0,      1,      1,      1,      0,      1,      0,      0,      0,      0,      0,      0,      0,      0,      0,      0,      0,      0,      0,      0,      0,      0,      0,      0,      0,      0,      0,      0,      0,      0    ],
    [      0,      0,      0,      0,      0,      0,      0,      0,      0,      0,      0,      0,      0,      0,      0,      0,      0,      0,      0,      0,      0,      0,      0,      0,      0,      0,      1,      0,      1,      1,      1,      0,      0,      0,      0,      0,      0,      0,      0,      0,      0,      0,      0,      0,      0,      0,      0,      0,      0,      0,      0,      0,      0,      0    ],
    [      0,      0,      0,      0,      0,      0,      0,      0,      0,      0,      0,      0,      0,      0,      0,      0,      0,      0,      0,      0,      0,      0,      0,      0,      0,      0,      0,      1,      1,      1,      0,      1,      0,      0,      0,      0,      0,      0,      0,      0,      0,      0,      0,      0,      0,      0,      0,      0,      0,      0,      0,      0,      0,      0    ],
    [      0,      0,      0,      0,      0,      0,      0,      0,      0,      0,      0,      0,      0,      0,      0,      0,      0,      0,      0,      0,      0,      0,      0,      0,      0,      0,      0,      0,      1,      0,      1,      1,      1,      0,      0,      0,      0,      0,      0,      0,      0,      0,      0,      0,      0,      0,      0,      0,      0,      0,      0,      0,      0,      0    ],
    [      0,      0,      0,      0,      0,      0,      0,      0,      0,      0,      0,      0,      0,      0,      0,      0,      0,      0,      0,      0,      0,      0,      0,      0,      0,      0,      0,      0,      0,      1,      1,      1,      0,      1,      0,      0,      0,      0,      0,      0,      0,      0,      0,      0,      0,      0,      0,      0,      0,      0,      0,      0,      0,      0    ],
    [      0,      0,      0,      0,      0,      0,      0,      0,      0,      0,      0,      0,      0,      0,      0,      0,      0,      0,      0,      0,      0,      0,      0,      0,      0,      0,      0,      0,      0,      0,      1,      0,      1,      1,      1,      0,      0,      0,      0,      0,      0,      0,      0,      0,      0,      0,      0,      0,      0,      0,      0,      0,      0,      0    ],
    [      0,      0,      0,      0,      0,      0,      0,      0,      0,      0,      0,      0,      0,      0,      0,      0,      0,      0,      0,      0,      0,      0,      0,      0,      0,      0,      0,      0,      0,      0,      0,      1,      1,      1,      0,      1,      0,      0,      0,      0,      0,      0,      0,      0,      0,      0,      0,      0,      0,      0,      0,      0,      0,      0    ],
    [      0,      0,      0,      0,      0,      0,      0,      0,      0,      0,      0,      0,      0,      0,      0,      0,      0,      0,      0,      0,      0,      0,      0,      0,      0,      0,      0,      0,      0,      0,      0,      0,      1,      0,      1,      1,      1,      0,      0,      0,      0,      0,      0,      0,      0,      0,      0,      0,      0,      0,      0,      0,      0,      0    ],
    [      0,      0,      0,      0,      0,      0,      0,      0,      0,      0,      0,      0,      0,      0,      0,      0,      0,      0,      0,      0,      0,      0,      0,      0,      0,      0,      0,      0,      0,      0,      0,      0,      0,      1,      1,      1,      0,      1,      0,      0,      0,      0,      0,      0,      0,      0,      0,      0,      0,      0,      0,      0,      0,      0    ],
    [      0,      0,      0,      0,      0,      0,      0,      0,      0,      0,      0,      0,      0,      0,      0,      0,      0,      0,      0,      0,      0,      0,      0,      0,      0,      0,      0,      0,      0,      0,      0,      0,      0,      0,      1,      0,      1,      1,      1,      0,      0,      0,      0,      0,      0,      0,      0,      0,      0,      0,      0,      0,      0,      0    ],
    [      0,      0,      0,      0,      0,      0,      0,      0,      0,      0,      0,      0,      0,      0,      0,      0,      0,      0,      0,      0,      0,      0,      0,      0,      0,      0,      0,      0,      0,      0,      0,      0,      0,      0,      0,      1,      1,      1,      0,      1,      0,      0,      0,      0,      0,      0,      0,      0,      0,      0,      0,      0,      0,      0    ],
    [      0,      0,      0,      0,      0,      0,      0,      0,      0,      0,      0,      0,      0,      0,      0,      0,      0,      0,      0,      0,      0,      0,      0,      0,      0,      0,      0,      0,      0,      0,      0,      0,      0,      0,      0,      0,      1,      0,      1,      1,      1,      0,      0,      0,      0,      0,      0,      0,      0,      0,      0,      0,      0,      0    ],
    [      0,      0,      0,      0,      0,      0,      0,      0,      0,      0,      0,      0,      0,      0,      0,      0,      0,      0,      0,      0,      0,      0,      0,      0,      0,      0,      0,      0,      0,      0,      0,      0,      0,      0,      0,      0,      0,      1,      1,      1,      0,      1,      0,      0,      0,      0,      0,      0,      0,      0,      0,      0,      0,      0    ],
    [      0,      0,      0,      0,      0,      0,      0,      0,      0,      0,      0,      0,      0,      0,      0,      0,      0,      0,      0,      0,      0,      0,      0,      0,      0,      0,      0,      0,      0,      0,      0,      0,      0,      0,      0,      0,      0,      0,      1,      0,      1,      1,      1,      0,      0,      0,      0,      0,      0,      0,      0,      0,      0,      0    ],
    [      0,      0,      0,      0,      0,      0,      0,      0,      0,      0,      0,      0,      0,      0,      0,      0,      0,      0,      0,      0,      0,      0,      0,      0,      0,      0,      0,      0,      0,      0,      0,      0,      0,      0,      0,      0,      0,      0,      0,      1,      1,      1,      0,      1,      0,      0,      0,      0,      0,      0,      0,      0,      0,      0    ],
    [      0,      0,      0,      0,      0,      0,      0,      0,      0,      0,      0,      0,      0,      0,      0,      0,      0,      0,      0,      0,      0,      0,      0,      0,      0,      0,      0,      0,      0,      0,      0,      0,      0,      0,      0,      0,      0,      0,      0,      0,      1,      0,      1,      1,      1,      0,      0,      0,      0,      0,      0,      0,      0,      0    ],
    [      0,      0,      0,      0,      0,      0,      0,      0,      0,      0,      0,      0,      0,      0,      0,      0,      0,      0,      0,      0,      0,      0,      0,      0,      0,      0,      0,      0,      0,      0,      0,      0,      0,      0,      0,      0,      0,      0,      0,      0,      0,      1,      1,      1,      0,      1,      0,      0,      0,      0,      0,      0,      0,      0    ],
    [      0,      0,      0,      0,      0,      0,      0,      0,      0,      0,      0,      0,      0,      0,      0,      0,      0,      0,      0,      0,      0,      0,      0,      0,      0,      0,      0,      0,      0,      0,      0,      0,      0,      0,      0,      0,      0,      0,      0,      0,      0,      0,      1,      0,      1,      1,      1,      0,      0,      0,      0,      0,      0,      0    ],
    [      0,      0,      0,      0,      0,      0,      0,      0,      0,      0,      0,      0,      0,      0,      0,      0,      0,      0,      0,      0,      0,      0,      0,      0,      0,      0,      0,      0,      0,      0,      0,      0,      0,      0,      0,      0,      0,      0,      0,      0,      0,      0,      0,      1,      1,      1,      0,      1,      0,      0,      0,      0,      0,      0    ],
    [      0,      0,      0,      0,      0,      0,      0,      0,      0,      0,      0,      0,      0,      0,      0,      0,      0,      0,      0,      0,      0,      0,      0,      0,      0,      0,      0,      0,      0,      0,      0,      0,      0,      0,      0,      0,      0,      0,      0,      0,      0,      0,      0,      0,      1,      0,      1,      1,      1,      0,      0,      0,      0,      0    ],
    [      0,      0,      0,      0,      0,      0,      0,      0,      0,      0,      0,      0,      0,      0,      0,      0,      0,      0,      0,      0,      0,      0,      0,      0,      0,      0,      0,      0,      0,      0,      0,      0,      0,      0,      0,      0,      0,      0,      0,      0,      0,      0,      0,      0,      0,      1,      1,      1,      0,      1,      0,      0,      0,      0    ],
    [      0,      0,      0,      0,      0,      0,      0,      0,      0,      0,      0,      0,      0,      0,      0,      0,      0,      0,      0,      0,      0,      0,      0,      0,      0,      0,      0,      0,      0,      0,      0,      0,      0,      0,      0,      0,      0,      0,      0,      0,      0,      0,      0,      0,      0,      0,      1,      0,      1,      1,      1,      0,      0,      0    ],
    [      0,      0,      0,      0,      0,      0,      0,      0,      0,      0,      0,      0,      0,      0,      0,      0,      0,      0,      0,      0,      0,      0,      0,      0,      0,      0,      0,      0,      0,      0,      0,      0,      0,      0,      0,      0,      0,      0,      0,      0,      0,      0,      0,      0,      0,      0,      0,      1,      1,      1,      0,      1,      0,      0    ],
    [      0,      0,      0,      0,      0,      0,      0,      0,      0,      0,      0,      0,      0,      0,      0,      0,      0,      0,      0,      0,      0,      0,      0,      0,      0,      0,      0,      0,      0,      0,      0,      0,      0,      0,      0,      0,      0,      0,      0,      0,      0,      0,      0,      0,      0,      0,      0,      0,      1,      0,      1,      1,      1,      0    ],
    [      0,      0,      0,      0,      0,      0,      0,      0,      0,      0,      0,      0,      0,      0,      0,      0,      0,      0,      0,      0,      0,      0,      0,      0,      0,      0,      0,      0,      0,      0,      0,      0,      0,      0,      0,      0,      0,      0,      0,      0,      0,      0,      0,      0,      0,      0,      0,      0,      0,      1,      1,      1,      0,      1    ],
    [      0,      0,      0,      0,      0,      0,      0,      0,      0,      0,      0,      0,      0,      0,      0,      0,      0,      0,      0,      0,      0,      0,      0,      0,      0,      0,      0,      0,      0,      0,      0,      0,      0,      0,      0,      0,      0,      0,      0,      0,      0,      0,      0,      0,      0,      0,      0,      0,      0,      0,      1,      0,      1,      1    ],
    [      0,      0,      0,      0,      0,      0,      0,      0,      0,      0,      0,      0,      0,      0,      0,      0,      0,      0,      0,      0,      0,      0,      0,      0,      0,      0,      0,      0,      0,      0,      0,      0,      0,      0,      0,      0,      0,      0,      0,      0,      0,      0,      0,      0,      0,      0,      0,      0,      0,      0,      0,      1,      1,      1    ]
  ],
  "nAgents": 50,
  "agents": [    {
      "ID": 0,
      "initPos": [        472,        101.4,        7.800000000000001,        43      ],
      "endPos": [        472,        101.4,        7.800000000000001,        43      ],
      "goalPos": [
        [          460,          93.60000000000001,          7.800000000000001,          31        ]
      ]
    },
    {
      "ID": 1,
      "initPos": [        451,        88.4,        6.5,        22      ],
      "endPos": [        451,        88.4,        6.5,        22      ],
      "goalPos": [
        [          443,          83.2,          6.5,          14        ]
      ]
    },
    {
      "ID": 2,
      "initPos": [        441,        81.9,        6.5,        12      ],
      "endPos": [        441,        81.9,        6.5,        12      ],
      "goalPos": [
        [          443,          83.2,          6.5,          14        ]
      ]
    },
    {
      "ID": 3,
      "initPos": [        461,        94.9,        6.5,        32      ],
      "endPos": [        461,        94.9,        6.5,        32      ],
      "goalPos": [
        [          458,          92.3,          7.800000000000001,          29        ]
      ]
    },
    {
      "ID": 4,
      "initPos": [        440,        80.60000000000001,        7.800000000000001,        11      ],
      "endPos": [        440,        80.60000000000001,        7.800000000000001,        11      ],
      "goalPos": [
        [          475,          104,          6.5,          46        ]
      ]
    },
    {
      "ID": 5,
      "initPos": [        482,        107.9,        7.800000000000001,        53      ],
      "endPos": [        482,        107.9,        7.800000000000001,        53      ],
      "goalPos": [
        [          475,          104,          6.5,          46        ]
      ]
    },
    {
      "ID": 6,
      "initPos": [        467,        98.8,        6.5,        38      ],
      "endPos": [        467,        98.8,        6.5,        38      ],
      "goalPos": [
        [          475,          104,          6.5,          46        ]
      ]
    },
    {
      "ID": 7,
      "initPos": [        433,        76.7,        6.5,        4      ],
      "endPos": [        433,        76.7,        6.5,        4      ],
      "goalPos": [
        [          458,          92.3,          7.800000000000001,          29        ]
      ]
    },
    {
      "ID": 8,
      "initPos": [        476,        104,        7.800000000000001,        47      ],
      "endPos": [        476,        104,        7.800000000000001,        47      ],
      "goalPos": [
        [          475,          104,          6.5,          46        ]
      ]
    },
    {
      "ID": 9,
      "initPos": [        439,        80.60000000000001,        6.5,        10      ],
      "endPos": [        439,        80.60000000000001,        6.5,        10      ],
      "goalPos": [
        [          460,          93.60000000000001,          7.800000000000001,          31        ]
      ]
    },
    {
      "ID": 10,
      "initPos": [        471,        101.4,        6.5,        42      ],
      "endPos": [        471,        101.4,        6.5,        42      ],
      "goalPos": [
        [          460,          93.60000000000001,          7.800000000000001,          31        ]
      ]
    },
    {
      "ID": 11,
      "initPos": [        435,        78,        6.5,        6      ],
      "endPos": [        435,        78,        6.5,        6      ],
      "goalPos": [
        [          475,          104,          6.5,          46        ]
      ]
    },
    {
      "ID": 12,
      "initPos": [        457,        92.3,        6.5,        28      ],
      "endPos": [        457,        92.3,        6.5,        28      ],
      "goalPos": [
        [          460,          93.60000000000001,          7.800000000000001,          31        ]
      ]
    },
    {
      "ID": 13,
      "initPos": [        453,        89.7,        6.5,        24      ],
      "endPos": [        453,        89.7,        6.5,        24      ],
      "goalPos": [
        [          460,          93.60000000000001,          7.800000000000001,          31        ]
      ]
    },
    {
      "ID": 14,
      "initPos": [        431,        75.4,        6.5,        2      ],
      "endPos": [        431,        75.4,        6.5,        2      ],
      "goalPos": [
        [          475,          104,          6.5,          46        ]
      ]
    },
    {
      "ID": 15,
      "initPos": [        459,        93.60000000000001,        6.5,        30      ],
      "endPos": [        459,        93.60000000000001,        6.5,        30      ],
      "goalPos": [
        [          458,          92.3,          7.800000000000001,          29        ]
      ]
    },
    {
      "ID": 16,
      "initPos": [        434,        76.7,        7.800000000000001,        5      ],
      "endPos": [        434,        76.7,        7.800000000000001,        5      ],
      "goalPos": [
        [          443,          83.2,          6.5,          14        ]
      ]
    },
    {
      "ID": 17,
      "initPos": [        452,        88.4,        7.800000000000001,        23      ],
      "endPos": [        452,        88.4,        7.800000000000001,        23      ],
      "goalPos": [
        [          460,          93.60000000000001,          7.800000000000001,          31        ]
      ]
    },
    {
      "ID": 18,
      "initPos": [        456,        91,        7.800000000000001,        27      ],
      "endPos": [        456,        91,        7.800000000000001,        27      ],
      "goalPos": [
        [          458,          92.3,          7.800000000000001,          29        ]
      ]
    },
    {
      "ID": 19,
      "initPos": [        454,        89.7,        7.800000000000001,        25      ],
      "endPos": [        454,        89.7,        7.800000000000001,        25      ],
      "goalPos": [
        [          475,          104,          6.5,          46        ]
      ]
    },
    {
      "ID": 20,
      "initPos": [        474,        102.7,        7.800000000000001,        45      ],
      "endPos": [        474,        102.7,        7.800000000000001,        45      ],
      "goalPos": [
        [          460,          93.60000000000001,          7.800000000000001,          31        ]
      ]
    },
    {
      "ID": 21,
      "initPos": [        479,        106.60000000000001,        6.5,        50      ],
      "endPos": [        479,        106.60000000000001,        6.5,        50      ],
      "goalPos": [
        [          458,          92.3,          7.800000000000001,          29        ]
      ]
    },
    {
      "ID": 22,
      "initPos": [        477,        105.3,        6.5,        48      ],
      "endPos": [        477,        105.3,        6.5,        48      ],
      "goalPos": [
        [          475,          104,          6.5,          46        ]
      ]
    },
    {
      "ID": 23,
      "initPos": [        450,        87.10000000000001,        7.800000000000001,        21      ],
      "endPos": [        450,        87.10000000000001,        7.800000000000001,        21      ],
      "goalPos": [
        [          443,          83.2,          6.5,          14        ]
      ]
    },
    {
      "ID": 24,
      "initPos": [        436,        78,        7.800000000000001,        7      ],
      "endPos": [        436,        78,        7.800000000000001,        7      ],
      "goalPos": [
        [          460,          93.60000000000001,          7.800000000000001,          31        ]
      ]
    },
    {
      "ID": 25,
      "initPos": [        468,        98.8,        7.800000000000001,        39      ],
      "endPos": [        468,        98.8,        7.800000000000001,        39      ],
      "goalPos": [
        [          458,          92.3,          7.800000000000001,          29        ]
      ]
    },
    {
      "ID": 26,
      "initPos": [        429,        74.10000000000001,        6.5,        0      ],
      "endPos": [        429,        74.10000000000001,        6.5,        0      ],
      "goalPos": [
        [          458,          92.3,          7.800000000000001,          29        ]
      ]
    },
    {
      "ID": 27,
      "initPos": [        444,        83.2,        7.800000000000001,        15      ],
      "endPos": [        444,        83.2,        7.800000000000001,        15      ],
      "goalPos": [
        [          458,          92.3,          7.800000000000001,          29        ]
      ]
    },
    {
      "ID": 28,
      "initPos": [        465,        97.5,        6.5,        36      ],
      "endPos": [        465,        97.5,        6.5,        36      ],
      "goalPos": [
        [          443,          83.2,          6.5,          14        ]
      ]
    },
    {
      "ID": 29,
      "initPos": [        449,        87.10000000000001,        6.5,        20      ],
      "endPos": [        449,        87.10000000000001,        6.5,        20      ],
      "goalPos": [
        [          475,          104,          6.5,          46        ]
      ]
    },
    {
      "ID": 30,
      "initPos": [        478,        105.3,        7.800000000000001,        49      ],
      "endPos": [        478,        105.3,        7.800000000000001,        49      ],
      "goalPos": [
        [          443,          83.2,          6.5,          14        ]
      ]
    },
    {
      "ID": 31,
      "initPos": [        466,        97.5,        7.800000000000001,        37      ],
      "endPos": [        466,        97.5,        7.800000000000001,        37      ],
      "goalPos": [
        [          443,          83.2,          6.5,          14        ]
      ]
    },
    {
      "ID": 32,
      "initPos": [        480,        106.60000000000001,        7.800000000000001,        51      ],
      "endPos": [        480,        106.60000000000001,        7.800000000000001,        51      ],
      "goalPos": [
        [          443,          83.2,          6.5,          14        ]
      ]
    },
    {
      "ID": 33,
      "initPos": [        437,        79.3,        6.5,        8      ],
      "endPos": [        437,        79.3,        6.5,        8      ],
      "goalPos": [
        [          475,          104,          6.5,          46        ]
      ]
    },
    {
      "ID": 34,
      "initPos": [        473,        102.7,        6.5,        44      ],
      "endPos": [        473,        102.7,        6.5,        44      ],
      "goalPos": [
        [          443,          83.2,          6.5,          14        ]
      ]
    },
    {
      "ID": 35,
      "initPos": [        470,        100.10000000000001,        7.800000000000001,        41      ],
      "endPos": [        470,        100.10000000000001,        7.800000000000001,        41      ],
      "goalPos": [
        [          475,          104,          6.5,          46        ]
      ]
    },
    {
      "ID": 36,
      "initPos": [        448,        85.8,        7.800000000000001,        19      ],
      "endPos": [        448,        85.8,        7.800000000000001,        19      ],
      "goalPos": [
        [          460,          93.60000000000001,          7.800000000000001,          31        ]
      ]
    },
    {
      "ID": 37,
      "initPos": [        455,        91,        6.5,        26      ],
      "endPos": [        455,        91,        6.5,        26      ],
      "goalPos": [
        [          458,          92.3,          7.800000000000001,          29        ]
      ]
    },
    {
      "ID": 38,
      "initPos": [        432,        75.4,        7.800000000000001,        3      ],
      "endPos": [        432,        75.4,        7.800000000000001,        3      ],
      "goalPos": [
        [          460,          93.60000000000001,          7.800000000000001,          31        ]
      ]
    },
    {
      "ID": 39,
      "initPos": [        442,        81.9,        7.800000000000001,        13      ],
      "endPos": [        442,        81.9,        7.800000000000001,        13      ],
      "goalPos": [
        [          443,          83.2,          6.5,          14        ]
      ]
    },
    {
      "ID": 40,
      "initPos": [        481,        107.9,        6.5,        52      ],
      "endPos": [        481,        107.9,        6.5,        52      ],
      "goalPos": [
        [          460,          93.60000000000001,          7.800000000000001,          31        ]
      ]
    },
    {
      "ID": 41,
      "initPos": [        447,        85.8,        6.5,        18      ],
      "endPos": [        447,        85.8,        6.5,        18      ],
      "goalPos": [
        [          443,          83.2,          6.5,          14        ]
      ]
    },
    {
      "ID": 42,
      "initPos": [        438,        79.3,        7.800000000000001,        9      ],
      "endPos": [        438,        79.3,        7.800000000000001,        9      ],
      "goalPos": [
        [          458,          92.3,          7.800000000000001,          29        ]
      ]
    },
    {
      "ID": 43,
      "initPos": [        430,        74.10000000000001,        7.800000000000001,        1      ],
      "endPos": [        430,        74.10000000000001,        7.800000000000001,        1      ],
      "goalPos": [
        [          458,          92.3,          7.800000000000001,          29        ]
      ]
    },
    {
      "ID": 44,
      "initPos": [        446,        84.5,        7.800000000000001,        17      ],
      "endPos": [        446,        84.5,        7.800000000000001,        17      ],
      "goalPos": [
        [          460,          93.60000000000001,          7.800000000000001,          31        ]
      ]
    },
    {
      "ID": 45,
      "initPos": [        445,        84.5,        6.5,        16      ],
      "endPos": [        445,        84.5,        6.5,        16      ],
      "goalPos": [
        [          475,          104,          6.5,          46        ]
      ]
    },
    {
      "ID": 46,
      "initPos": [        462,        94.9,        7.800000000000001,        33      ],
      "endPos": [        462,        94.9,        7.800000000000001,        33      ],
      "goalPos": [
        [          443,          83.2,          6.5,          14        ]
      ]
    },
    {
      "ID": 47,
      "initPos": [        464,        96.2,        7.800000000000001,        35      ],
      "endPos": [        464,        96.2,        7.800000000000001,        35      ],
      "goalPos": [
        [          458,          92.3,          7.800000000000001,          29        ]
      ]
    },
    {
      "ID": 48,
      "initPos": [        469,        100.10000000000001,        6.5,        40      ],
      "endPos": [        469,        100.10000000000001,        6.5,        40      ],
      "goalPos": [
        [          443,          83.2,          6.5,          14        ]
      ]
    },
    {
      "ID": 49,
      "initPos": [        463,        96.2,        6.5,        34      ],
      "endPos": [        463,        96.2,        6.5,        34      ],
      "goalPos": [
        [          475,          104,          6.5,          46        ]
      ]
    }
  ]
}