<?xml version="1.0" encoding="utf-8"?>
<!-- Generator: Adobe Illustrator 26.0.3, SVG Export Plug-In . SVG Version: 6.00 Build 0)  -->
<svg version="1.1" id="Capa_1" xmlns="http://www.w3.org/2000/svg" xmlns:xlink="http://www.w3.org/1999/xlink" x="0px" y="0px"
	 viewBox="0 0 1024 1024" style="enable-background:new 0 0 1024 1024;" xml:space="preserve">
<style type="text/css">
	.st0{fill:none;stroke:#000000;stroke-width:6;stroke-miterlimit:10;}
</style>
<polygon class="st0" points="137.54,305.03 516.73,459.86 870.63,305.03 503.24,147.04 "/>
<polygon class="st0" points="526.21,876.96 516.73,459.86 870.63,305.03 870.63,725.29 "/>
<polygon class="st0" points="137.54,725.29 137.54,305.03 516.73,459.86 526.21,876.96 "/>
<line class="st0" x1="345.72" y1="221.46" x2="708.35" y2="376.03"/>
<polygon class="st0" points="229.18,459.86 418.77,529.38 418.77,690.53 229.18,617.86 "/>
</svg>
