<?xml version="1.0" encoding="utf-8"?>
<!-- Generator: Adobe Illustrator 25.3.1, SVG Export Plug-In . SVG Version: 6.00 Build 0)  -->
<svg version="1.1" id="Capa_1" xmlns="http://www.w3.org/2000/svg" xmlns:xlink="http://www.w3.org/1999/xlink" x="0px" y="0px"
	 viewBox="0 0 319.85 117.13" style="enable-background:new 0 0 319.85 117.13;" xml:space="preserve">
<style type="text/css">
	.st0{fill:#3C3C3B;}
	.st1{fill:none;stroke:#3C3C3B;stroke-miterlimit:10;}
	.st2{fill:none;stroke:#3C3C3B;stroke-width:2;stroke-miterlimit:10;}
	.st3{fill:#1D1E1D;}
	.st4{fill:none;stroke:#FFFFFF;stroke-width:2;stroke-miterlimit:10;}
	.st5{fill:none;stroke:#3C3C3B;stroke-width:2;stroke-linecap:round;stroke-linejoin:round;stroke-miterlimit:10;}
	.st6{fill:#FFFFFF;}
</style>
<g>
	<g>
		<path d="M14.35,59.62V22.81h21.47v1.04H15.49v16.17h19.13v1.04H15.49v17.52h21.16v1.04H14.35z"/>
		<path d="M66.7,50.78c0,1.56-0.3,2.95-0.91,4.18c-0.61,1.23-1.41,2.27-2.42,3.12c-1.01,0.85-2.19,1.49-3.56,1.92
			c-1.37,0.43-2.8,0.65-4.29,0.65c-2.29,0-4.38-0.41-6.26-1.22c-1.89-0.81-3.46-1.92-4.7-3.3l0.88-0.78c1.32,1.42,2.85,2.49,4.6,3.2
			c1.75,0.71,3.56,1.07,5.43,1.07c1.35,0,2.63-0.2,3.85-0.6c1.21-0.4,2.29-0.97,3.22-1.72c0.94-0.74,1.67-1.66,2.21-2.75
			c0.54-1.09,0.81-2.35,0.81-3.77c0-1.42-0.29-2.62-0.88-3.59c-0.59-0.97-1.35-1.8-2.29-2.5c-0.94-0.69-2-1.27-3.2-1.74
			c-1.2-0.47-2.4-0.89-3.61-1.27c-1.53-0.49-2.92-1-4.19-1.53c-1.27-0.54-2.36-1.2-3.28-1.97c-0.92-0.78-1.63-1.72-2.13-2.81
			c-0.5-1.09-0.75-2.42-0.75-3.98c0-1.52,0.3-2.88,0.91-4.08c0.61-1.2,1.43-2.2,2.47-3.02c1.04-0.81,2.24-1.44,3.61-1.87
			c1.37-0.43,2.82-0.65,4.34-0.65c1.87,0,3.65,0.36,5.33,1.07c1.68,0.71,3.06,1.72,4.13,3.04l-0.88,0.78
			c-0.97-1.21-2.21-2.16-3.72-2.83c-1.51-0.68-3.15-1.01-4.91-1.01c-1.25,0-2.47,0.17-3.67,0.52c-1.2,0.35-2.28,0.88-3.25,1.59
			c-0.97,0.71-1.75,1.6-2.34,2.68c-0.59,1.07-0.88,2.34-0.88,3.79c0,1.42,0.26,2.63,0.78,3.61c0.52,0.99,1.21,1.83,2.08,2.52
			c0.87,0.69,1.85,1.27,2.94,1.72c1.09,0.45,2.21,0.87,3.35,1.25c1.56,0.52,3.02,1.05,4.37,1.59c1.35,0.54,2.54,1.19,3.56,1.95
			c1.02,0.76,1.82,1.69,2.39,2.78C66.42,47.9,66.7,49.22,66.7,50.78z"/>
		<path d="M85.52,23.85v35.77h-1.14V23.85H71.85v-1.04h26.2v1.04H85.52z"/>
		<path d="M132.62,51.54c-0.49,1.82-1.28,3.41-2.39,4.76c-1.11,1.35-2.56,2.42-4.34,3.2c-1.79,0.78-3.98,1.17-6.58,1.17
			c-2.6,0-4.79-0.39-6.58-1.17c-1.79-0.78-3.23-1.85-4.34-3.2c-1.11-1.35-1.91-2.94-2.39-4.76c-0.49-1.82-0.73-3.77-0.73-5.85V22.81
			h1.14v22.67c0,1.46,0.15,3.01,0.44,4.65c0.29,1.65,0.9,3.17,1.82,4.57c0.92,1.4,2.22,2.57,3.9,3.51c1.68,0.94,3.93,1.4,6.73,1.4
			c2.74,0,4.95-0.45,6.63-1.35c1.68-0.9,2.99-2.05,3.93-3.46c0.94-1.4,1.56-2.93,1.87-4.58c0.31-1.65,0.47-3.23,0.47-4.76V22.81
			h1.14v22.88C133.35,47.77,133.11,49.72,132.62,51.54z"/>
		<path d="M175.88,41.22c0,3.19-0.52,5.94-1.56,8.24c-1.04,2.31-2.47,4.21-4.31,5.72c-1.83,1.51-3.99,2.63-6.46,3.35
			c-2.47,0.73-5.13,1.09-7.97,1.09h-10.43V22.81h10.43c2.84,0,5.49,0.36,7.97,1.07c2.47,0.71,4.63,1.82,6.46,3.33
			c1.83,1.51,3.27,3.42,4.31,5.74C175.36,35.27,175.88,38.03,175.88,41.22z M146.3,23.85v34.73h9.01c2.71,0,5.25-0.34,7.63-1.01
			c2.38-0.68,4.44-1.72,6.17-3.12c1.74-1.4,3.11-3.2,4.11-5.38c1.01-2.18,1.51-4.8,1.51-7.85c0-3.05-0.5-5.68-1.51-7.88
			c-1.01-2.2-2.38-4-4.11-5.41c-1.74-1.4-3.79-2.43-6.17-3.09c-2.38-0.66-4.92-0.99-7.63-0.99H146.3z"/>
		<path d="M186.48,59.62V22.81h1.14v36.81H186.48z"/>
		<path d="M236.03,41.22c0,2.84-0.48,5.45-1.43,7.82c-0.95,2.37-2.27,4.42-3.95,6.13c-1.68,1.72-3.68,3.06-6.01,4.03
			c-2.32,0.97-4.83,1.46-7.54,1.46c-2.7,0-5.22-0.49-7.54-1.46c-2.32-0.97-4.32-2.31-6-4.03c-1.68-1.72-3-3.76-3.95-6.13
			c-0.95-2.37-1.43-4.98-1.43-7.82c0-2.84,0.48-5.45,1.43-7.82c0.95-2.37,2.27-4.42,3.95-6.13c1.68-1.72,3.67-3.06,5.98-4.03
			c2.3-0.97,4.83-1.46,7.56-1.46c2.74,0,5.26,0.49,7.56,1.46c2.3,0.97,4.3,2.31,5.98,4.03c1.68,1.72,3,3.76,3.95,6.13
			C235.55,35.77,236.03,38.38,236.03,41.22z M234.88,41.22c0-2.56-0.43-4.97-1.3-7.2c-0.87-2.24-2.09-4.19-3.67-5.85
			c-1.58-1.66-3.46-2.97-5.64-3.93c-2.18-0.95-4.58-1.43-7.17-1.43c-2.6,0-4.99,0.48-7.17,1.43c-2.18,0.95-4.06,2.26-5.64,3.93
			c-1.58,1.66-2.8,3.61-3.67,5.85c-0.87,2.23-1.3,4.64-1.3,7.2s0.42,4.97,1.27,7.2c0.85,2.24,2.05,4.19,3.61,5.85
			c1.56,1.66,3.43,2.97,5.61,3.93c2.18,0.95,4.61,1.43,7.28,1.43c2.67,0,5.1-0.48,7.28-1.43c2.18-0.95,4.06-2.26,5.62-3.93
			c1.56-1.66,2.76-3.61,3.61-5.85C234.46,46.18,234.88,43.78,234.88,41.22z"/>
	</g>
	<g>
		<path class="st0" d="M277.18,36.81c0,4.7-1.18,8.97-3.53,12.79c-2.35,3.82-5.6,6.71-9.74,8.68c-3.3,1.57-7.42,2.35-12.36,2.35
			c-0.84,0-1.27-0.14-1.27-0.42c0-0.28,0.36-0.42,1.09-0.42c1.97-0.04,4.1-0.62,6.39-1.75c2.53-1.25,4.72-3.32,6.57-6.21
			c1.85-2.89,2.91-5.93,3.2-9.11c-2.29,1.93-4.68,2.89-7.18,2.89c-3.62,0-6.6-1.17-8.96-3.5c-2.35-2.33-3.53-5.29-3.53-8.87
			c0-4.02,1.32-7.37,3.95-10.04c2.63-2.67,5.92-4.01,9.86-4.01c3.1,0,5.95,0.87,8.56,2.59C274.87,24.89,277.18,29.9,277.18,36.81z
			 M267.72,34.86c0-3.71-0.36-6.87-1.09-9.49c-0.93-3.43-2.49-5.14-4.7-5.14c-1.57,0-2.67,0.81-3.32,2.42
			c-0.64,1.61-0.96,4.37-0.96,8.28c0,8.47,1.83,12.7,5.49,12.7c1.61,0,2.77-0.86,3.5-2.57C267.35,39.34,267.72,37.28,267.72,34.86z"
			/>
		<path class="st0" d="M310.65,54.72c0,0.44-0.14,0.66-0.42,0.66c-0.32,0-0.52-0.15-0.6-0.44c-0.08-0.3-0.16-1.11-0.24-2.45
			c-0.04-0.98-0.18-1.62-0.42-1.92c-0.24-0.29-0.76-0.5-1.57-0.62l-3.56-0.18v5.99c0,1.24,0.2,1.97,0.6,2.19
			c0.4,0.22,1.75,0.35,4.04,0.39c0.96,0,1.45,0.19,1.45,0.58c0,0.3-1.01,0.45-3.01,0.45c-7.68,0-12.69,0.04-15.02,0.12
			c-1.17,0.04-1.97,0.06-2.41,0.06c-0.72,0-1.09-0.16-1.09-0.48c0-0.4,0.6-0.6,1.79-0.6c2.51,0,3.91-0.18,4.21-0.54
			c0.3-0.36,0.45-1.02,0.45-1.99v-5.97h-5.95c-4.93,0-7.89-0.04-8.89-0.12c-0.84-0.04-1.26-0.22-1.26-0.54
			c0-0.32,0.28-0.84,0.85-1.57c0.81-1,2.8-3.55,5.98-7.63c3.18-4.08,7.4-9.24,12.63-15.47c0.04-0.08,1.15-1.43,3.32-4.04
			c0.85-1.04,1.43-1.57,1.75-1.57c0.36,0,0.54,0.48,0.54,1.45v27.86c2.45-0.04,4-0.16,4.64-0.37c0.4-0.2,0.63-0.46,0.69-0.76
			c0.06-0.3,0.09-1.18,0.09-2.62s0.2-2.16,0.6-2.16c0.28,0,0.44,0.27,0.48,0.81c0.04,0.54,0.08,2.38,0.12,5.52
			c0,2.81,0.03,4.41,0.09,4.79C310.62,53.93,310.65,54.32,310.65,54.72z M295.52,30.42c-1.05,1.09-2.75,3.2-5.13,6.33
			c-0.96,1.25-2.33,3-4.1,5.25c-2.17,2.73-3.74,4.76-4.7,6.09c2.57,0.16,5.63,0.24,9.17,0.24h4.22
			C295.09,40.69,295.27,34.72,295.52,30.42z"/>
	</g>
	<g>
		<rect x="14.35" y="70.92" class="st0" width="298.85" height="2.08"/>
	</g>
	<g>
		<path class="st0" d="M14.34,83.01h5.05c0.94,0,1.89,0.14,2.83,0.42c0.94,0.28,1.8,0.71,2.56,1.31c0.76,0.6,1.38,1.36,1.85,2.29
			c0.47,0.93,0.71,2.05,0.71,3.35c0,1.26-0.24,2.35-0.71,3.28c-0.47,0.92-1.09,1.68-1.85,2.29c-0.76,0.6-1.62,1.05-2.56,1.35
			s-1.89,0.45-2.83,0.45h-5.05V83.01z M16.39,95.92h2.58c0.89,0,1.71-0.12,2.46-0.37c0.76-0.25,1.41-0.61,1.96-1.08
			c0.55-0.47,0.97-1.05,1.28-1.75c0.3-0.69,0.46-1.48,0.46-2.35c0-0.91-0.15-1.72-0.46-2.41c-0.31-0.69-0.73-1.27-1.28-1.74
			c-0.55-0.47-1.2-0.82-1.96-1.06c-0.76-0.24-1.58-0.36-2.46-0.36h-2.58V95.92z"/>
		<path class="st0" d="M34.36,97.73H32.3V83.01h2.06V97.73z"/>
		<path class="st0" d="M47.4,85.73c-0.29-0.4-0.69-0.73-1.18-0.99c-0.5-0.26-1.06-0.38-1.68-0.38c-0.33,0-0.67,0.04-1.01,0.14
			c-0.34,0.09-0.65,0.24-0.93,0.44c-0.28,0.2-0.5,0.45-0.68,0.75c-0.17,0.3-0.26,0.65-0.26,1.07c0,0.4,0.08,0.74,0.24,1.01
			c0.16,0.27,0.37,0.5,0.64,0.69c0.27,0.19,0.59,0.35,0.96,0.48c0.37,0.13,0.76,0.27,1.18,0.41c0.5,0.15,1,0.33,1.52,0.52
			c0.51,0.19,0.98,0.45,1.39,0.77c0.42,0.32,0.76,0.72,1.02,1.2S49,92.9,49,93.64c0,0.76-0.14,1.42-0.43,1.99
			c-0.28,0.56-0.66,1.03-1.13,1.39c-0.47,0.37-1.02,0.64-1.63,0.82c-0.62,0.18-1.25,0.27-1.9,0.27c-0.93,0-1.83-0.18-2.69-0.54
			c-0.87-0.36-1.58-0.89-2.15-1.6l1.6-1.35c0.35,0.51,0.81,0.93,1.39,1.25s1.21,0.48,1.89,0.48c0.35,0,0.69-0.05,1.04-0.15
			c0.35-0.1,0.66-0.25,0.95-0.46c0.28-0.21,0.52-0.47,0.7-0.78c0.18-0.31,0.27-0.69,0.27-1.13c0-0.44-0.09-0.81-0.28-1.11
			c-0.19-0.3-0.44-0.55-0.76-0.76c-0.32-0.21-0.69-0.38-1.11-0.53c-0.42-0.15-0.87-0.29-1.34-0.45c-0.47-0.14-0.94-0.31-1.39-0.51
			c-0.46-0.2-0.87-0.46-1.23-0.77c-0.36-0.31-0.65-0.7-0.87-1.15c-0.22-0.46-0.33-1.03-0.33-1.7c0-0.74,0.15-1.37,0.45-1.89
			s0.69-0.96,1.16-1.31c0.48-0.35,1.02-0.6,1.62-0.76c0.6-0.16,1.21-0.24,1.82-0.24c0.86,0,1.66,0.15,2.41,0.46
			c0.75,0.31,1.35,0.71,1.81,1.23L47.4,85.73z"/>
		<path class="st0" d="M56.11,95.9h7.69v1.83h-9.75V83.01h9.44v1.81h-7.38v4.41h6.95V91h-6.95V95.9z"/>
		<path class="st0" d="M79.07,94.78h0.04V83.01h2.06v14.72h-2.6L70.8,85.71h-0.04v12.02H68.7V83.01h2.68L79.07,94.78z M71.3,81.68
			c0.05-0.3,0.13-0.6,0.22-0.88c0.09-0.28,0.22-0.54,0.38-0.77c0.17-0.23,0.37-0.41,0.61-0.55c0.24-0.14,0.54-0.21,0.9-0.21
			c0.26,0,0.53,0.04,0.8,0.12c0.27,0.08,0.52,0.18,0.76,0.29c0.28,0.12,0.53,0.23,0.76,0.32c0.23,0.09,0.44,0.14,0.63,0.14
			c0.3,0,0.53-0.1,0.68-0.3c0.15-0.2,0.25-0.42,0.32-0.65h1.12c-0.06,0.31-0.13,0.6-0.22,0.88c-0.09,0.28-0.22,0.54-0.38,0.77
			c-0.17,0.23-0.37,0.41-0.62,0.55c-0.25,0.14-0.55,0.21-0.89,0.21c-0.26,0-0.53-0.04-0.81-0.14c-0.28-0.09-0.54-0.19-0.79-0.3
			c-0.25-0.12-0.49-0.23-0.72-0.31c-0.23-0.08-0.44-0.12-0.63-0.12c-0.29,0-0.51,0.1-0.65,0.3c-0.15,0.2-0.25,0.42-0.32,0.65H71.3z"
			/>
		<path class="st0" d="M101.74,90.35c0,1.14-0.2,2.18-0.59,3.13c-0.4,0.95-0.94,1.77-1.63,2.45c-0.69,0.69-1.52,1.22-2.47,1.6
			c-0.96,0.38-2,0.57-3.12,0.57c-1.12,0-2.16-0.19-3.11-0.57c-0.95-0.38-1.77-0.91-2.46-1.6c-0.69-0.69-1.23-1.5-1.62-2.45
			c-0.39-0.95-0.58-1.99-0.58-3.13c0-1.15,0.19-2.2,0.58-3.15c0.39-0.95,0.93-1.76,1.62-2.43c0.69-0.67,1.51-1.2,2.46-1.57
			c0.95-0.37,1.99-0.56,3.11-0.56c1.12,0,2.16,0.19,3.12,0.56c0.96,0.37,1.78,0.9,2.47,1.57c0.69,0.67,1.24,1.48,1.63,2.43
			C101.54,88.15,101.74,89.2,101.74,90.35z M99.51,90.35c0-0.8-0.13-1.56-0.39-2.28c-0.26-0.71-0.64-1.34-1.12-1.88
			c-0.49-0.54-1.07-0.97-1.76-1.28c-0.69-0.31-1.46-0.47-2.32-0.47c-0.85,0-1.61,0.16-2.3,0.47c-0.69,0.31-1.27,0.74-1.75,1.28
			c-0.48,0.54-0.85,1.17-1.11,1.88c-0.26,0.71-0.39,1.47-0.39,2.28c0,0.82,0.13,1.59,0.39,2.31c0.26,0.72,0.64,1.35,1.12,1.88
			c0.48,0.53,1.07,0.95,1.75,1.26c0.68,0.3,1.44,0.46,2.29,0.46c0.85,0,1.62-0.15,2.31-0.46c0.69-0.31,1.28-0.73,1.77-1.26
			c0.49-0.53,0.86-1.16,1.12-1.88C99.38,91.94,99.51,91.17,99.51,90.35z"/>
		<path class="st0" d="M116.09,97.73h-2.06V83.01h2.06V97.73z"/>
		<path class="st0" d="M132.18,94.78h0.04V83.01h2.06v14.72h-2.6l-7.78-12.02h-0.04v12.02h-2.06V83.01h2.68L132.18,94.78z"/>
		<path class="st0" d="M145.16,97.73h-2.06V84.82h-4.72v-1.81h11.5v1.81h-4.72V97.73z"/>
		<path class="st0" d="M156.04,95.9h7.69v1.83h-9.75V83.01h9.44v1.81h-7.38v4.41h6.95V91h-6.95V95.9z"/>
		<path class="st0" d="M179.72,86.05c-0.44-0.48-1.01-0.87-1.69-1.16c-0.69-0.29-1.45-0.44-2.3-0.44c-0.86,0-1.64,0.16-2.33,0.47
			c-0.69,0.31-1.28,0.74-1.77,1.28c-0.49,0.54-0.86,1.17-1.12,1.88c-0.26,0.71-0.39,1.47-0.39,2.28c0,0.82,0.13,1.59,0.39,2.31
			c0.26,0.72,0.64,1.35,1.12,1.88c0.48,0.53,1.08,0.95,1.79,1.26c0.71,0.3,1.5,0.46,2.37,0.46c0.69,0,1.33-0.06,1.91-0.19
			c0.58-0.12,1.09-0.3,1.52-0.54v-4.1h-3.27v-1.75h5.3v7.13c-0.78,0.42-1.62,0.74-2.54,0.96c-0.91,0.22-1.91,0.33-2.99,0.33
			c-1.15,0-2.21-0.19-3.17-0.57c-0.96-0.38-1.79-0.91-2.48-1.6c-0.69-0.69-1.23-1.5-1.62-2.45c-0.39-0.95-0.58-1.99-0.58-3.13
			c0-1.15,0.2-2.2,0.59-3.15c0.4-0.95,0.94-1.76,1.64-2.43s1.53-1.2,2.49-1.57c0.96-0.37,2-0.56,3.12-0.56
			c1.18,0,2.23,0.17,3.15,0.52c0.92,0.35,1.69,0.81,2.3,1.39L179.72,86.05z"/>
		<path class="st0" d="M189,97.73h-2.06V83.01h4.72c0.71,0,1.38,0.07,2.02,0.22c0.64,0.15,1.2,0.38,1.67,0.7
			c0.48,0.32,0.86,0.74,1.13,1.26c0.28,0.52,0.42,1.15,0.42,1.9c0,1.08-0.33,1.96-1,2.62c-0.67,0.67-1.53,1.09-2.58,1.27l4.12,6.76
			h-2.5l-3.74-6.55H189V97.73z M189,89.46h2.37c0.49,0,0.94-0.04,1.35-0.12c0.42-0.08,0.78-0.22,1.09-0.41
			c0.31-0.19,0.56-0.43,0.74-0.73c0.18-0.3,0.27-0.67,0.27-1.11c0-0.44-0.09-0.81-0.27-1.11c-0.18-0.3-0.42-0.54-0.72-0.72
			c-0.3-0.18-0.65-0.31-1.05-0.38c-0.4-0.08-0.83-0.11-1.27-0.11H189V89.46z"/>
		<path class="st0" d="M202.45,97.73h-2.29l6.38-14.72h1.87l6.32,14.72h-2.33l-1.5-3.62h-6.99L202.45,97.73z M204.66,92.31h5.51
			l-2.75-6.9L204.66,92.31z"/>
		<path class="st0" d="M220.84,95.9h6.57v1.83h-8.63V83.01h2.06V95.9z"/>
	</g>
</g>
</svg>
