<svg version="1.1" id="Capa_1" xmlns="http://www.w3.org/2000/svg" xmlns:xlink="http://www.w3.org/1999/xlink" x="0px" y="0px"
	 viewBox="15 15 85 85" style="enable-background:new 15 15 85 85;" xml:space="preserve">
  <path fill="white" d="M81.32,34.11H18.68c-0.98,0-1.77-0.79-1.77-1.77c0-0.98,0.79-1.77,1.77-1.77h62.63
	c0.98,0,1.77,0.79,1.77,1.77C83.08,33.32,82.29,34.11,81.32,34.11z"/>
  <path fill="white" d="M81.32,51.77H18.68c-0.98,0-1.77-0.79-1.77-1.77s0.79-1.77,1.77-1.77h62.63c0.98,0,1.77,0.79,1.77,1.77
	S82.29,51.77,81.32,51.77z"/>
  <path fill="white" d="M81.32,69.42H18.68c-0.98,0-1.77-0.79-1.77-1.77c0-0.98,0.79-1.77,1.77-1.77h62.63
	c0.98,0,1.77,0.79,1.77,1.77C83.08,68.63,82.29,69.42,81.32,69.42z"/>
</svg>
