<?xml version="1.0" encoding="utf-8"?>
<!-- Generator: Adobe Illustrator 25.4.1, SVG Export Plug-In . SVG Version: 6.00 Build 0)  -->
<svg version="1.1" id="Capa_1" xmlns="http://www.w3.org/2000/svg" xmlns:xlink="http://www.w3.org/1999/xlink" x="0px" y="0px"
	 viewBox="0 0 250 250" style="enable-background:new 0 0 250 250; background-color: #282B35;" xml:space="preserve">
<g>
	<path color="white" fill="white" d="M116.1,112.57c0,15.02-3.75,28.63-11.26,40.82c-7.51,12.2-17.88,21.44-31.1,27.73
		c-10.53,5.01-23.69,7.51-39.48,7.51c-2.7,0-4.04-0.45-4.04-1.35c0-0.9,1.16-1.35,3.47-1.35c6.29-0.13,13.09-1.99,20.41-5.58
		c8.09-3.98,15.08-10.59,20.99-19.83c5.9-9.24,9.31-18.93,10.21-29.08c-7.32,6.16-14.96,9.24-22.92,9.24
		c-11.55,0-21.09-3.72-28.6-11.17c-7.51-7.44-11.26-16.88-11.26-28.31c0-12.83,4.2-23.52,12.61-32.06
		c8.41-8.54,18.9-12.81,31.49-12.81c9.88,0,19,2.76,27.34,8.28C108.71,74.5,116.1,90.49,116.1,112.57z M85.87,106.33
		c0-11.84-1.16-21.94-3.47-30.31c-2.95-10.94-7.96-16.41-15.02-16.41c-5.01,0-8.54,2.58-10.59,7.72
		c-2.05,5.15-3.08,13.96-3.08,26.45c0,27.03,5.84,40.54,17.52,40.54c5.13,0,8.86-2.74,11.17-8.21
		C84.71,120.65,85.87,114.06,85.87,106.33z"/>
	<path color="white" fill="white" d="M222.97,169.76c0,1.41-0.45,2.12-1.35,2.12c-1.03,0-1.67-0.47-1.93-1.41c-0.26-0.94-0.51-3.55-0.77-7.82
		c-0.13-3.14-0.58-5.18-1.35-6.12s-2.44-1.6-5.01-1.98l-11.36-0.58v19.12c0,3.95,0.64,6.28,1.93,6.98c1.28,0.7,5.58,1.12,12.9,1.24
		c3.08,0,4.62,0.61,4.62,1.84c0,0.96-3.21,1.43-9.63,1.43c-24.52,0-40.5,0.13-47.95,0.38c-3.72,0.13-6.29,0.19-7.7,0.19
		c-2.31,0-3.47-0.51-3.47-1.54c0-1.28,1.91-1.93,5.72-1.93c8.01,0,12.5-0.58,13.45-1.73c0.95-1.16,1.43-3.27,1.43-6.35v-19.06
		h-18.99c-15.73,0-25.2-0.13-28.39-0.39c-2.69-0.13-4.03-0.7-4.03-1.73c0-1.03,0.9-2.7,2.7-5.01c2.57-3.21,8.94-11.33,19.11-24.36
		c10.17-13.03,23.62-29.49,40.35-49.39c0.13-0.26,3.67-4.56,10.62-12.9c2.7-3.34,4.57-5.01,5.6-5.01c1.16,0,1.74,1.54,1.74,4.63
		v88.96c7.83-0.13,12.77-0.52,14.83-1.17c1.28-0.65,2.02-1.46,2.21-2.43c0.19-0.97,0.29-3.76,0.29-8.37s0.64-6.91,1.93-6.91
		c0.9,0,1.41,0.87,1.54,2.6c0.13,1.73,0.26,7.61,0.38,17.62c0,8.99,0.1,14.09,0.29,15.31C222.88,167.23,222.97,168.48,222.97,169.76
		z M174.64,92.15c-3.34,3.47-8.79,10.21-16.37,20.22c-3.08,3.98-7.45,9.57-13.09,16.75c-6.93,8.73-11.94,15.21-15.02,19.45
		c8.21,0.51,17.97,0.77,29.27,0.77h13.48C173.29,124.96,173.87,105.89,174.64,92.15z"/>
</g>
</svg>
