{
    "componentChunkName": "component---src-pages-index-js",
    "path": "/",
    "result": {"data":{"site":{"siteMetadata":{"email":"info@estudio-94.com"}},"locales":{"edges":[{"node":{"ns":"translation","data":"{\"Diseño integral\":\"Diseño integral\",\"Estudio de diseño en Huesca. Diseño web, gráfico, marketing y editorial. Soluciones gráficas para problemas cotidianos.\":\"Estudio de diseño en Binéfar, Huesca. Diseño web, gráfico, marketing y editorial. Soluciones gráficas para problemas cotidianos.\",\"strapline\":\"El diseño $graphicTerm no debería ser caro\",\"web_strapline\":\"web\",\"graphic_strapline\":\"gráfico\",\"editorial_strapline\":\"editorial\",\"Diseño web\":\"Diseño web\",\"Diseño gráfico\":\"Diseño gráfico\",\"Marketing\":\"Marketing\",\"Marketing digital\":\"Marketing digital\",\"Editorial\":\"Editorial\",\"Diseño editorial\":\"Diseño editorial\",\"Hacemos páginas web bonitas y eficientes con JAMstack y CMS tradicionales como Wordpress.\":\"Hacemos páginas web bonitas y eficientes con JAMstack y CMS tradicionales como Wordpress.\",\"En Estudio 94, nos especializamos en el diseño y desarrollo de webs estáticas y single-page para tu negocio. Trabajamos con tecnologías Jamstack y con sistemas CMS tradicionales, como WordPress, para asegurar una buena experiencia de usuario para ti y para los visitantes.\":\"En Estudio 94, nos especializamos en el diseño y desarrollo de webs estáticas y single-page para tu negocio. Trabajamos con tecnologías Jamstack y con sistemas CMS tradicionales, como WordPress, para asegurar una buena experiencia de usuario para ti y para los visitantes.\",\"Hoy en día, es esencial que las páginas web se puedan visualizar en un abanico de dispositivos y pantallas, por lo que en Estudio 94 siempre seguimos una estrategia mobile-first. Esto significa que siempre desarrollamos nuestras plantillas pensando en móviles y pantallas pequeñas, garantizando que puedas disfrutar de una experiencia de primera clase estés donde estés.\":\"Hoy en día, es esencial que las páginas web se puedan visualizar en un amplio abanico de dispositivos y pantallas, por lo que en Estudio 94 siempre seguimos una estrategia mobile-first. Esto significa que siempre desarrollamos nuestras plantillas pensando en móviles y pantallas pequeñas, garantizando que puedas disfrutar de una experiencia de primera clase estés donde estés.\",\"También creemos que, en la era de las redes sociales, es más importante que nunca centrarse en las comunicaciones y la optimización de búsqueda. Por este motivo, aseguramos que tu página web esté preparada para trabajar con los principales motores de búsqueda y redes sociales. También nos gusta trabajar con 'newsletters', que pueden ser una herramienta muy efectiva para mantener informados a tus clientes y promocionarte en la esfera digital.\":\"También creemos que, en la era de las redes sociales, es más importante que nunca centrarse en las comunicaciones y la optimización de búsqueda. Por este motivo, aseguramos que tu página web estará preparada para trabajar con los principales motores de búsqueda y redes sociales. También nos gusta trabajar con 'newsletters', que pueden ser una herramienta muy efectiva para mantener informados a tus clientes y promocionarte en la esfera digital.\",\"El diseño gráfico está en todas partes a nuestro alrededor, y nosotros lo tenemos en cuenta\":\"El diseño gráfico está presente en todo nuestro entorno, y nosotros lo tenemos en cuenta\",\"El diseño gráfico está en todas partes a nuestro alrededor: logotipos y marcas comerciales, publicidad, empaquetado de productos... Por eso es tan importante prestar atención al detalle en el diseño de estos elementos, que pasan por las manos de tanta gente. A través del diseño, podemos transmitirle al cliente aspectos que serían difíciles de comunicar mediante palabras, como la personalidad de nuestra marca.\":\"El diseño gráfico está presente en todo nuestro entorno: logotipos y marcas comerciales, publicidad, empaquetado de productos... Por eso es tan importante prestar atención al detalle en el diseño de estos elementos, que pasan por las manos de tanta gente. A través del diseño, podemos transmitirle al cliente aspectos que serían difíciles de comunicar mediante palabras, como la personalidad de nuestra marca.\",\"Nos gusta dar rienda suelta a nuestra creatividad, por lo que también hacemos trabajos para particulares: si necesitas una felicitación, cartel, póster o ilustración, ¡no dudes en ponerte en contacto!\":\"Nos gusta dar rienda suelta a nuestra creatividad, por lo que también hacemos trabajos para particulares: si necesitas una felicitación, cartel, póster o ilustración, ¡no dudes en ponerte en contacto!\",\"En Estudio 94 tenemos mucha experiencia en diseño editorial: revistas, catálogos, folletos..., para los que siempre procuramos equilibrar su función práctica con su estética e identidad de marca.\":\"En Estudio 94 tenemos mucha experiencia en diseño editorial: revistas, catálogos, folletos..., para los que siempre procuramos equilibrar la función práctica con la estética e identidad de marca.\",\"Hemos trabajado en muchos proyectos corporativos, preparando revistas y material promocional dirigido a clientes, donde prima la estética con el objetivo de llamar la atención y parecer más atractivo al potencial comprador.\":\"Hemos trabajado en muchos proyectos corporativos, preparando revistas y material promocional dirigido a clientes, donde prima la estética con el objetivo de llamar la atención y ser más atractivo al potencial comprador.\",\"Por otra parte, también hemos trabajado en numerosos catálogos industriales, donde hay que contener gran densidad de información práctica sobre los productos ofrecidos, por lo que hay que priorizar la utilidad y funcionalidad del libro.\":\"Por otra parte, también hemos trabajado en numerosos catálogos industriales, donde hay que incluir gran densidad de información práctica sobre los productos ofrecidos, por lo que es preciso priorizar la utilidad y funcionalidad del libro.\",\"En Estudio 94, podemos ayudarte a definir tu estrategia de marketing digital para que puedas formar y mantener una excelente presencia en redes.\":\"En Estudio 94, podemos ayudarte a definir tu estrategia de marketing digital para que puedas formar y mantener una excelente presencia en redes.\",\"El marketing ha evolucionado mucho desde la época de los anuncios en periódicos y en televisión. En la era de las redes sociales, es importante que tu imagen digital se ajuste a tu audiencia, y que estés publicando contenido que interese y atraiga a más gente. Esto es especialmente relevante para marcas comerciales, para las cuales es esencial que haya cohesión entre páginas web y redes sociales.\":\"El marketing ha evolucionado mucho desde la época de los anuncios en periódicos y en televisión. En la era de las redes sociales es importante que tu imagen digital se ajuste a tu audiencia y que estés publicando contenido que interese y atraiga a más gente. Esto es especialmente relevante para marcas comerciales, para las cuales es esencial que haya cohesión entre páginas web y redes sociales.\",\"En Estudio 94, podemos ayudarte a definir tu estrategia de redes y SEO, produciendo recursos gráficos digitales para que puedas formar y mantener una excelente presencia en redes. ¡Ponte en contacto si te interesa un estudio personalizado!\":\"En Estudio 94 podemos ayudarte a definir tu estrategia de redes y SEO, produciendo recursos gráficos digitales para que puedas formar y mantener una excelente presencia en redes. ¡Ponte en contacto si te interesa un estudio personalizado!\",\"Política de cookies\":\"Política de cookies\",\"Política de privacidad\":\"Política de privacidad\",\"Ponte en contacto\":\"Ponte en contacto\",\"Tu nombre\":\"Tu nombre\",\"Tu correo electrónico\":\"Tu correo electrónico\",\"Tu teléfono\":\"Tu teléfono\",\"Mensaje\":\"Mensaje\",\"Enviar\":\"Enviar\",\"Gestiona tus cookies\":\"Gestiona tus cookies\",\"Cookies internas\":\"Cookies internas\",\"Utilizamos las cookies internas para guardar tus preferencias de navegación, incluidas tus preferencias de uso de cookies.\":\"Utilizamos las cookies internas para guardar tus preferencias de navegación, incluidas tus preferencias de uso de cookies.\",\"Las cookies internas son necesarias para el funcionamento básico de esta web.\":\"Las cookies internas son necesarias para el funcionamento básico de esta web.\",\"Habilitar cookies internas\":\"Habilitar cookies internas\",\"Cookies de análisis\":\"Cookies de análisis\",\"Utilizamos cookies de Google Analytics para hacer un rastreo anonimizado del tráfico por nuestra web\":\"Utilizamos cookies de Google Analytics para hacer un rastreo anonimizado del tráfico por nuestra web\",\"Habilitar cookies de análisis\":\"Habilitar cookies de análisis\",\"Guardar\":\"Guardar\",\"Cookies\":\"Cookies\",\"Utilizamos cookies para guardar tus preferencias y analizar de manera anónima como utilizas nuestra página web, para poder mejorar tu experiencia.\":\"Utilizamos cookies para guardar tus preferencias y analizar de manera anónima como utilizas nuestra página web, para poder mejorar tu experiencia.\",\"moreInfoCookies\":\"Para más información sobre cookies, visita nuestra <2>Política de cookies</2>.\",\"Para una experiencia óptima, recomendamos que dejes activadas todas las cookies. Si lo prefieres, puedes personalizar tu configuración de cookies haciendo click en 'Gestionar cookies'.\":\"Para una experiencia óptima, recomendamos que dejes activadas todas las cookies. Si lo prefieres, puedes personalizar tu configuración de cookies haciendo click en 'Gestionar cookies'.\",\"Aceptar todas\":\"Aceptar todas\",\"Gestionar cookies\":\"Gestionar cookies\",\"Conócenos\":\"Conócenos\",\"¿Quién es Estudio 94?\":\"¿Quién es Estudio 94?\",\"María Estarán Silván es la diseñadora gráfica detrás de Estudio 94\":\"María Estarán Silván es la diseñadora gráfica detrás de Estudio 94\",\"Estudio 94 es un estudio de diseño integral, que nace con el objetivo de proveer servicios de diseño gráfico, web y márketing a clientes particulares o corporativos, a precios accesibles para todos. Somos un equipo dinámico y siempre tenemos ganas de afrontar nuevos retos.\":\"Estudio 94 es un estudio de diseño integral, que nace con el objetivo de proveer servicios de diseño gráfico, web y márketing a clientes particulares o corporativos, siempre a precios accesibles para todos. Somos un equipo dinámico y siempre tenemos ganas de afrontar nuevos retos.\",\"Soy la diseñadora gráfica que hay detrás de Estudio 94. En mis años de experiencia me he especializado en diseño editorial, packaging y marketing digital. He pasado los últimos años de mi carrera profesional en Reino Unido, trabajando para un holding empresarial como diseñadora principal, y ahora mi objetivo es aportar a los clientes de Estudio 94 todos los conocimientos que he adquirido.\":\"Soy la diseñadora gráfica que hay detrás de Estudio 94. En mis años de experiencia me he especializado en diseño editorial, packaging y marketing digital. He pasado los últimos años de mi carrera profesional en Reino Unido, trabajando para un holding empresarial como diseñadora principal, y ahora mi objetivo es aportar a los clientes de Estudio 94 todos los conocimientos que he adquirido.\",\"Como diseñadora, mi trabajo es solucionar el problema de equilibrio entre forma y función, con un poco de imaginación y mucho cuidado al detalle, siempre se encuentra una solución.\":\"Como diseñadora, mi trabajo es solucionar el problema de equilibrio entre forma y función con un poco de imaginación y mucho cuidado en el detalle. Siempre es posible encontrar una solución.\",\"Equipo\":\"Equipo\",\"Ingeniero de software\":\"Ingeniero de software\",\"Soy ingeniero de software, especializado en infraestructura en la nube, desarrollo de APIs en Python y .NET, y desarrollo de aplicaciones web con tecnologías SPA y Jamstack.\":\"Soy ingeniero de software, especializado en infraestructura en la nube, desarrollo de APIs en Python y .NET, y desarrollo de aplicaciones web con tecnologías SPA y Jamstack.\",\"Diseñadora de interiores\":\"Diseñadora de interiores\",\"Especialista en diseño de interiores, proyectos de decoración y organización de eventos, tanto para tu hogar como para tu negocio. También tengo una tienda online de decoración.\":\"Especialista en diseño de interiores, proyectos de decoración y organización de eventos, tanto para tu hogar como para tu negocio. También tengo una tienda online de decoración.\",\"¡Oh no!\":\"¡Oh no!\",\"Lo sentimos, parece que la página que buscas no existe.\":\"Lo sentimos, parece que la página que buscas no existe.\",\"Puedes volver a la página inicial o ponerte en contacto si no encuentras lo que buscas.\":\"Puedes volver a la <1>página inicial</1> o ponerte en contacto si no encuentras lo que buscas.\"}","language":"es"}}]},"digital_ES":{"childImageSharp":{"fluid":{"base64":"data:image/jpeg;base64,/9j/2wBDABALDA4MChAODQ4SERATGCgaGBYWGDEjJR0oOjM9PDkzODdASFxOQERXRTc4UG1RV19iZ2hnPk1xeXBkeFxlZ2P/2wBDARESEhgVGC8aGi9jQjhCY2NjY2NjY2NjY2NjY2NjY2NjY2NjY2NjY2NjY2NjY2NjY2NjY2NjY2NjY2NjY2NjY2P/wgARCAAIABQDASIAAhEBAxEB/8QAFgABAQEAAAAAAAAAAAAAAAAAAAIE/8QAFQEBAQAAAAAAAAAAAAAAAAAAAwT/2gAMAwEAAhADEAAAAd8kihMv/8QAFhAAAwAAAAAAAAAAAAAAAAAAAhAy/9oACAEBAAEFArNf/8QAFhEAAwAAAAAAAAAAAAAAAAAAAxBB/9oACAEDAQE/AR1f/8QAFhEAAwAAAAAAAAAAAAAAAAAAAxBB/9oACAECAQE/ATxf/8QAFxABAAMAAAAAAAAAAAAAAAAAARARMf/aAAgBAQAGPwLLCf/EABsQAAIBBQAAAAAAAAAAAAAAAAERABAhMWFx/9oACAEBAAE/IVmFjglt0//aAAwDAQACAAMAAAAQ+C//xAAVEQEBAAAAAAAAAAAAAAAAAAABEP/aAAgBAwEBPxAR/8QAFREBAQAAAAAAAAAAAAAAAAAAEDH/2gAIAQIBAT8Qsf/EABkQAQEBAQEBAAAAAAAAAAAAAAERIQAxcf/aAAgBAQABPxCYuARMQxn3jJeMued//9k=","aspectRatio":2.5641025641025643,"src":"/static/20f17ba86e437cea09733865fbfff960/50587/digital-es.jpg","srcSet":"/static/20f17ba86e437cea09733865fbfff960/4fe8c/digital-es.jpg 600w,\n/static/20f17ba86e437cea09733865fbfff960/47498/digital-es.jpg 1200w,\n/static/20f17ba86e437cea09733865fbfff960/50587/digital-es.jpg 2400w,\n/static/20f17ba86e437cea09733865fbfff960/77d93/digital-es.jpg 3600w,\n/static/20f17ba86e437cea09733865fbfff960/7dcc1/digital-es.jpg 4800w,\n/static/20f17ba86e437cea09733865fbfff960/06818/digital-es.jpg 5120w","sizes":"(max-width: 2400px) 100vw, 2400px"}}},"digital_EN":{"childImageSharp":{"fluid":{"base64":"data:image/jpeg;base64,/9j/2wBDABALDA4MChAODQ4SERATGCgaGBYWGDEjJR0oOjM9PDkzODdASFxOQERXRTc4UG1RV19iZ2hnPk1xeXBkeFxlZ2P/2wBDARESEhgVGC8aGi9jQjhCY2NjY2NjY2NjY2NjY2NjY2NjY2NjY2NjY2NjY2NjY2NjY2NjY2NjY2NjY2NjY2NjY2P/wgARCAAIABQDASIAAhEBAxEB/8QAFgABAQEAAAAAAAAAAAAAAAAAAAIE/8QAFQEBAQAAAAAAAAAAAAAAAAAAAwT/2gAMAwEAAhADEAAAAd8kihMv/8QAFhAAAwAAAAAAAAAAAAAAAAAAAhAy/9oACAEBAAEFArNf/8QAFREBAQAAAAAAAAAAAAAAAAAAAxD/2gAIAQMBAT8BOf/EABYRAAMAAAAAAAAAAAAAAAAAAAMQQf/aAAgBAgEBPwE8X//EABcQAQADAAAAAAAAAAAAAAAAAAEQETH/2gAIAQEABj8Cywn/xAAbEAACAQUAAAAAAAAAAAAAAAABEQAQITFhcf/aAAgBAQABPyFZhY4JbdP/2gAMAwEAAgADAAAAEPgv/8QAFhEAAwAAAAAAAAAAAAAAAAAAARAx/9oACAEDAQE/EAq//8QAFREBAQAAAAAAAAAAAAAAAAAAEDH/2gAIAQIBAT8Qsf/EABkQAQEBAAMAAAAAAAAAAAAAAAERIQAQcf/aAAgBAQABPxCYuARMQxnvDJddf//Z","aspectRatio":2.5641025641025643,"src":"/static/06778ce4fbc3a416ecfe6df0ad2da0e7/50587/digital-en.jpg","srcSet":"/static/06778ce4fbc3a416ecfe6df0ad2da0e7/4fe8c/digital-en.jpg 600w,\n/static/06778ce4fbc3a416ecfe6df0ad2da0e7/47498/digital-en.jpg 1200w,\n/static/06778ce4fbc3a416ecfe6df0ad2da0e7/50587/digital-en.jpg 2400w,\n/static/06778ce4fbc3a416ecfe6df0ad2da0e7/77d93/digital-en.jpg 3600w,\n/static/06778ce4fbc3a416ecfe6df0ad2da0e7/7dcc1/digital-en.jpg 4800w,\n/static/06778ce4fbc3a416ecfe6df0ad2da0e7/06818/digital-en.jpg 5120w","sizes":"(max-width: 2400px) 100vw, 2400px"}}},"editorial_ES":{"childImageSharp":{"fluid":{"base64":"data:image/jpeg;base64,/9j/2wBDABALDA4MChAODQ4SERATGCgaGBYWGDEjJR0oOjM9PDkzODdASFxOQERXRTc4UG1RV19iZ2hnPk1xeXBkeFxlZ2P/2wBDARESEhgVGC8aGi9jQjhCY2NjY2NjY2NjY2NjY2NjY2NjY2NjY2NjY2NjY2NjY2NjY2NjY2NjY2NjY2NjY2NjY2P/wgARCAAIABQDASIAAhEBAxEB/8QAFQABAQAAAAAAAAAAAAAAAAAAAAT/xAAXAQADAQAAAAAAAAAAAAAAAAAAAQID/9oADAMBAAIQAxAAAAGqkvEBf//EABcQAQADAAAAAAAAAAAAAAAAAAECEBL/2gAIAQEAAQUCWW6//8QAFREBAQAAAAAAAAAAAAAAAAAAEBH/2gAIAQMBAT8Bp//EABURAQEAAAAAAAAAAAAAAAAAABAR/9oACAECAQE/AYf/xAAWEAADAAAAAAAAAAAAAAAAAAAQETH/2gAIAQEABj8CjP8A/8QAGhABAAEFAAAAAAAAAAAAAAAAAQAQESExQf/aAAgBAQABPyEbLxzOoU//2gAMAwEAAgADAAAAEAg//8QAFREBAQAAAAAAAAAAAAAAAAAAECH/2gAIAQMBAT8Qo//EABYRAAMAAAAAAAAAAAAAAAAAAAEQEf/aAAgBAgEBPxAQv//EABoQAQEAAgMAAAAAAAAAAAAAAAERABAhUdH/2gAIAQEAAT8QJCssg7L5kTm6/9k=","aspectRatio":2.5641025641025643,"src":"/static/86707b723b5ddc4b448629730deddb87/50587/editorial-es.jpg","srcSet":"/static/86707b723b5ddc4b448629730deddb87/4fe8c/editorial-es.jpg 600w,\n/static/86707b723b5ddc4b448629730deddb87/47498/editorial-es.jpg 1200w,\n/static/86707b723b5ddc4b448629730deddb87/50587/editorial-es.jpg 2400w,\n/static/86707b723b5ddc4b448629730deddb87/77d93/editorial-es.jpg 3600w,\n/static/86707b723b5ddc4b448629730deddb87/7dcc1/editorial-es.jpg 4800w,\n/static/86707b723b5ddc4b448629730deddb87/06818/editorial-es.jpg 5120w","sizes":"(max-width: 2400px) 100vw, 2400px"}}},"editorial_EN":{"childImageSharp":{"fluid":{"base64":"data:image/jpeg;base64,/9j/2wBDABALDA4MChAODQ4SERATGCgaGBYWGDEjJR0oOjM9PDkzODdASFxOQERXRTc4UG1RV19iZ2hnPk1xeXBkeFxlZ2P/2wBDARESEhgVGC8aGi9jQjhCY2NjY2NjY2NjY2NjY2NjY2NjY2NjY2NjY2NjY2NjY2NjY2NjY2NjY2NjY2NjY2NjY2P/wgARCAAIABQDASIAAhEBAxEB/8QAFQABAQAAAAAAAAAAAAAAAAAAAAT/xAAXAQADAQAAAAAAAAAAAAAAAAAAAQID/9oADAMBAAIQAxAAAAGqkvEBf//EABcQAQADAAAAAAAAAAAAAAAAAAECEBL/2gAIAQEAAQUCWW6//8QAFREBAQAAAAAAAAAAAAAAAAAAEBH/2gAIAQMBAT8Bp//EABURAQEAAAAAAAAAAAAAAAAAABAR/9oACAECAQE/AYf/xAAWEAADAAAAAAAAAAAAAAAAAAAQETH/2gAIAQEABj8CjP8A/8QAGhABAAEFAAAAAAAAAAAAAAAAAQAQESExQf/aAAgBAQABPyEbLxzOoU//2gAMAwEAAgADAAAAEAg//8QAFREBAQAAAAAAAAAAAAAAAAAAIRD/2gAIAQMBAT8QRP/EABYRAAMAAAAAAAAAAAAAAAAAAAEQEf/aAAgBAgEBPxAQv//EABoQAQEAAgMAAAAAAAAAAAAAAAERABBBUdH/2gAIAQEAAT8QJCssg7L5kc3X/9k=","aspectRatio":2.5641025641025643,"src":"/static/58178359536ddea8b546d7bbd308dd89/50587/editorial-en.jpg","srcSet":"/static/58178359536ddea8b546d7bbd308dd89/4fe8c/editorial-en.jpg 600w,\n/static/58178359536ddea8b546d7bbd308dd89/47498/editorial-en.jpg 1200w,\n/static/58178359536ddea8b546d7bbd308dd89/50587/editorial-en.jpg 2400w,\n/static/58178359536ddea8b546d7bbd308dd89/77d93/editorial-en.jpg 3600w,\n/static/58178359536ddea8b546d7bbd308dd89/7dcc1/editorial-en.jpg 4800w,\n/static/58178359536ddea8b546d7bbd308dd89/06818/editorial-en.jpg 5120w","sizes":"(max-width: 2400px) 100vw, 2400px"}}},"packaging_ES":{"childImageSharp":{"fluid":{"base64":"data:image/jpeg;base64,/9j/2wBDABALDA4MChAODQ4SERATGCgaGBYWGDEjJR0oOjM9PDkzODdASFxOQERXRTc4UG1RV19iZ2hnPk1xeXBkeFxlZ2P/2wBDARESEhgVGC8aGi9jQjhCY2NjY2NjY2NjY2NjY2NjY2NjY2NjY2NjY2NjY2NjY2NjY2NjY2NjY2NjY2NjY2NjY2P/wgARCAAIABQDASIAAhEBAxEB/8QAFgABAQEAAAAAAAAAAAAAAAAAAAQB/8QAFQEBAQAAAAAAAAAAAAAAAAAAAAH/2gAMAwEAAhADEAAAAaqCMFf/xAAXEAADAQAAAAAAAAAAAAAAAAACEBET/9oACAEBAAEFAoWi/8QAFBEBAAAAAAAAAAAAAAAAAAAAEP/aAAgBAwEBPwE//8QAFBEBAAAAAAAAAAAAAAAAAAAAEP/aAAgBAgEBPwE//8QAFhAAAwAAAAAAAAAAAAAAAAAAARBh/9oACAEBAAY/AoX/AP/EABoQAAICAwAAAAAAAAAAAAAAAAERACEQMVH/2gAIAQEAAT8hSTvkdSsf/9oADAMBAAIAAwAAABB/z//EABQRAQAAAAAAAAAAAAAAAAAAABD/2gAIAQMBAT8QP//EABURAQEAAAAAAAAAAAAAAAAAAAEQ/9oACAECAQE/ECf/xAAZEAEAAgMAAAAAAAAAAAAAAAABACEQMWH/2gAIAQEAAT8QEDUCKlOQpe8f/9k=","aspectRatio":2.5641025641025643,"src":"/static/b40b0b1d624fc9a25d725dfa20fc28a4/50587/packaging-es.jpg","srcSet":"/static/b40b0b1d624fc9a25d725dfa20fc28a4/4fe8c/packaging-es.jpg 600w,\n/static/b40b0b1d624fc9a25d725dfa20fc28a4/47498/packaging-es.jpg 1200w,\n/static/b40b0b1d624fc9a25d725dfa20fc28a4/50587/packaging-es.jpg 2400w,\n/static/b40b0b1d624fc9a25d725dfa20fc28a4/77d93/packaging-es.jpg 3600w,\n/static/b40b0b1d624fc9a25d725dfa20fc28a4/7dcc1/packaging-es.jpg 4800w,\n/static/b40b0b1d624fc9a25d725dfa20fc28a4/06818/packaging-es.jpg 5120w","sizes":"(max-width: 2400px) 100vw, 2400px"}}},"packaging_EN":{"childImageSharp":{"fluid":{"base64":"data:image/jpeg;base64,/9j/2wBDABALDA4MChAODQ4SERATGCgaGBYWGDEjJR0oOjM9PDkzODdASFxOQERXRTc4UG1RV19iZ2hnPk1xeXBkeFxlZ2P/2wBDARESEhgVGC8aGi9jQjhCY2NjY2NjY2NjY2NjY2NjY2NjY2NjY2NjY2NjY2NjY2NjY2NjY2NjY2NjY2NjY2NjY2P/wgARCAAIABQDASIAAhEBAxEB/8QAFgABAQEAAAAAAAAAAAAAAAAAAAQB/8QAFQEBAQAAAAAAAAAAAAAAAAAAAAH/2gAMAwEAAhADEAAAAaqCMFf/xAAWEAADAAAAAAAAAAAAAAAAAAAQEyL/2gAIAQEAAQUCpg//xAAUEQEAAAAAAAAAAAAAAAAAAAAQ/9oACAEDAQE/AT//xAAUEQEAAAAAAAAAAAAAAAAAAAAQ/9oACAECAQE/AT//xAAVEAEBAAAAAAAAAAAAAAAAAAAQYf/aAAgBAQAGPwKP/8QAFxABAQEBAAAAAAAAAAAAAAAAETEBEP/aAAgBAQABPyEZXDZ3/9oADAMBAAIAAwAAABAPz//EABQRAQAAAAAAAAAAAAAAAAAAABD/2gAIAQMBAT8QP//EABURAQEAAAAAAAAAAAAAAAAAAAEQ/9oACAECAQE/ECf/xAAaEAEBAAIDAAAAAAAAAAAAAAABEQAQIUFR/9oACAEBAAE/EAqUop5HpnE7uv/Z","aspectRatio":2.5641025641025643,"src":"/static/4bf073079c7da9b5dc295ce110595121/50587/packaging-en.jpg","srcSet":"/static/4bf073079c7da9b5dc295ce110595121/4fe8c/packaging-en.jpg 600w,\n/static/4bf073079c7da9b5dc295ce110595121/47498/packaging-en.jpg 1200w,\n/static/4bf073079c7da9b5dc295ce110595121/50587/packaging-en.jpg 2400w,\n/static/4bf073079c7da9b5dc295ce110595121/77d93/packaging-en.jpg 3600w,\n/static/4bf073079c7da9b5dc295ce110595121/7dcc1/packaging-en.jpg 4800w,\n/static/4bf073079c7da9b5dc295ce110595121/06818/packaging-en.jpg 5120w","sizes":"(max-width: 2400px) 100vw, 2400px"}}}},"pageContext":{"language":"es","i18n":{"language":"es","languages":["en","es"],"defaultLanguage":"es","generateDefaultLanguagePage":false,"routed":false,"originalPath":"/","path":"/"}}},
    "staticQueryHashes": ["63159454","845761813","880690310"]}