<?xml version="1.0" encoding="utf-8"?>
<!-- Generator: Adobe Illustrator 25.1.0, SVG Export Plug-In . SVG Version: 6.00 Build 0)  -->
<svg version="1.1" id="Capa_1" xmlns="http://www.w3.org/2000/svg" xmlns:xlink="http://www.w3.org/1999/xlink" x="0px" y="0px"
	 viewBox="0 0 69 66" style="enable-background:new 0 0 69 66;" xml:space="preserve">
<style type="text/css">
	.st0{fill:#B8CCD8;}
	.st1{fill:#333333;}
	.st2{fill:#B2B2B2;}
	.st3{fill:#0D497C;}
	.st4{fill:#1D1D1B;}
	.st5{fill:#FFFFFF;}
	.st6{fill:#E5E5E5;}
	.st7{clip-path:url(#SVGID_14_);}
	.st8{clip-path:url(#SVGID_16_);enable-background:new    ;}
	.st9{enable-background:new    ;}
</style>
<g>
	<path class="st5" d="M58.04,30.47c-0.03,3.06-0.03,6.11-0.1,9.17c-0.05,2.15-0.33,4.27-1.05,6.32c-1.01,2.89-2.89,5.05-5.53,6.56
		c-1.83,1.05-3.81,1.62-5.89,1.87c-2.54,0.3-5.09,0.25-7.64,0.25c-3.97,0-7.93,0-11.9-0.03c-2.19-0.01-4.37-0.17-6.49-0.76
		c-2.03-0.57-3.86-1.51-5.39-2.99c-1.93-1.88-3.09-4.17-3.7-6.77c-0.45-1.92-0.56-3.87-0.57-5.83c-0.03-3.71-0.05-7.42-0.03-11.13
		c0.01-2.4,0.06-4.81,0.16-7.2c0.09-2.12,0.56-4.17,1.47-6.1c1.1-2.33,2.81-4.09,5.04-5.36C18.15,7.48,20.03,6.9,22,6.69
		c1.72-0.18,3.45-0.26,5.18-0.29c3.08-0.05,6.15-0.03,9.23-0.02c2.22,0.01,4.43,0.02,6.64,0.07c2.26,0.06,4.49,0.35,6.62,1.17
		c2.52,0.96,4.46,2.62,5.9,4.89c1.17,1.84,1.8,3.87,2.13,6.02c0.27,1.72,0.21,3.45,0.24,5.18c0.04,2.25,0.01,4.51,0.01,6.76
		C57.98,30.47,58.01,30.47,58.04,30.47z M53.7,28.85c0-1.31,0.02-2.61,0-3.92c-0.04-2.19-0.01-4.38-0.45-6.55
		c-0.22-1.07-0.51-2.08-1.03-3.04c-1.26-2.35-3.27-3.66-5.84-4.12c-2.33-0.42-4.7-0.52-7.06-0.54c-3.78-0.04-7.56-0.04-11.33,0
		c-2.05,0.02-4.11,0.06-6.14,0.44c-1.26,0.24-2.45,0.6-3.54,1.28c-1.09,0.68-2.01,1.52-2.65,2.65c-0.69,1.22-1.1,2.51-1.21,3.9
		c-0.14,1.74-0.31,3.48-0.38,5.23c-0.07,1.49-0.04,2.99-0.02,4.48c0.03,3.91-0.12,7.83,0.16,11.74c0.12,1.67,0.39,3.32,1.11,4.85
		c1.03,2.18,2.71,3.64,5.04,4.31c1.55,0.44,3.15,0.57,4.75,0.65c1.93,0.1,3.87,0.12,5.81,0.13c3.05,0.02,6.09,0.03,9.14-0.02
		c2.06-0.03,4.13-0.04,6.17-0.48c0.98-0.21,1.92-0.5,2.81-0.98c2.28-1.23,3.62-3.15,4.11-5.65c0.44-2.25,0.53-4.53,0.57-6.82
		C53.73,33.89,53.7,31.37,53.7,28.85z"/>
	<path class="st5" d="M33.77,42.93c-6.44,0.09-12.2-5.1-12.43-11.95c-0.23-6.98,5.34-12.8,12.29-12.89
		c7.23-0.1,12.39,5.82,12.57,12.02C46.39,37.01,40.86,43.03,33.77,42.93z M33.79,38.52c4.63,0.06,8.16-3.93,8.1-8.04
		c-0.07-4.51-3.62-8.07-8.14-8.08c-4.52-0.01-8.13,3.72-8.11,8.21C25.64,35.06,29.56,38.61,33.79,38.52z"/>
	<path class="st5" d="M49.66,17.58c-0.02,1.51-1.45,2.92-2.96,2.91c-1.51-0.01-2.93-1.47-2.91-2.98c0.02-1.51,1.46-2.91,2.97-2.89
		C48.28,14.63,49.68,16.06,49.66,17.58z"/>
</g>
</svg>
