<?xml version="1.0" encoding="utf-8"?>
<!-- Generator: Adobe Illustrator 25.1.0, SVG Export Plug-In . SVG Version: 6.00 Build 0)  -->
<svg version="1.1" id="Capa_1" xmlns="http://www.w3.org/2000/svg" xmlns:xlink="http://www.w3.org/1999/xlink" x="0px" y="0px"
	 viewBox="0 0 74 64" style="enable-background:new 0 0 74 64;" xml:space="preserve">
<g>
	<path color="black" d="M59.91,25.63L52.3,19.4v-5.87c0-0.78-0.63-1.41-1.41-1.41H43.4L37.39,7.2c-0.52-0.42-1.26-0.43-1.78-0.01
		l-6.11,4.93h-7.72c-0.78,0-1.41,0.63-1.41,1.41v5.96l-7.6,6.13c-0.33,0.27-0.52,0.67-0.52,1.1v26.92c0,0.78,0.63,1.41,1.41,1.41
		h45.36c0.78,0,1.41-0.63,1.41-1.41V26.72C60.42,26.3,60.23,25.9,59.91,25.63L59.91,25.63z M25.88,39.51L15.06,50.26V29.87
		L25.88,39.51z M27.99,41.4l7.4,6.6c0.27,0.24,0.6,0.36,0.94,0.36S37,48.24,37.27,48l7.4-6.6l10.91,10.84H17.08L27.99,41.4z
		 M46.79,39.51l10.81-9.64v20.38L46.79,39.51z M56.84,26.77l-4.54,4.05v-7.77L56.84,26.77z M36.49,10.11l2.46,2.01h-4.95
		L36.49,10.11z M49.47,14.94v18.39L36.33,45.05L23.19,33.33V14.94H49.47z M20.36,30.82l-4.53-4.04l4.53-3.66V30.82z M20.36,30.82"/>
	<path color="black" d="M27.54,20.53h17.59c0.78,0,1.41-0.63,1.41-1.41c0-0.78-0.63-1.41-1.41-1.41H27.54c-0.78,0-1.41,0.63-1.41,1.41
		C26.13,19.9,26.76,20.53,27.54,20.53L27.54,20.53z M27.54,20.53"/>
	<path color="black" d="M27.54,25.19h6.04c0.78,0,1.41-0.63,1.41-1.41c0-0.78-0.63-1.41-1.41-1.41h-6.04c-0.78,0-1.41,0.63-1.41,1.41
		C26.13,24.56,26.76,25.19,27.54,25.19L27.54,25.19z M27.54,25.19"/>
	<path color="black" d="M45.12,22.37h-6.04c-0.78,0-1.41,0.63-1.41,1.41c0,0.78,0.63,1.41,1.41,1.41h6.04c0.78,0,1.41-0.63,1.41-1.41
		C46.54,23,45.9,22.37,45.12,22.37L45.12,22.37z M45.12,22.37"/>
	<path color="black" d="M27.54,29.89h6.04c0.78,0,1.41-0.63,1.41-1.41c0-0.78-0.63-1.41-1.41-1.41h-6.04c-0.78,0-1.41,0.63-1.41,1.41
		C26.13,29.26,26.76,29.89,27.54,29.89L27.54,29.89z M27.54,29.89"/>
	<path color="black" d="M45.12,27.07h-6.04c-0.78,0-1.41,0.63-1.41,1.41c0,0.78,0.63,1.41,1.41,1.41h6.04c0.78,0,1.41-0.63,1.41-1.41
		C46.54,27.7,45.9,27.07,45.12,27.07L45.12,27.07z M45.12,27.07"/>
	<path color="black" d="M27.54,34.6h17.59c0.78,0,1.41-0.63,1.41-1.41c0-0.78-0.63-1.41-1.41-1.41H27.54c-0.78,0-1.41,0.63-1.41,1.41
		C26.13,33.97,26.76,34.6,27.54,34.6L27.54,34.6z M27.54,34.6"/>
</g>
</svg>
