{
  "Conversion Capsule": {
    "energy": -4,
    "keywords": ["conversion", "population"],
    "tiles": 6,
    "waste": 1
  },
  "Habitat Pod": {
    "energy": -1,
    "population": 2,
    "keywords": ["population"],
    "tiles": 8,
    "waste": 1
  },
  "Monetization Station": {
    "energy": -1,
    "keywords": ["income", "population"],
    "tiles": 6
  },
  "Small Generator": {
    "energy": 3,
    "fuel": -1,
    "keywords": ["energy", "generator", "small"],
    "tiles": 5
  },
  "Medium Generator": {
    "energy": 6,
    "fuel": -2,
    "keywords": ["energy", "generator", "medium"],
    "tiles": 12
  },
  "Large Generator": {
    "energy": 9,
    "fuel": -3,
    "keywords": ["energy", "generator", "large"],
    "tiles": 21
  },
  "Small Battery": {
    "keywords": ["energy", "storage", "small"],
    "tiles": 1
  },
  "Medium Battery": {
    "keywords": ["energy", "storage", "medium"],
    "tiles": 2
  },
  "Small Relay": {
    "keywords": ["energy", "relay", "small"],
    "tiles": 1
  },
  "Large Relay": {
    "keywords": ["energy", "large", "relay"],
    "tiles": 3
  },
  "Energy Bridge": {
    "keywords": ["bridge", "energy"],
    "tiles": 1
  },
  "Small FAB": {
    "fuel": 3,
    "keywords": ["fuel", "generator", "small"],
    "tiles": 4
  },
  "Large FAB": {
    "fuel": 6,
    "keywords": ["fuel", "generator", "large"],
    "tiles": 10
  },
  "Small Tank": {
    "keywords": ["fuel", "small", "storage"],
    "tiles": 1
  },
  "Large Tank": {
    "keywords": ["fuel", "large", "storage"],
    "tiles": 4
  },
  "Small Storage Container": {
    "keywords": ["logistics", "small", "storage"],
    "tiles": 1
  },
  "Medium Storage Container": {
    "keywords": ["logistics", "medium", "storage"],
    "tiles": 4
  },
  "Large Storage Container": {
    "keywords": ["large", "logistics", "storage"],
    "tiles": 9
  },
  "Waste Receptacle": {
    "keywords": ["logistics", "waste"],
    "tiles": 1
  },
  "L1 Processor": {
    "energy": -1,
    "keywords": ["1", "processor", "resources"],
    "tiles": 6,
    "waste": 1
  },
  "L2 Processor": {
    "energy": -2,
    "keywords": ["2", "processor", "resources"],
    "tiles": 8,
    "waste": 2
  },
  "Mineral Input Module": {
    "energy": -1,
    "keywords": ["input", "mineral", "resources"],
    "tiles": 6
  },
  "Isotope Input Module": {
    "energy": -1,
    "keywords": ["input", "isotope", "resources"],
    "tiles": 6
  },
  "Output Module": {
    "energy": -1,
    "keywords": ["output", "resources"],
    "tiles": 6
  },
  "Employee Module": {
    "employee": -1,
    "energy": -1,
    "keywords": ["employee", "resources"],
    "tiles": 6
  },
  "Waste Module": {
    "keywords": ["waste", "resources"],
    "tiles": 2
  }
}
