{
  "iris": {
    "historical_data": {
      "begin": "04/09/2019",
      "end": "10/07/2019"
    },
    "begin_simulation": "10/13/2019",
    "length": 33
  },
  "ampds": {
    "historical_data": {
      "begin": "05/01/2012",
      "end": "05/07/2013"
    },
    "begin_simulation": "05/12/2013",
    "length": 33
  },
  "synthetic_data_general_case": {
    "historical_data": {
      "begin": "05/01/2019",
      "end": "09/01/2019"
    },
    "begin_simulation": "09/08/2019",
    "length": 33
  },
  "synthetic_data_not_correlated": {
    "historical_data": {
      "begin": "05/01/2019",
      "end": "09/01/2019"
    },
    "begin_simulation": "09/08/2019",
    "length": 33
  },
    "synthetic_working_house_data": {
    "historical_data": {
      "begin": "05/01/2019",
      "end": "09/01/2019"
    },
    "begin_simulation": "09/08/2019",
    "length": 33
  },

  "synthetic_remote_working_house_data": {
    "historical_data": {
      "begin": "05/01/2019",
      "end": "09/01/2019"
    },
    "begin_simulation": "09/08/2019",
    "length": 33
  }
}