{"name": "legends-shared",
			"title": "Legends of Barsaive Shared",
			"description": "Shared Content for the Legends of Barsaive Campaign",
			"author": "Tom LaPorta and Patrick Mohrmann",
			"version": "1.0.0",
			"minimumCoreVersion": "0.6.0",
			"compatibleCoreVersion":"0.8.9",
            "manifest":https://gitlab.com/fattom23/legends-shared/-/raw/main/module.json",
            "download": "https://gitlab.com/fattom23/legends-shared/-/raw/release-files/legends-shared-1.0-production.zip"
			"packs": [
				{
                    "name": "actorCharacters",
					"label": "LoB NPC Actors",
                    "path": "packs/characters.db",
                    "entity": "Actor",
                    "module": "legends-shared"
                 },
                 {
                    "name": "locations",
					"label": "LoB Locations",
                    "path": "packs/locations.db",
                    "entity": "JournalEntry",
                    "module": "legends-shared"
                 },
                 {
                    "name": "journalCharacters",
					"label": "LoB NPC Journals",
                    "path": "packs/character-journals.db",
                    "entity": "JournalEntry",
                    "module": "legends-shared"
                 },
                 {
                    "name": "scene",
					"label": "LoB Maps",
                    "path": "packs/scenes.db",
                    "entity": "Scene",
                    "module": "legends-shared"
                 },
                 {
                    "name": "organizations",
					"label": "LoB Organizations",
                    "path": "packs/organizations.db",
                    "entity": "JournalEntry",
                    "module": "legends-shared"
                 }

				 
			],
            "dependencies": [{
            "type": "module",
            "name": "compendium-folders",
            "manifest": "https://raw.githubusercontent.com/earlSt1/vtt-compendium-folders/master/module.json"
         },
         {
            "name": "earthdawn4e",
            "type": "system"
        }]
}		
