<?xml version="1.0" encoding="utf-8"?>
<!-- Generator: Adobe Illustrator 24.3.0, SVG Export Plug-In . SVG Version: 6.00 Build 0)  -->
<svg version="1.1" xmlns="http://www.w3.org/2000/svg" xmlns:xlink="http://www.w3.org/1999/xlink" x="0px" y="0px"
	 viewBox="0 0 1024 512" style="enable-background:new 0 0 1024 512;" xml:space="preserve">
<style type="text/css">
	.st0{opacity:0.4;fill:#010202;}
	.st1{fill:#ED6F0F;}
	.st2{fill:url(#SVGID_1_);}
	.st3{fill:#383422;}
	.st4{clip-path:url(#SVGID_3_);fill:none;}
	.st5{clip-path:url(#SVGID_5_);fill:#E5231F;}
	.st6{clip-path:url(#SVGID_7_);fill:#233C1D;}
	.st7{clip-path:url(#SVGID_9_);fill:#020304;}
	.st8{fill:#1D1D1C;}
	.st9{fill:url(#SVGID_10_);}
	.st10{fill:url(#SVGID_11_);}
	.st11{fill:url(#SVGID_12_);}
	.st12{fill:url(#SVGID_13_);}
	.st13{fill:url(#SVGID_14_);}
	.st14{fill:url(#SVGID_15_);}
	.st15{fill:#020304;}
	.st16{fill:#010202;}
	.st17{fill:#FFFFFF;}
	.st18{clip-path:url(#SVGID_17_);fill:#E5231F;}
	.st19{clip-path:url(#SVGID_19_);fill:#264395;}
	.st20{clip-path:url(#SVGID_21_);fill:none;}
	.st21{clip-path:url(#SVGID_23_);fill:#264395;}
	.st22{clip-path:url(#SVGID_25_);fill:#020304;}
	.st23{clip-path:url(#SVGID_25_);}
	.st24{clip-path:url(#SVGID_27_);fill:none;}
	.st25{clip-path:url(#SVGID_29_);fill:#E5231F;}
	.st26{clip-path:url(#SVGID_31_);fill:#233C1D;}
	.st27{clip-path:url(#SVGID_33_);fill:#020304;}
	.st28{clip-path:url(#SVGID_33_);}
	.st29{clip-path:url(#SVGID_35_);fill:#264395;}
	.st30{fill:#264395;}
	.st31{fill:#E5231F;}
	.st32{fill:#233C1D;}
	.st33{fill:url(#SVGID_36_);}
	.st34{fill:url(#SVGID_37_);}
	.st35{fill:#FDEB36;}
	.st36{fill:#FFCF02;}
	.st37{fill:#3A3824;}
	.st38{fill:#443E23;}
	.st39{fill:#F39200;}
</style>
<g id="Слой_1">
	<linearGradient id="SVGID_1_" gradientUnits="userSpaceOnUse" x1="512" y1="71.1826" x2="512" y2="423.9568">
		<stop  offset="0.2809" style="stop-color:#FDC800"/>
		<stop  offset="0.6685" style="stop-color:#F18F34"/>
		<stop  offset="0.8876" style="stop-color:#E95F32"/>
		<stop  offset="1" style="stop-color:#E3312D"/>
	</linearGradient>
	<path class="st2" d="M374.7,306.2c14.1-71.2,53.2-152.4,131-204.1c3.9-2.6,8.8-2.6,12.7,0c77.7,51.7,116.9,132.8,131,204.1
		c1.8,9.1-1.6,18.5-8.7,23.5c-21.5,15.1-47.4,25-70.8,31.1c-4.2,31.3-28.4,50.9-57.8,50.9c-29.4,0-53.7-19.6-57.8-50.9
		c-23.5-6.1-49.3-16-70.8-31.1C376.3,324.8,372.9,315.3,374.7,306.2z M409.5,364c0-4.8-3.9-8.6-8.6-8.6c-4.8,0-8.6,3.9-8.6,8.6
		c0,4.8,3.9,8.6,8.6,8.6C405.6,372.7,409.5,368.8,409.5,364z M386.9,396.1c0,7.7,6.3,14,14,14c7.7,0,14-6.3,14-14
		c0-7.7-6.3-14-14-14C393.1,382.1,386.9,388.4,386.9,396.1z M631.8,364c0-4.8-3.9-8.6-8.6-8.6c-4.8,0-8.6,3.9-8.6,8.6
		c0,4.8,3.9,8.6,8.6,8.6C627.9,372.7,631.8,368.8,631.8,364z M609.2,396.1c0,7.7,6.3,14,14,14c7.7,0,14-6.3,14-14
		c0-7.7-6.3-14-14-14C615.4,382.1,609.2,388.4,609.2,396.1z"/>
</g>
<g id="Слой_2">
	<path class="st35" d="M-2.3-1.5v515h1032.1v-515H-2.3z M513.7,500.5c-270.6,0-490-109.5-490-244.5s219.4-244.5,490-244.5
		c270.6,0,490,109.5,490,244.5S784.3,500.5,513.7,500.5z"/>
	<path class="st36" d="M752.8,599.2c4.3-25.4-13.9-46.5-33.9-49.9s-40,17.4-34.4,31.6s13.8,13,16.6,12.8
		c-10.3-10.6-10.2-21.6,3.9-27.5c14.1-5.9,26.9,12.7,23.6,26.2c-3.3,13.5-18.9,28.7-36.4,23.7c-17.6-5.1-29.8-21-27.3-34.7
		c-5.4,6.8-0.6,19.4-9.3,26.2c-15.3,11.8-26.3,1.7-35.7,1.6c6.8-9.7,4.3-19.6,4.2-34.7c-0.1-15.1,12.9-38.6,34-43.3
		s29.3-2.5,29.3-2.5c-8-6.2-26.6-10-44.9,2.3s-20,27.5-32.3,37.7c-12.3,10.1-33.7,13.8-49.4,5.2c8.6-7,13.3-16.3,14.9-24.1
		c1.6-7.8,10.6-12.6,10.6-12.6c-4.1-5.7-5.1-7.6-5.1-7.6s12.2-13.6,29.6-16.5c-21.1,1.8-51.5,17-87.7,22.7
		c-36.2,5.7-68-7.2-69.8-29.2c-1.8-22,13-38,29.6-36.8s26.6,17.7,19.3,26.5c-7.4,8.8-26.2,10.1-27.2-3.5c-8.3,4.9-3.3,18.3,5.7,20.1
		c8.9,1.8,21.5-1.1,28.6-16.5c7.1-15.4,19-27.2,35-11.8c4.5-13,14.5-11.6,14.5-11.6c4.4,11.9,14.1,25.1,34.8,28
		c-21-13.1-34.7-26.8-30.3-55.6c6.8,6.4,14.5,4.8,14.5,4.8c11.3-8.2,22.3-13,33.1-0.2c1.9-10.6,14.8-10.2,18.8-7.1
		c-0.9,15.1,5.4,39.6,28.6,44.8c-19.9-19.6-23.7-38-19.4-55.7c11.9,9.1,29.8,6.9,35.3,6.5s13,3.6,12.7,17s-8,41.1,27,57.4
		c-16.7-16.3-22.4-26-16.8-45.5c3.2-11.2,12.9-11.2,12.7-24.9c19.8,4.5,30.5,10,29.9,28.4c4.5-5.3,8.6-5.4,8.6-5.4s9.5,9.8,3.4,21.9
		c-6.1,12.1-9.1,24.1-7.7,32.9c10.2-24.9,20.4-27.5,31-25.5s20.7,19.4,13.8,31.8c-6.9,12.4-23.2,13.5-27.7,4.9
		c-4.5-8.6,3-16.2,9.1-17.3c-6.8-2.9-19.2,6-19.6,17s1.6,21.8,6.7,34.2S759.9,592.5,752.8,599.2z"/>
	<path class="st36" d="M-87.3,127.9c26.5-35.5,47-46.8,66.6-36.7C-10.7,96.4-8,108-3.4,110.8c4.6,2.8,11.6-3.3,23.2,5.7
		s6.1,20.5,0.8,24.8S8.9,144,8.6,142.7c-0.3-1.3,0.8-9.4-6.6-10.3c-7.4-0.9-16,11.9-9.1,18.9c10.8,10.9,31.2,10.4,41.6-12
		S27,86,1.6,79.5s-49.9-4.6-68.5,15.1c18.1-27.9,65.2-29.3,88.4-12.9s29.6,48.1,21.6,70.6s-7.9,32.2-4.9,37.3
		c3,5.1,3.9,9.7,3.9,13.1c12.6-3.6,23.9-12.9,23.5-30.8c7,29.1,4,60.7-13.7,61.1c4.5-6,6.3-17-3.1-19.5S31,219,31,229.2
		c-0.1,10.2,10.3,21.6,23.1,19.9c12.8-1.6,29.7-18.4,25.6-44.3c7.4,27.3-1.6,49.3-16.8,61.1c1.1,3.9,8.6,10.1,16,7.9
		c-0.3,22.2,12,26.3,23.2,29c11.2,2.7,18.2,8.7,19.7,11.5c0.5-13.6,13.3-26,5-39.3c5,2.1,10.1,2.1,10.1,2.1s-0.4-11.5-12.3-16.8
		c-11.8-5.3-10.8-14.7-10.8-14.7s7.4,1.1,26.9,17.3s51.9,16.3,70.6,5.6s30.7-39.7,15-61.6s-37.1-12-40.1-2.8s4.6,22.3,15.3,22.2
		c10.6-0.2,12.8-12.3,12.8-12.3s12.5,12.1,2,26s-31.4,12-37.2,4.2c-5.8-7.9-8.7-19.7-14.5-20.7c-5.8-1-14.5,6.4-22,6.8
		c-7.5,0.4-12.3-2.6-15.8-5.1c18.5,2.5,22.3-6.2,26.3-9.7c-8.6-11.2-22.9-8-31.1-8.8c-8.3-0.8-18.2-4.9-27.3-12.2
		c18.5,5.8,46.1,10.6,54.3-10.7c-10.9-3.8-16.2-11.7-18.9-15.5c-2.7-3.8-9.9-5.9-16.7-2.1c0.1-5.1-3.9-6-12.6-3.7
		c-8.7,2.3-26.6,3.3-32-15.9c19.1,5.1,23.3,0.6,27.8-2.7c4.5-3.4,7.5-4.4,12.6-3.8c-7.2-13.5-24.7-17.4-33.1-20.5
		c-8.4-3.1-19.7-11.5-24.6-18.7c17,13.2,33.8,20.9,62.3,19s42.4-21.3,40.9-39.4c-1.5-18.1-19.5-18.2-24.6-10.5
		c-5.1,7.6,4.1,21,13.9,18.5c-2.8,12.8-16.5,25.6-37.5,25.7S70.1,109,54.2,95.5c32.6,3.9,59.9-1.9,71.6-38.3
		c-4.8-3-15.4-0.1-20.6-6.7c-5.2-6.6-20.3-14.6-29.7,2.1c3.6-10.5,1.6-16.9-5.4-20.1c-2,8.2-8.9,7.2-14.3,7.7
		c-5.4,0.5-9.7,4-13.5,8.7s-5,8.6-12.4,9.2c7.4-5.7,11.7-8.2,17.4-20.5s-2.1-18.1-4.2-19.6c-2.8,3.8-5.3,5.6-8.8,5.6
		C40,17.3,38.9,8.8,33.7,3s-8-9.3-8-9.3s-5.9,6.8-12.5,7.8S3.3,10.3,2.5,16.2c-5.6-2.9-11-0.8-11-0.8s3,9.8-1.4,17.3
		s-24.9,18.1-40.9,28.7S-83.1,93.7-87.3,127.9z"/>
	<path class="st36" d="M135-79.7c-15.9,19.6-10.5,46.2,4.8,58.8s42.4,4.5,44.4-10.3s-5.5-17.7-8-18.9c3.6,13.9-1.7,23.2-16.6,21.4
		s-16.7-23.7-7.5-33.6s29.9-15.3,42.4-2.6c12.5,12.7,15.2,32.3,6.5,42.6c7.9-3.2,9.8-16.3,20.5-17.8c18.7-2.7,23.2,11.2,31.1,15.9
		c-10.4,5-13.1,14.6-20.3,27.5S203,29.9,182.8,23.7s-26.1-12-26.1-12c3.8,9.2,17.9,21.3,39.3,19.7c21.4-1.6,30.3-13.8,45.6-16.5
		s35.3,4.5,44.5,19.3c-10.6,1.8-19.2,7.4-24.2,13.3c-5.1,5.9-15.1,5.6-15.1,5.6c0.8,6.8,0.7,8.9,0.7,8.9s-16.9,5.7-33.1-0.2
		c18.8,8.6,52,10.4,85.5,22.9s54.3,38.9,45.3,58.4s-29.4,26.1-42.9,17.1s-14.1-27.9-3.6-31.8c10.5-3.9,27.1,4.1,21.4,16
		c9.4-0.2,11.6-14,4.9-19.8c-6.7-5.8-18.8-9.4-32.3,0.3c-13.5,9.7-29.2,14-35.5-6.9c-10.1,8.9-17.9,2.9-17.9,2.9
		c2-12.2,0-28.1-16.1-40.6c11.5,21.2,16.6,39.5-1,61.8c-2.7-8.7-10-11.1-10-11.1c-13.6,1.5-25.2,0.3-28.2-15.8
		c-6.8,8.1-17.5,1.5-19.4-3c8-12.4,14.4-36.3-2.7-51.8c7.4,26.3,1.9,43.7-10.3,56.7c-5.7-13.5-22-20.2-26.9-22.5
		c-4.9-2.3-9.4-9.3-2.6-20.6c6.8-11.3,26.6-31.1,4.7-61.8c6.3,21.9,6.6,32.9-7.6,46.8c-8.1,7.9-16.3,3.3-22.8,15.1
		C81.5,60.9,75,51.1,84.3,35.7c-6.4,2.3-10,0.5-10,0.5s-3.3-12.9,7.7-20.3s19.3-16.1,22.4-24.2C83.9,7.9,74,5.2,65.9-1.6
		S57.6-28,69.4-35.2s26.3-0.3,25.9,9.1S84.9-13.8,79.3-15.7c4.4,5.7,19.2,4.1,24.9-5c5.6-9.1,9.1-19.3,10.8-32.3
		C116.6-66,125.7-77.4,135-79.7z"/>
	<path class="st36" d="M883.7,42c3.9-17.1-7.4-41-44.7-35.4c-37.4,5.6-45.5,39.8-38.1,60.5c7.4,20.8,25.3,25,39.3,22.4
		c-13.9-7.7-10.9-24.8-1.2-29.7s32.3,1.2,31,21.5s-28.9,28.1-47.1,22.8c-20.6-6-43.2-30-36.2-61.3S812.1,3.5,823-1.1
		c-33.3,3-46.9,4.7-74.9,38.8c-28,34.1-32.7,50-49.1,53.5s-19.4,9.8-19.4,9.8s-12.6-6.5-7.3-18.7c-11.7,7.5-18.8,5.3-28.5-1
		s-17.7-8.4-31.2-5c15.7-30.3,47-43.9,76.6-47.2C619.8,28.7,580.9,15.8,570.7-23c-10.2-38.8,26.8-55.1,41.8-51.6
		c15,3.5,23,18.9,16.2,34c-6.8,15.1-26.7,13.8-35.6,7.2c-1.4,17.4,10.3,41.7,70.1,51.4c-24.4-11.8-34.6-29.2-30.3-45.5
		c13.9,6.5,24.8,1.1,33.3-2.5c8.5-3.6,20.7,0.8,26.4,10.5C698.4-9.9,719-1.2,736.7-1c17.8,0.1,39.8-6.5,39.8-6.5
		s-52.3,13.2-51.3-34.3c9.2,3.4,32,4.1,52-0.8c20-4.9,69-10.5,98,15.6c29.1,26.1,33.1,55.7,27.5,69.5s-23,23.6-33.7,14.9
		c-10.7-8.7-7.4-19.1-2.1-22.2C872.2,32.1,881.3,33,883.7,42z"/>
	<path class="st36" d="M26.7,589.5c0.3-12.2,14.3-15.5,21-10.1c6.7,5.3,4.2,27.2-13.7,30.9C16.1,614,0.1,599.2-5.1,578.1
		s-4.3-42.7,1.4-66.7c5.6-23.9-5.4-33.2-16.4-42.5c-11-9.3-19.7-17.7-11.8-36.4c14.9,4.4,16.9-2.5,27.7,0.2
		c-2.6-18,18-41.9,36.2-52.3c3.6,26.8,16.3,32,20.7,41.4c4.4,9.5-7.8,19.7-7.8,19.7s5.7,1.6,9.9,8.9c-8.1,6.5-17.5,21.4-26.1,24
		c14.2,2.8,27.4-8.1,30.8-21.8c3.4-13.7-2.5-29.4,17-38.2c9.4,7.5,17.8,13,7.8,27.7c19.3-23,28.4-38.1,13.4-50.6
		c-7.7,13.1-21.6,15.2-30.9,3.5s1.5-30.7,15.3-33.6c13.8-2.9,34.3,4.5,41.5,21.7c7.2,17.2,0.9,34.8-11.2,46.1
		c20.7-12.9,25.7-25.3,26.2-45.9s5.3-21.7,8.3-24.8c10.6,0.2,18.3,7.9,18.3,7.9s4.2-4.6,4-8.5c15.3,0.2,23.1,13.2,41.8,2
		c9.4,24.2-15.3,58.8-33.2,64.7c4.1,9.8,17.6,1.1,25.8-7.3c8.2-8.4,28.7-15.4,40-1.5c11.3,14,18.5,22,25,23
		c-14.5,21-25.6,23.7-42,20.5s-26.3-7-35.7-4.8c29.3,4.7,41.8,16.4,59.8,17.1c11.1,0.4,28.7-1.3,34.4-4.2c5.9,7.9,2.7,16.9,2.7,16.9
		c17.6-1.1,24.5,5.6,27.7,24.3c3.2,18.8,16.3,26.4,27.2,27.1c-5.7,10.6-44.4,16.4-66.8-7.2c14.7,22.5,58.4,33.6,77.4,13.2
		c19-20.4,8.9-34.5,7.9-36.1c-1.7,12.4-19.6,18.3-28.4,6c-8.9-12.3-2.9-33.2,12-36.5c14.9-3.3,40.5,5.4,44.4,30.2
		c3.9,24.8-18,64.1-46.6,68.4c-28.6,4.3-53.3-8.1-87.5-46.7c-34.3-38.5-79-66.5-120.5-66s-57,10.8-57,10.8s27.5-4.2,42.1,19.6
		c-2,4.7-8.1,9.5-8.1,9.5c5.8,14.6,2,18.1-3.2,23.6c2.8,8,2.4,14.1,2.4,14.1s-13.3,7.3-22.9-3.8c-9.6-11.1-18.6-29.5-40.4-24.5
		c-21.9,5-36.4,29-36,52.3C12.2,586.2,22.6,589.7,26.7,589.5z"/>
	<path class="st36" d="M980.4,542.9c5.2-5.6,9.3-13.1,6.1-21.7c9.1,0.1,12.8-3.7,14.3-8.8c-12-7.4-21.9-17.9-19.9-32.7
		c2-14.8,7.1-21.5,12.4-28.6c-2.6,18.8,3.2,27.4,8.9,33.2c5.7,5.8,13.8,5.6,18.1,2.6c-5.2-6.1,1.1-19.6,7.4-27
		c6.3-7.4,3.5-28.2-5.3-38c4.3,2.8,8.1,0.1,8.1,0.1s-6.7-6.5-8.1-14.3c-1.5-7.9-2.3-36.9-9.5-55.2c-7.2-18.3-12-28.5-26.2-41.6
		c17.9,8.2,32,4.4,44.2-2c12.2-6.4,23-11.7,26.4-11.5c-10.1-8.7-15.6-23.5-17.7-28.6c-2.1-5.1-13.9-11.4-22.6-9
		c2.7-3.2,2.8-8.7,2.8-8.7s-5.8-7.7-20.9-5.5c7.7-4.2,18.4-2.8,25-17.3c-8.1-1.5-18.7-4.3-26.8,1.7c-8.1,6-13.5,14.4-22,14.1
		c8.1-5.6,19.1-13.1,17.3-23.1c-13.7,4.3-20.8,2.8-27.3,2c-6.4-0.9-13.3,7-15.7,13.7c-2.3,6.7-5.9,9.9-10.8,12.7
		c4.7-6.5,6.7-14.2,6.4-18.7c-8,4.5-16.3,4.6-23.9,5.1c-7.6,0.5-17.3,4.7-18.9,15.3c-1.5,10.6-5.7,15.1-13.4,24.5
		c-7.7,9.4-13.9,21.9-8.3,35.8c5.6,13.9,16.4,23.6,30,25c13.7,1.5,25.5-10.7,27.4-20.8c1.9-10.1-1.1-22.5-13.8-24.5
		c-12.6-1.9-18.8,6.2-20,10.5c-1.2,4.3,0.5,7.1,1.6,9c-8.4-3.3-9-23.7,6.5-33.1c15.5-9.4,46.4,7.4,50.5,30.9
		c4.2,23.5,0,45.2-18.9,53.9c-18.9,8.7-21.8,15.6-21.8,15.6l5,2.6c0,0-13.2,0.6-10.7,8.6c2.4,8-1.3,17.9-6.4,23.7
		c28.6,8,44.4-1.2,54.2-10.2c9.8-9,16.2-25.6,17.5-37.9c1,19.4-6,42.2-25.9,56.7c-20,14.5-45.8,8.3-47.9,8c-2.1-0.3-6.5,1.1-8.9,4.7
		c-6.4-3.4-11.1-2.6-20,9.3c-8.9,11.9-24,19.2-39.5,14.9c17.6,17.4,38.6,27.6,61,24.3c22.4-3.2,37.2-13.3,47.4-21.9
		c-10.7,15.8-42.5,35.2-72.3,29.8c-29.7-5.4-43.9-21.7-45.9-31.6c-1.9-9.9,0.1-16.7,4.4-20c3.4,6.8,14.6,10.8,24.7,2.8
		c10.1-8.1,3.7-23.9-6.5-27.7c-10.2-3.8-26.7-2.5-38.3,16.6s-4.4,38.4,10.2,54.2c13.3,14.5,49.8,23.9,79.1,15.5
		c-45.2,17.1-83.2-3.8-97.7-22.1c-14.4-18.3-15.9-53.6,9.3-70.6c-5.1-4.9-15-3.8-22.7-6c-7.7-2.2-14.9-15.1-8.3-25.9
		c6.5-10.8,17.8-9.1,20.7-6.3c-7.2,6.6-5.2,14,1.5,21.4c6.6,7.4,25.8,1.7,28.4-13c2.6-14.7-9.8-31-28.6-32.3s-44.2,5.2-59,31.9
		s-6.9,63.4-3.6,75c3.3,11.7,14.9,21.4,19.4,24.7c-12.8-0.9-19.5,3.6-23,6.1c8.4,8.4,9.9,22.7,25.7,25.4c-6.1,9-1.7,13.1-1.7,13.1
		s12.8,14.9,42.1,15.9c29.2,1,62.2-7,86.2-15.9c-20.5,11.1-32.4,11.6-36.5,16.3c-4.2,4.7-9.8,13.1-12.9,16.7
		c12.8,6.1,20.9,14.2,29.4,15.8c8.5,1.7,26-7.8,35.4-24.3c1.2,6.6,2.8,9.3,2.8,9.3s17.6-1.9,23.5-26.4c0.3,16.6,5.4,27.5,16.9,30.9
		c11.6,3.4,20.9,1.8,25.9,0C971.8,555.3,975.2,548.5,980.4,542.9z M973.2,281.2c-14.1-10.8-26.5-16.8-46.2-20.3
		c27.2-5.8,47.6-7.4,61.6,0.1c14,7.5,12.9,18.2,9.8,23.6C995.2,290,987.2,292,973.2,281.2z"/>
	<g>
		<g>
			<path class="st36" d="M1025.3,169.9c0,0-12.8,6.6-18.9-6.4c-6.1-12.9-1.1-36.9,10.6-80.3c11.7-43.4,9.8-71.9-0.6-104
				c-10.4-32.1-43-57.9-77.4-53.1c-34.4,4.8-41.2,42.9-33,60.9s33.6,25.8,42.6,30.4c9,4.6,14.8,11.5,10,16c-0.9-4-6.8-6.7-12.2-4.7
				c-5.4,2-9.3,9.5-0.5,17.9s27.1,1.3,31.2-11c4.1-12.3,0.1-25.5-11.4-34.3c4.2-0.1,12,0.2,14-9.8c-4,0.1-10.8-4.2-15.8-12.6
				c-5.1-8.4-14.8-7-27.6-6.3c-11.2,0.7-16.8-17.2-7.1-24.4c-1.7,9.9,5.7,21.8,18.5,16.3c-1.4-5.2,1.1-13.8,7.6-17.1s35.6-1.9,46,35
				s1.2,63.3-18.9,79.8c-20.2,16.5-48.8,20-61,17.7c-12.2-2.3-16.7-9.2-32-4.5c0,0,0.4,7.6,7.1,11.4c0,0-10.7-2.9-15.2,1.8
				c-4.5,4.7-7.8,11.3-18.7,16.9c4.4,1.9,10.6,5.8,17.8,11.9c7.2,6.1,11.6,6.7,27.8,3.3c-9.4,12.4-23,6.2-32.8,0.5
				c-9.8-5.8-21.5,4.6-21.5,4.6s-3.7,9.3,7.6,16.1c-21.4,6.1-26.4,21.6-25.3,32.7c1.2,11.1,3.8,25.4-2,31.2c0,0,9.8-1.1,17.1,1.7
				c7.3,2.9,14.3,3.4,27.7-5.2c-0.5,3.6-0.2,15.7,15.2,15.7c0.5-15.5,21.7-22.4,24.4-30.7c2.6-8.3-0.5-16.6,2.8-20.8
				c3.3-4.2,8.3,0.3,7.6,4.1c-0.7,3.9-6.5,12.3-7.5,25.5c-1,13.2,2.9,29.3,24.4,35.6c-2.9-13.9,6.9-14,11.5-15.8
				c4.6-1.8,7.6-5.1,4.3-15c4.7,6.6,15.7,1.5,19.1-4.8c0,0-6.9-6.1-10.5-11.4c-3.6-5.3-11.6-32.9-1.1-48.8
				c-4.8,28.4,11.7,47.2,27.2,51.7C1011.8,192.3,1030.2,183.1,1025.3,169.9z M891.7,163.8c-1.7,0.4-3.4-0.7-3.8-2.4s0.7-3.4,2.4-3.8
				s3.4,0.7,3.8,2.4C894.5,161.7,893.5,163.4,891.7,163.8z M903.8,155.7c-2.5,0.6-5-1-5.6-3.5c-0.6-2.5,1-5,3.5-5.6
				c2.5-0.6,5,1,5.6,3.5C907.9,152.7,906.3,155.2,903.8,155.7z M922.4,146.9c-4.4,1-8.8-1.8-9.8-6.2c-1-4.4,1.8-8.8,6.2-9.8
				c4.4-1,8.8,1.8,9.8,6.2C929.6,141.5,926.8,145.9,922.4,146.9z M979.5,107.8c-19.3,19-37.7,30.3-44.2,22
				c-6.5-8.3,5.9-18.3,23.4-27.6c17.5-9.3,45.9-21.5,58.3-78.5C1012.4,62.4,998.8,88.8,979.5,107.8z"/>
		</g>
	</g>
	<g>
		<g>
			<path class="st36" d="M486.5,10.9c-0.1-3.5-1.6-6.3-9-6.5c5.6-1.5,4.8-10.2,1.3-13.9c0,0-5.8,3.2-10.2,4.3S443.9-5.2,435.8-16
				c17.9,10,34.4,3.5,41.1-5.9c6.7-9.4,4.9-23.8-5.1-23.8c0,0,1.4,10.2-8.8,11.1s-24.9-8-51.2-26.3C385.5-79,366-84.5,342-85.2
				s-49,14.9-54,39.1c-5,24.2,18.9,37.9,32.9,36.6c14-1.2,25.3-16.3,30.6-21.3c5.2-4.9,11.2-7.1,13.1-2.8c-2.9-0.4-6.1,3-6,7
				s4.1,8.5,11.8,4.6c7.7-3.9,7.4-17.8,0.1-23.5c-7.3-5.7-17-6.2-25.7-0.5c0.9-2.9,3-8-3.2-11.7c-0.9,2.7-5.4,6.2-12.2,7.6
				s-8.2,8.3-10.8,17c-2.2,7.7-15.5,7.2-18-1.1c6.2,3.5,15.9,1.4,15.3-8.5c-3.9-0.3-8.9-4.1-9.6-9.1c-0.7-5.1,7.2-24.3,34.4-22.5
				s42.7,14.3,48.9,31.7c6.2,17.4,1.7,37.4-2.7,45c-4.4,7.6-10.2,8.9-10.6,20.4c0,0,5.2,1.6,9.3-2c0,0-4.5,6.5-2.4,10.6
				s5.7,7.9,6.9,16.6c2.3-2.5,6.4-5.7,12.2-9.1c5.8-3.4,7.2-6.2,8.8-17.8c6.1,9.3-1.3,16.9-7.5,22c-6.2,5.2-2.1,15.5-2.1,15.5
				s5.3,4.7,12.6-1.2c-1,15.8,8.1,22.8,15.9,24.7c7.7,1.9,17.9,3.5,20.4,8.8c0,0,1.6-6.8,5.2-11c3.7-4.2,5.7-8.7,3.2-19.8
				c2.3,1.2,10.5,3.9,14.1-6.4c-10.2-4-9.8-19.9-14.7-23.6c-4.9-3.7-11.2-3.6-13.2-6.8s2.1-5.5,4.6-4.1s6.7,7.3,15.3,11.1
				c8.6,3.8,20.3,5.1,29.7-7.9C484.4,21,486.7,14.4,486.5,10.9z M410.6-17.3c-2-13.9-3.4-35.9-38.7-57.8
				c24.9,12.3,39.2,27.7,47.4,45.2S430.6,2.6,423.5,5C416.3,7.4,412.6-3.3,410.6-17.3z M425.3,22.8c-3.2-0.4-5.5-3.3-5.1-6.5
				c0.4-3.2,3.3-5.5,6.5-5.1s5.5,3.3,5.1,6.5C431.4,20.9,428.5,23.2,425.3,22.8z M429.6,35.2c-1.8-0.2-3.1-1.9-2.9-3.7
				c0.2-1.8,1.9-3.1,3.7-2.9c1.8,0.2,3.1,1.9,2.9,3.7C433.1,34.1,431.4,35.4,429.6,35.2z M435.8,42.3c-0.2,1.2-1.3,2.1-2.5,2
				c-1.2-0.2-2.1-1.3-2-2.5s1.3-2.1,2.5-2C435.1,39.9,436,41,435.8,42.3z"/>
		</g>
	</g>
	<path class="st36" d="M113.6,533.2c10-23.1,11.5-42.3-8.9-61.9s-52.3-20.9-78.5-46.4s-37-51.8-38.8-86.8s11-40.1,6.9-58.4
		c-4-18.3-15.8-15.5-20.2-11.6c5.9,2.3,11.1,8.5,7.3,16.6c-3.8,8-17.1,9.3-23.1,0s-5.1-22.9,6.4-29.1s21.4-4.6,25.9-2.2
		c1.2-6.9,6.5-10.5,6.5-10.5s12.7,5.5,18.1,15.4s-5.9,38.1-7.7,54.9c10.3-24.9,23.8-43.1,37.7-57.9c13.9-14.7,17.5-26.4,8.2-31.9
		c4.2-9.5,12.4-6.2,15.3-0.6s-1.2,12.8-2.3,18.4c6.7-11,7.3-22,0.9-26.8s-11.4-10.4-7.6-18.6c3.9-8.2,1.7-13.3,1.7-13.3
		c4-1.7,9.5-0.7,12.1,0.9c-9.7-9.4-18.4-9.7-24.4-7.1s-5,10.4-5,10.4c7.1-0.5,8,4.5,8.3,8.2s-3.4,13.7-16.4,12
		c-13-1.7-17.2-15.4-13.8-24.9s17-21.3,39.2-16.5s29.8,26,29.8,43.1s-13.9,32.6-32.5,47.6c33.9-12,61.4-10,83.4,17s16.3,55.4,1.3,79
		c-14.9,23.6-43.2,23-57.6,11.1s-20-26.3-12.6-36.9c7.5-10.5,18.1-9.1,21.8-3.6s-0.9,13.8,4.9,20.9c5.8,7.1,20.6,14.4,30.4,1.5
		c-9.7,3.6-20.7,1.7-24.5-4.8c-5.3-9.1-4.5-16.1,4-19.4c3.1,5.6,13.5,11,23.3,4.1c7.9-5.5,12.6-23.3,6.8-37.7
		c-5.9-14.4-17.8-21.4-17.8-21.4c6.5,12,8.5,20.1,3.5,29.4c-5.7-4.1-13.3-5.7-15.7-11.4c2.1,15.1-10.9,24.3-11.9,28.2
		c-14-9.6-17.6-24.2-18.5-32.1c-2.5,6.2-8.2,10.7-8.2,10.7s0.2-13.3-8.2-17.4s-31.7-1-43.5,28.3c15.2-18.6,26.7-22.6,39-15.1
		c12.3,7.5,9.3,22.7,0.3,28.5s-17.9-0.7-18.7-5.3c-0.9-4.6,5-11.7,5-11.7c-6.1-3.3-12.7,1.9-13.5,6.7c-0.8,4.7,1,11.1,7,15.1
		s8.6,6.6,10.4,10.6c-10.1,6.9-34.5,20.6-34.6,42s6,25.5,6,25.5c-3.8-14.8-2.5-29.8,6.4-40.6c8.9-10.7,23-11.2,32.6-2
		c9.7,9.2,5.8,22.5-4,27c-9.9,4.4-15.9-3.7-16.2-9c-0.3-5.3,4.8-8.7,4.8-8.7c-7.1-4.2-18.7,3-20.4,15.7
		c-1.7,12.7,4.1,29.4,14.3,39.6c10.2,10.3,41.1,20.4,53.6,32.7c-4.1-9.4-31.2-21.4-38.2-26.4c-7-5-15.5-21.4-8.9-31
		c6.7-9.6,15.2-13.6,28.2-7.9c13,5.8,6.3,20.3,2.3,22.3c-4,1.9-12.3,0-15.6-3.9c0.2,8.4,9.9,15.5,19,20.7s29.2,21,39.6,41.2
		s10.8,35,7.4,47.1C121.9,527.4,113.6,533.2,113.6,533.2z"/>
	<g>
		<path class="st39" d="M956.7,572.6c17.4-23.5,20.6-38.6,10.5-49.1c-5.2-5.4-13-4.9-15.7-7.2c-2.7-2.4-0.1-7.9-8-13.6
			s-14.1,0.1-15.8,4.2c-1.7,4.2,0.5,7.8,1.4,7.8s5.8-2.3,7.7,2.2c2,4.5-4.5,12.4-10.2,9.3c-8.9-4.8-12.5-17.7-0.4-28.6
			c12.1-10.8,35.2-5.4,44.2,9.5s12.4,30.7,3.5,46.2c14.2-16.7,6.1-46.8-8.6-58.3c-14.8-11.5-36.1-9.6-48.7-0.3s-18.8,11.1-22.6,10.2
			s-6.9-0.6-9,0c-0.1-8.7,3.6-17.5,15-20.7c-19.7,1.1-39.1,9-36,20.3c3-4,9.5-7.2,13-1.7c3.4,5.5-0.2,12.2-6.7,14.2
			s-15.6-2.4-17-10.8s6-22.3,23.1-24.6c-18.6,0.5-30.9,10.4-35.4,22.2c-2.7,0-8-3.5-8.1-8.6c-14,4.4-18.9-2.5-22.8-9.1
			c-3.8-6.6-9-9.9-11-10.3c8.5-2.9,13.9-13.4,23.9-10.6c-2.3-2.8-3.2-6-3.2-6s7.4-1.9,13,4.6s11.3,4.1,11.3,4.1s-2.1-4.5-16-13.7
			c-13.9-9.3-20.1-29.7-17-43.6c3.2-13.8,19.3-27,36.1-21.2c16.8,5.8,14.6,21.1,9.4,24.8c-5.3,3.7-15,1.3-16.9-5.4
			c-1.9-6.8,5.3-10.4,5.3-10.4s-10-5.6-16.8,3.7s-1.6,22.2,4.4,24.3c6.1,2.2,14.1,1.8,15.8,5.2c1.7,3.5-1.3,10.4-0.1,15.2
			c1.2,4.8,4,7.3,6.2,9c-5.1-11.3-0.3-15.2,1.2-18.4c8.8,3.3,9.4,12.9,11.5,18c2.1,5.1,6.6,10.6,12.9,15
			c-7.2-10.6-15.5-27.1-3.6-36.4c4.5,6.1,10.5,8,13.4,9s5.6,5.1,4.5,10.2c3.2-1.1,4.5,1.3,4.7,7.3c0.2,6,3,17.5,16.1,17.2
			c-6.9-11.1-4.8-14.6-3.6-18.1c1.3-3.5,1.4-5.6,0-8.7c9.9,2,15.7,12.3,19.2,17c3.5,4.7,11,10.3,16.5,12
			c-11.6-8.2-19.6-17.4-23.8-35.8c-4.2-18.4,5.4-30.9,17.1-33.4c11.7-2.5,15.2,8.9,11.3,13.5c-3.8,4.7-14.1,1.4-14.3-5.3
			c-7.6,4.2-13,15.3-9.1,28.6c3.9,13.3,10.2,22,21.7,29.5c-8.6-19.9-10.2-38.2,10.6-52.5c2.8,2.5,3,9.7,8.2,11.8
			c5.2,2.1,13.1,10.1,4.3,19.2c6-4.3,10.4-4.3,13.8-0.4c-4.8,2.8-2.9,7-2.2,10.5c0.7,3.5-0.7,6.9-2.9,10.2s-4.5,4.8-3.5,9.6
			c2.2-5.7,2.9-8.9,9.6-14.9c6.7-6,11.8-2.1,13.2-1.1c-1.9,2.5-2.5,4.4-1.9,6.6c3-4.8,8.5-5.7,13.2-3.5c4.6,2.2,7.4,3.3,7.4,3.3
			s-3.2,5-2.6,9.4c0.6,4.4-3.6,7.9-7.2,9.5c2.9,3,2.6,6.8,2.6,6.8s-6.7,0-10.7,4.2s-6.7,19.2-10.4,31.3S977.5,563.4,956.7,572.6z"/>
		<path class="st39" d="M219.2,553.3c-5.2-11.7,1-24,10.2-28c9.2-4.1,21.3,3.5,20.3,11s-5.1,7.9-6.4,8.1c3.6-6.3,2.3-11.6-5.2-12.7
			s-11.3,9.3-8.1,15.4c3.2,6.1,12.5,11.5,20.3,6.9c7.8-4.6,11.7-13.7,8.9-19.9c3.4,2.6,2.6,9.2,7.6,11.4c8.8,3.8,12.8-2.4,17.3-3.6
			c-4.4-3.8-4.4-8.9-6.2-16.1c-1.8-7.2-10.9-16.9-21.5-16.6c-10.7,0.3-14.3,2.4-14.3,2.4c3.1-4,11.6-8,21.8-4.4
			c10.2,3.6,12.9,10.8,20,14.1c7.1,3.4,17.8,2.5,24.3-3.5c-4.9-2.3-8.4-6.2-10-9.7c-1.7-3.6-6.6-4.7-6.6-4.7
			c1.3-3.2,1.5-4.2,1.5-4.2s-7.5-5-16.2-4.3c10.3-1.7,26.8,1.9,44.8,0.2c18-1.6,31.7-11.7,29.9-22.5c-1.8-10.8-10.8-16.6-18.6-14.1
			c-7.8,2.6-10.6,11.7-6,15c4.6,3.3,13.8,1.6,12.6-5c4.6,1.3,3.8,8.4-0.3,10.3s-10.4,2.1-15.7-4.4c-5.3-6.5-12.4-10.7-18.2-1.4
			c-3.8-5.7-8.4-3.8-8.4-3.8c-0.7,6.2-3.7,13.7-13.3,17.7c8.5-8.8,13.4-17.1,7.8-30.3c-2.5,3.9-6.4,4.1-6.4,4.1
			c-6.4-2.6-12.3-3.5-15.9,3.9c-2.2-4.9-8.3-3.1-9.9-1.1c2.3,7.1,2.2,19.6-8.3,24.9c7.1-11.8,6.8-21.1,2.6-29.1
			c-4.6,5.8-13.4,6.9-16.1,7.4c-2.7,0.5-5.8,3.3-4,9.7c1.8,6.4,8.8,18.7-6,30.8c6-9.8,7.6-15.2,2.5-23.9c-2.9-5-7.5-3.8-9.1-10.4
			c-8.9,4.6-13.4,8.5-10.9,17.2c-2.8-2-4.8-1.6-4.8-1.6s-3.3,5.9,1.1,10.9c4.4,5.1,7.3,10.4,7.7,14.8c-7.9-10.7-13.1-10.7-18-8.5
			c-4.9,2.2-7.6,11.8-2.7,16.9c4.8,5.1,12.8,3.7,13.9-1c1.1-4.7-3.4-7.4-6.4-7.2c2.9-2.2,9.9,0.6,11.5,5.7
			c1.5,5.2,1.9,10.6,0.9,17.2C212,544.1,214.9,550.9,219.2,553.3z"/>
		<path class="st39" d="M862.9,0.6c-1.1-9.6-11.3-20.1-29.8-10.4s-16.6,29-8.9,38.5s17.8,8.5,24.6,4.6c-8.7-1.5-10.2-11-6-15.3
			c4.2-4.3,17.1-5.2,20.1,5.6c3,10.8-10,19.9-20.4,20.4c-11.8,0.6-28-7.8-30-25.4s6.1-25.1,11-29.5c-16.9,7.6-23.6,11-32.1,33.8
			s-8,32-15.9,36.8c-7.9,4.8-8.4,8.7-8.4,8.7s-7.8-1.1-7.2-8.4c-4.7,6-8.9,6.2-15.1,4.7c-6.2-1.5-10.7-1.2-17.2,3
			c2.7-18.7,16.6-31.5,31.5-38.5c-36.3,12.3-59,12.5-71.3-5.9s4-33.6,12.5-34.5c8.5-0.9,15.5,5.7,14.6,14.8
			c-0.8,9.1-11.4,12.1-17.3,10.2c2.4,9.3,12.9,19.9,45.9,14.1c-14.9-1.8-23.3-9-24-18.3c8.4,0.9,13.2-3.9,16.9-7.4
			c3.8-3.4,10.9-3.3,15.7,0.7c4.8,4,17.1,4.8,26.4,1.7C787.7,1.7,798-5.8,798-5.8s-24.9,16.4-33-8.6c5.4,0.1,17.4-3.6,27-9.8
			c9.6-6.2,34.1-18,54-9.6c19.9,8.4,27.4,23.1,26.9,31.3c-0.4,8.3-7.7,16.5-14.9,13.9c-7.1-2.6-7.3-8.7-5.1-11.2
			C855.1-2.4,860.1-3.6,862.9,0.6z"/>
		<path class="st39" d="M235.4-63.6c-3,5.4,2.4,10.5,6.7,9.8c4.3-0.6,8.8-10.9,1.9-17.1c-6.9-6.2-17.8-3.8-25.4,4.2
			c-7.6,7.9-12.8,17.7-16.4,29.6c-3.6,11.9-10.8,13.2-18.1,14.5c-7.2,1.3-13.2,2.8-14.5,13c7.7,1.9,6.8,5.4,12.2,7
			c-5.7,7.3-2.8,23,2.6,32.2c8.4-10.8,15.3-9.9,19.7-12.9c4.3-3,1.6-10.6,1.6-10.6s2.9,0.8,6.6-1.4c-1.9-4.9-2.3-13.9-5.4-17.2
			c7,2.4,10,10.5,8,17.4c-2,6.9-8.6,12.3-2.3,21.1c6.1-0.9,11.1-1.2,10.5-10.2c2.6,15,2.8,24-7,25.6c0-7.7-5.6-12.2-12.7-9.4
			s-7.1,13.9-1.8,18.7s16.2,6.8,23.8,1.1s9.3-15.1,6.9-23.1c5.8,10.9,4.8,17.7-0.2,26.8s-3.2,10.9-2.7,13c4.7,2.6,10.1,1.2,10.1,1.2
			s0.7,3.1-0.4,4.8c6.8,3.8,13.5,0.1,18.9,9.8c10.3-8.2,8.3-29.7,1.9-36.9c4.3-3.2,8,4,9.5,9.8c1.5,5.8,8.7,14.1,17.2,10.8
			c8.5-3.3,13.8-4.9,16.9-3.7c-1-13-5.2-16.9-13.2-19.7c-8-2.8-13.3-3.6-16.9-7c14.1,5.4,22.6,3.4,30.7,7.8
			c5,2.7,12.3,7.9,14.1,10.6c4.6-2,5.5-6.7,5.5-6.7c7.4,5,12.2,3.8,18.4-3.6c6.2-7.4,13.9-7.5,18.9-5c0.2-6.1-15.4-18.5-31.2-13.9
			c12.2-6.1,34.2,0.1,37.4,14s-4.9,17.4-5.8,17.9c2.4-5.9-3.9-13-11-9.9c-7,3.1-9.7,13.8-4.1,19.1c5.7,5.3,19.2,8,27.2-1.9
			s8.4-32.8-3-42c-11.5-9.2-25.5-10-50.4-1.8c-24.9,8.2-51.7,9.1-69.8-1.7S227.9,1,227.9,1s11,8.9,23.5,2.1c0.3-2.5-1.1-6.2-1.1-6.2
			c6.3-4.9,5.5-7.4,4.6-11.2c3.3-2.8,4.7-5.6,4.7-5.6s-4-6.6-11-4.2c-7,2.4-15.7,8.2-24,0.5s-8.6-22-2.5-32.1S233.7-64.8,235.4-63.6
			z"/>
		<path class="st39" d="M549.6,596.3c2.1-5.8-3.9-10-8-8.7c-4.2,1.3-7.1,12.1,0.7,17.2c7.8,5.1,18.1,1.1,24.5-7.9
			c6.4-9,10-19.4,11.8-31.8c1.8-12.3,8.7-14.7,15.7-17s12.6-4.7,12.4-15c-7.9-0.7-7.5-4.3-13.1-5.1c4.6-8-0.7-23.2-7.4-31.5
			c-6.7,12-13.7,12.1-17.5,15.7c-3.8,3.7,0,10.8,0,10.8s-3-0.3-6.3,2.3c2.6,4.6,4.3,13.4,7.9,16.2c-7.2-1.3-11.4-8.9-10.5-16
			s6.7-13.4-0.9-21.2c-5.9,1.8-10.8,2.8-8.9,11.6c-4.8-14.5-6.3-23.3,3.1-26.4c1.2,7.6,7.4,11.2,14,7.4c6.6-3.8,5-14.8-1-18.7
			s-17-4.3-23.7,2.5c-6.6,6.8-6.9,16.3-3.3,23.9c-7.4-9.9-7.4-16.8-3.8-26.6c3.6-9.8,1.5-11.2,0.7-13.3c-5-1.9-10.1,0.3-10.1,0.3
			s-1.1-3-0.3-4.8c-7.3-2.7-13.4,1.9-20.1-6.9c-8.9,9.7-3.8,30.6,3.6,36.8c-3.8,3.9-8.5-2.8-10.8-8.3c-2.3-5.5-10.7-12.7-18.6-8.2
			c-7.9,4.5-12.9,6.9-16.1,6.2c2.9,12.7,7.7,16,16,17.5s13.7,1.6,17.8,4.4c-14.8-3.2-22.8,0-31.5-3.1c-5.3-1.9-13.3-6-15.5-8.4
			c-4.3,2.6-4.4,7.5-4.4,7.5c-8.1-3.8-12.6-1.9-17.6,6.3c-5,8.3-12.6,9.5-17.9,7.8c0.7,6.1,17.9,16,32.9,9.1
			c-11.1,7.9-33.9,5-39-8.2c-5.2-13.2,2.3-18,3-18.5c-1.5,6.2,5.8,12.3,12.3,8.1c6.5-4.2,7.6-15.1,1.2-19.5c-6.4-4.4-20.2-5-26.6,6
			s-3.5,33.7,9.3,41s26.7,6.1,50.1-5.7c23.4-11.8,49.7-16.7,69.3-8.7c19.5,8,24.9,15.8,24.9,15.8s-12.2-7.1-23.6,1.4
			c0.1,2.6,2,6,2,6c-5.5,5.8-4.3,8.2-2.9,11.8c-2.8,3.2-3.8,6.2-3.8,6.2s4.9,5.9,11.5,2.5c6.6-3.5,14.3-10.5,23.7-4.1
			c9.4,6.4,11.8,20.5,7.2,31.4C557.1,597.4,551.6,597.2,549.6,596.3z"/>
		<path class="st39" d="M1047.4,219.7c-5.9-1.9-9.8,4.3-8.4,8.5c1.5,4.1,12.4,6.5,17.2-1.5c4.7-8,0.3-18.2-9-24.2
			c-9.3-6-19.9-9.2-32.4-10.4s-15.1-8.1-17.8-15c-2.6-6.9-5.3-12.5-15.6-11.8c-0.3,7.9-4,7.7-4.5,13.4c-8.3-4.2-23.2,1.7-31.2,8.8
			c12.3,6.2,12.7,13.2,16.5,16.9s10.8-0.5,10.8-0.5s-0.2,3,2.6,6.2c4.5-2.9,13.2-4.9,15.9-8.6c-1,7.3-8.4,11.8-15.6,11.2
			c-7.2-0.6-13.8-6.1-21.3,1.9c2.1,5.8,3.3,10.7,12,8.4c-14.3,5.5-23.1,7.4-26.6-1.9c7.6-1.5,10.9-7.9,6.8-14.3
			c-4.1-6.5-15-4.4-18.8,1.8c-3.7,6.2-3.6,17.3,3.5,23.6s16.6,6.2,24.1,2.3c-9.6,7.9-16.5,8.2-26.5,5c-10-3.2-11.3-1-13.3-0.1
			c-1.7,5.1,0.8,10.2,0.8,10.2s-2.9,1.3-4.8,0.5c-2.4,7.4,2.5,13.3-6,20.5c10.1,8.5,30.9,2.4,36.7-5.2c4,3.6-2.4,8.7-7.8,11.2
			c-5.4,2.6-12.2,11.3-7.4,19.1c4.9,7.8,7.5,12.6,6.9,15.9c12.6-3.5,15.7-8.4,16.9-16.9c1.2-8.4,1-13.8,3.6-18
			c-2.6,14.9,1,22.9-1.7,31.7c-1.7,5.4-5.4,13.6-7.7,15.9c2.8,4.2,7.7,4.1,7.7,4.1c-3.5,8.3-1.4,12.7,7.1,17.4
			c8.5,4.7,10,12.2,8.6,17.6c6.1-1,15.3-18.7,7.6-33.4c8.4,10.8,6.5,33.7-6.5,39.5s-18.1-1.5-18.7-2.2c6.2,1.3,12.1-6.4,7.6-12.7
			c-4.5-6.3-15.5-6.9-19.6-0.3s-4.1,20.4,7.2,26.4c11.3,6,33.9,2,40.8-11.1s4.9-27-7.9-50s-18.9-49.1-11.8-69.1
			c7.2-19.9,14.7-25.7,14.7-25.7s-6.6,12.6,2.5,23.6c2.6-0.2,5.9-2.3,5.9-2.3c6.1,5.2,8.4,4,11.9,2.4c3.4,2.7,6.4,3.5,6.4,3.5
			s5.7-5.2,2-11.7s-11.1-13.9-5.1-23.6c6-9.7,20-12.7,31.2-8.6C1048.2,212.2,1048.2,217.8,1047.4,219.7z"/>
		<path class="st39" d="M872.2,48.4c0.2,2.7,1.6,7.4,5.7,12c4.1,4.6,10.2,4.6,18,1.1c-10.1,8.1-7.1,16.6-7.1,16.6s1.6,0.2,4.9-0.7
			c-5.6,7.9-6.2,18.1-3.6,21.7c2.6,3.6,8.1,5.5,13.7,10.1c1-2.3,3.7-6.7,4.9-9.6c1.3-3-1-8.6-0.4-20.5c1.1,13.1,4.6,30.1,11.4,43.4
			s16.5,16,16.5,16s2.8,1.2,5.7-3.6c4.7,6.7,11.7,4.3,17.4,6.4c0.4-2.2,1-6.2-2.2-12c2.5,1.4,9.5,4.6,15.6,3.6s24.8-5.4,34-18
			c9.2-12.7,6.6-25.9,1.9-34.3s-15-10.6-21.2-6.2c-6.3,4.4-4.7,14.5,0.2,16c4.9,1.5,8.8,0.8,10.3-4c1.9,0.8,5.2,5.6,1.6,11
			s-11.1,4.9-13.8,1.8c-2.7-3.1-4.3-7.9-7.7-9.2c-2.4,15.3-19.1,22.4-30.7,19.7c-11.6-2.7-29.6-15.8-31.5-40.4
			c2.5,15.4,14.8,30.2,24.4,33.3c10.5,3.3,21,2.4,27.3-7.1c6.3-9.5,3.3-17.5-0.7-21.4c-4-3.9-12.7-3.4-14.3,3
			c-1.5,6.4,2.8,10.7,6.7,10.8c-0.6,2.7-3.3,5.2-8.3,6.4c-5,1.3-15.6-1.8-24.6-14.4c-9-12.6-6.9-31.6-2-40
			c-1.8,6.6-3.2,15.7,0.2,26.7c3.4,11.1,12.7,18.6,24.6,22.9c-5.3-6.2-5.3-14.8-1.7-21.5c3.6-6.7,2.9-9.1,0-11.3
			c1.2-1.9,0.8-4.2,0.2-5.2c-0.6-0.9-9.1-11.5-6.8-23.9c2.4-12.4,11.4-20.6,20.6-24.4c-5.4,3.3-11.7,9.9-13.7,16.4
			c-2.1,6.5-2.9,15.8,7.1,27.3c1.6-3.7,5.3-7.5,9.6-8.1c4.2-0.6,1.6-6.9,1.6-6.9l2.3,1.7c0,0,2.6-2.9,2.5-13.5
			c-0.1-10.7,9-17.3,20.8-20.5s26.3,7.4,25.3,16.7s-10.6,13.4-13.9,10.2c1.1,0.1,2.8,0.3,4.5-1.2c1.7-1.5,4.2-6.1,0.5-11.6
			s-10.1-4.1-14.3-1c-4.3,3.1-7.3,11.2-3.6,17.2c3.7,6,10.5,8.9,18.1,8.5c7.6-0.4,12.1-6,14.8-11.7c2.7-5.6,3.9-8.5,8.4-11.6
			c4.6-3,4.4-8.4,3-12.1c-1.4-3.6-3.2-7.5-2.8-12.2c-2.1,0.8-5.3,3.5-7.2,7.1c0.2-2.8,0.9-5.2,3.5-7.7c2.6-2.5,4.7-7.5,2.9-10.3
			c-1.8-2.8-4-5.8-5-13.1c-5,1.3-6.1,8.1-6.9,13c-2-3.9,0.7-8.2,1.7-13.3c1-5.1-2.6-9.4-5.1-12.8c-5.3,6.2-2.3,10.9-2.6,15.4
			c-2.3-7.5-7.1-8.5-7.1-8.5s-2.5,1.3-3.4,3.2c-0.8-4.6-6.3-8.7-9.1-8.5s-10.9,0.8-17.1-2c0.8,1.5,0.8,7.7,0.5,14.7
			c-0.3,7.1,1,14.4,8.7,20.9c-9.2-3.7-14.9-3.7-25-3.1c-10.1,0.7-23.7,6.6-27.6,7.7c-4,1-8.4-0.6-8.4-0.6s-0.4,2.3,1.8,3.7
			c-6.4-2-16.7,1.3-18.7,5.8c-2.1,4.5-6.9,10.4-10.9,9.3c-0.5,2.6,1.2,6.5,5.1,7.8c3.9,1.4,9.2,2.2,17.3-3.1c-2.2,4-4.1,7.8-10.5,12
			c-6.4,4.2-13.4,1.9-19.5-2.1c-2,1.8-3,4.3-0.9,8.5c-4.7,0.4-7.2,4-8.7,7.6C878,46.3,875.6,49.4,872.2,48.4z M995.2-21.9
			c1.8-2.6,6.5-5.4,13.1-0.6c6.5,4.8,10.2,14.6,13.5,28.5c-5.9-8.3-11.4-12.8-19.5-17C994.2-15.2,993.4-19.3,995.2-21.9z"/>
		<path class="st39" d="M88.7,227c-2-3.2-4.9-6.2-9.4-5.9c1.3-4.3,0-6.6-2.2-7.9c-5.1,4.7-11.4,7.9-18.1,5c-6.7-3-9.2-6.3-11.8-9.7
			c8.5,3.8,13.4,2.2,16.9,0.3c3.5-1.9,4.5-5.8,3.7-8.2c-3.6,1.6-9.1-3.2-11.7-7.2c-2.6-4-12.9-5.5-18.7-2.7c1.9-1.7,1.2-3.8,1.2-3.8
			s-4,2.3-7.9,1.9c-3.9-0.4-17.7-4-27.4-3c-9.6,0.9-15.1,1.8-23.2,6.7c6.3-7.4,6.4-14.5,5.1-21.2c-1.4-6.6-2.4-12.5-1.8-14
			c-5.5,3.6-13.2,4.2-15.9,4.5s-7.3,5-7.3,9.5c-1.2-1.7-3.7-2.5-3.7-2.5s-4.4,1.7-5.4,9.1c-0.9-4.2,1.2-9.1-4.8-14.2
			c-1.8,3.6-4.6,8.3-2.8,12.9c1.7,4.6,5,8.3,3.7,12.3c-1.5-4.6-3.6-10.8-8.5-11.3c0.2,7.1-1.5,10.2-2.8,13.1
			c-1.3,2.9,1.5,7.3,4.4,9.3c2.9,2,3.9,4.2,4.5,6.8c-2.4-3.1-5.8-5.1-7.9-5.6c1.1,4.4,0,8.3-0.8,12c-0.8,3.7-0.1,8.8,4.7,11
			c4.8,2.2,6.4,4.8,9.8,9.7c3.4,4.9,8.5,9.5,15.8,8.8c7.3-0.7,13.4-4.5,15.9-10.8s-1.6-13.5-6.1-15.8c-4.5-2.3-10.8-2.5-13.4,3.2
			c-2.6,5.7,0.4,9.7,2.2,10.9c1.9,1.2,3.4,0.7,4.5,0.5c-2.7,3.5-12.4,1-14.7-7.6c-2.3-8.6,9.8-20.9,21.5-19.7
			c11.7,1.2,21.3,6.1,22.9,16.3c1.5,10.1,4.4,12.4,4.4,12.4l1.9-2c0,0-1.5,6.3,2.6,6.2c4.1-0.1,8.3,3,10.3,6.3
			c7.7-12.4,5.5-21.1,2.6-27c-2.9-5.8-9.9-11.1-15.5-13.4c9.3,2.2,19.1,8.6,23.3,20c4.1,11.4-2.3,22.7-2.7,23.7
			c-0.4,1-0.4,3.2,1,4.9c-2.5,2.5-2.7,4.9,1.7,10.7c4.4,5.8,5.8,14,1.7,20.7c10.6-5.9,18.3-14.5,19.8-25.5c1.5-11-1.2-19.4-3.9-25.4
			c6,7.2,10.8,24.9,4.2,38.2c-6.6,13.3-16.2,17.8-21.1,17.4c-4.9-0.4-7.9-2.3-8.9-4.8c3.7-0.7,7.1-5.4,4.7-11.3
			c-2.4-5.9-10.8-5-14-0.7c-3.2,4.3-4.8,12.3,2.6,20.3c7.4,8.1,17.5,7.3,27,2.6c8.7-4.3,18-20.3,18.1-35.2
			c1.9,23.7-13.1,38.8-23.7,43.1c-10.6,4.3-27.5,0.2-32.1-14c-3,1.7-3.8,6.6-5.9,9.9c-2.1,3.3-9.1,5-13.4,0.4
			c-4.2-4.6-1.9-9.6-0.2-10.6c2.1,4.3,5.9,4.3,10.3,2.2c4.4-2.1,4.3-11.9-2.3-15.2c-6.6-3.2-16,0.4-19.2,9.1s-3.6,21.6,7,32.2
			s29,11.9,35,11.9s12.1-4.1,14.3-5.8c-2.2,5.9-1,9.7-0.2,11.7c5.1-2.8,12.1-1.6,15.5-8.7c3.4,4.1,5.9,2.6,5.9,2.6s8.8-4,13.2-17.7
			s5.2-30.3,4.2-42.9c2.4,11.2,1.1,16.9,2.8,19.5c1.7,2.6,4.9,6.4,6.1,8.4c4.6-5.2,9.5-7.9,11.5-11.7c2-3.8-0.2-13.4-6.7-20
			c3.3,0.3,4.8-0.1,4.8-0.1s1.5-8.6-9.3-14.7c7.9,2.1,13.7,1.2,16.9-3.8c3.2-5,3.7-9.6,3.5-12.2C93.5,232.7,90.7,230.2,88.7,227z
			 M-35.8,194.8c-7,5.2-11.5,10.3-15.9,19.1c1-13.6,3-23.5,8.4-29.1c5.4-5.6,10.3-3.6,12.5-1.4C-28.7,185.6-28.8,189.6-35.8,194.8z"
			/>
		<g>
			<g>
				<path class="st39" d="M147.2,59.6c-3-5.8-10.3-11.7-22.7-7.8c3.4-6.9-1.4-10.2-1.4-10.2s-9-1.3-11.9,4.6s-7.5,13.3-16.1,10.2
					c8.9-3.5,10.9-5.2,12.4-10.5c1.6-5.2,3.3-9.1,4.8-11.5c-7.1,0.7-10.8-1.4-14.5-2.3c-3.7-0.9-8,4-8,4c2-4-0.2-7.8-0.2-7.8
					c-9,2.6-8.9,7.4-14.1,12.4c-5.2,5-20.2,12.4-35.2,10.8C25.3,50,12.4,40.1,5.7,18.8c-6.7-21.2,7-31.2,11.2-31.7s8.1,2.9,9.1,5.9
					c8-1.4,7.8-9.5,3.8-13.8c7.1,0.4,10,10.9,4.3,14.1C27.7-2.9,22.5-0.5,22.7,5.2c0.2,5.7-1.7,10-3.7,11.2c4.2,4.2,7.8,1.6,9.9,0.3
					c-2.8,8-0.5,15.6,5.4,20.3c5.9,4.7,17.1,2.3,18.7-4.6c1.6-6.9-2.7-9.3-5.9-8.5s-5.3,3.9-4.4,6.2c-3.8-0.7-3.2-5.9-0.3-11
					s12.7-17,11-28.4c-1.7-11.4-17.2-27.7-35.4-19.1C-0.3-19.8-7.9,3.1-2.7,22s13.3,33.3,32.9,50.7s29.6,27.4,30.7,35.6
					c1.2,8.2-7.2,9.1-7.2,9.1c1.9,8,13.7,6.6,19.9-0.6s8.1-21.5-3.2-33.8c10.1,4.4,15,20.3,15,24.1s-1.5,8.9-1.5,8.9
					c3.6,2,10.6,1,10.8-3.7c1.6,5.8,4.1,6.5,6.9,5.9c2.8-0.6,7.6-3.7,10.7,4c8.5-9.9,5.2-19,0.5-25.1s-10.2-8.4-11.8-10
					c-1.6-1.7-0.6-5.4,2.4-4.4c2.9,1,4,6,8,9.2s16.4-0.2,21.6,7.1c7.5-4.9,3.8-10.9,2.4-12.5c9.3-0.1,12.5-2.6,15.1-6.3
					c2.6-3.7,7.7-6.3,7.7-6.3C153.4,73.1,150.1,65.3,147.2,59.6z M84.6,69.3c-0.5,6.1-13.1,6.5-28.5,3.4s-30.4-11.5-45-28.9
					C35.3,67.5,53,64.4,64.5,63.3C75.9,62.3,85.2,63.2,84.6,69.3z M96.4,73.5c-2.5,0.9-5.2-0.3-6.1-2.8c-0.9-2.5,0.3-5.2,2.8-6.1
					c2.5-0.9,5.2,0.3,6.1,2.8C100.1,69.8,98.8,72.6,96.4,73.5z M108.2,71.9c-1.4,0.5-3-0.2-3.5-1.6c-0.5-1.4,0.2-3,1.6-3.5
					c1.4-0.5,3,0.2,3.5,1.6C110.4,69.8,109.6,71.3,108.2,71.9z M116.7,71.9c-1,0.4-2-0.1-2.4-1.1c-0.4-1,0.1-2,1.1-2.4
					c1-0.4,2,0.1,2.4,1.1S117.6,71.6,116.7,71.9z"/>
			</g>
		</g>
		<g>
			<g>
				<path class="st39" d="M757.6,491.2c-9.7,2.8-15.6,15-18.6,19.2c-3,4.2-6.9,6.6-8.8,3.8c2.1-0.2,3.9-2.9,3.3-5.8
					c-0.6-2.9-4.1-5.4-9-1.6c-4.9,3.8-2.7,13.5,3.2,16.6c5.9,3,12.8,2,18.1-3.2c-0.2,2.1-1,6,3.9,7.8c0.3-2,2.9-5.1,7.6-7
					c4.6-1.9,4.7-6.9,5.2-13.5c0.5-5.7,9.9-7.2,12.8-1.7c-4.9-1.6-11.4,1.2-9.6,8.1c2.8-0.3,6.9,1.6,8,5.1
					c1.2,3.5-1.7,18.1-21.1,20.6c-19.4,2.5-32-4.1-38.8-15.6s-6.4-26.1-4.3-32.1c2.1-6,5.9-7.7,4.7-15.8c0,0-3.9-0.4-6.3,2.7
					c0,0,2.3-5.2,0.2-7.8s-5.1-4.8-7.1-10.7c-1.3,2.1-3.7,4.9-7.3,8.1s-4.2,5.3-3.8,13.8c-5.6-5.7-1.4-12.1,2.2-16.6
					c3.6-4.5-0.7-11.2-0.7-11.2s-4.4-2.6-8.7,2.6c-1.5-11.3-8.9-15-14.6-15.2s-13.1,0-15.6-3.4c0,0-0.2,5-2.2,8.5
					c-2,3.4-2.8,6.9,0.5,14.4c-1.8-0.5-7.9-1.3-9,6.5c7.8,1.4,9.6,12.7,13.6,14.6c4,2,8.4,1,10.3,3c1.9,2-0.8,4.2-2.7,3.5
					c-1.9-0.7-5.7-4.2-12.3-5.7c-6.6-1.5-15-0.8-19.8,9.6c7.2-0.4,6.5,4.5,7.1,7s2,4.2,7.2,3.3c-3.7,1.9-1.9,7.8,1,10
					c0,0,3.6-3,6.6-4.4c2.9-1.4,17.5-3.4,24.7,3.1c-13.9-4.5-24.7,2.3-28.1,9.8s-0.2,17.5,6.8,16c0,0-2.4-7,4.6-9.1
					c7-2.1,18.7,2.2,39.7,11.4c21,9.2,35.5,10.4,52.5,7.6s32.5-17.3,32.6-35C786.1,494.7,767.4,488.4,757.6,491.2z M671.3,472.2
					c-0.9,0.1-1.7-0.6-1.7-1.5c-0.1-0.9,0.6-1.7,1.5-1.7c0.9-0.1,1.7,0.6,1.7,1.5C672.9,471.3,672.2,472.1,671.3,472.2z
					 M672.8,477.3c-0.1-1.3,0.9-2.4,2.2-2.5c1.3-0.1,2.4,0.9,2.5,2.2c0.1,1.3-0.9,2.4-2.2,2.5C674,479.6,672.9,478.7,672.8,477.3z
					 M675.8,487.4c-0.2-2.3,1.6-4.3,3.9-4.5c2.3-0.2,4.3,1.6,4.5,3.9c0.2,2.3-1.6,4.3-3.9,4.5S676,489.7,675.8,487.4z M691.2,519.2
					c-8.1-11.1-12.5-21.3-7.8-23.9c4.7-2.7,8.8,4.4,12.2,13.9c3.4,9.5,7.4,24.8,35.2,35.3C711.6,539.2,699.4,530.3,691.2,519.2z"/>
			</g>
		</g>
		<g>
			<g>
				<path class="st39" d="M560.2,28.6c1.9,0.7,5.7,4.2,12.3,5.7s15,0.8,19.8-9.6c-7.2,0.4-6.5-4.5-7.1-7s-2-4.2-7.2-3.3
					c3.7-1.9,1.9-7.8-1-10c0,0-3.6,3-6.6,4.4c-2.9,1.4-17.5,3.4-24.7-3.1c13.9,4.5,24.7-2.3,28.1-9.8c3.4-7.5,0.2-17.5-6.8-16
					c0,0,2.4,7-4.6,9.1c-7,2.1-18.7-2.2-39.7-11.4s-35.5-10.4-52.5-7.6c-17,2.8-32.5,17.3-32.6,35s18.5,24,28.2,21.2
					c9.7-2.8,15.6-15,18.6-19.2c3-4.2,6.9-6.6,8.8-3.8c-2.1,0.2-3.9,2.9-3.3,5.8c0.6,2.9,4.1,5.4,9,1.6c4.9-3.8,2.7-13.5-3.2-16.6
					s-12.8-2-18.1,3.2c0.2-2.1,1-6-3.9-7.8c-0.3,2-2.9,5.1-7.6,7c-4.6,1.9-4.7,6.9-5.2,13.5c-0.5,5.7-9.9,7.2-12.8,1.7
					c4.9,1.6,11.4-1.2,9.6-8.1c-2.8,0.3-6.9-1.6-8-5.1s1.7-18.1,21.1-20.6c19.4-2.5,32,4.1,38.8,15.6c6.8,11.4,6.4,26.1,4.3,32.1
					c-2.1,6-5.9,7.7-4.7,15.8c0,0,3.9,0.4,6.3-2.7c0,0-2.3,5.2-0.2,7.8c2,2.6,5.1,4.8,7.1,10.7c1.3-2.1,3.7-4.9,7.3-8.1
					s4.2-5.3,3.8-13.8c5.6,5.7,1.4,12.1-2.2,16.6s0.7,11.2,0.7,11.2s4.4,2.6,8.7-2.6c1.5,11.3,8.9,15,14.6,15.2s13.1,0,15.6,3.4
					c0,0,0.2-5,2.2-8.5c2-3.4,2.8-6.9-0.5-14.4c1.8,0.5,7.9,1.3,9-6.5c-7.8-1.4-9.6-12.6-13.6-14.6s-8.4-1-10.3-3
					C555.7,30.2,558.3,28,560.2,28.6z M527.8,8.4c-3.4-9.5-7.4-24.8-35.2-35.3c19.2,5.2,31.5,14.1,39.6,25.2
					c8.1,11.1,12.5,21.3,7.8,23.9C535.3,24.9,531.2,17.9,527.8,8.4z M543.7,34.5c-2.3,0.2-4.3-1.6-4.5-3.9c-0.2-2.3,1.6-4.3,3.9-4.5
					c2.3-0.2,4.3,1.6,4.5,3.9C547.8,32.4,546,34.4,543.7,34.5z M548.5,42.7c-1.3,0.1-2.4-0.9-2.5-2.2c-0.1-1.3,0.9-2.4,2.2-2.5
					c1.3-0.1,2.4,0.9,2.5,2.2C550.7,41.4,549.8,42.6,548.5,42.7z M552.3,48.5c-0.9,0.1-1.7-0.6-1.7-1.5s0.6-1.7,1.5-1.7
					c0.9-0.1,1.7,0.6,1.7,1.5S553.2,48.5,552.3,48.5z"/>
			</g>
		</g>
		<path class="st39" d="M-3.8,530c2.4-16.3,8.3-27.4,26.3-31.3s36.3,6.5,59.6,1.4s38.5-16,51.6-34.7s7.8-26.1,16.4-34.8
			c8.6-8.8,14.1-3.1,15.2,0.5c-4.1-0.8-9.1,0.9-9.8,6.7c-0.7,5.8,6.3,11,12.8,8s10.8-11,6.5-18.4c-4.3-7.4-10.3-9.9-13.6-10.2
			c1.7-4.3,0-8.1,0-8.1s-9-1.3-15.3,2.3c-6.4,3.6-9.9,23.2-14.7,33.1c2.9-17.4,1.7-32.2-0.9-45.2c-2.6-13-0.6-20.7,6.5-20.5
			c1-6.7-4.7-7.8-8.3-5.6c-3.5,2.1-3.8,7.5-5.1,11c0.1-8.4,3.5-14.7,8.8-15.2s9.9-1.8,10.6-7.7c0.7-5.9,3.7-8,3.7-8
			c-1.6-2.3-5-3.6-7-3.7c8.6-1.9,13.5,1,16,4.5c2.4,3.5-0.8,7.5-0.8,7.5c-3.7-2.7-6-0.3-7.4,1.7c-1.5,1.9-2.8,8.8,5,12.3
			c7.8,3.6,14.9-2.6,16.3-9c1.4-6.4-2.1-17.7-16-22.7s-25.5,4.1-31.4,13.6c-5.9,9.5-3.5,22.9,1.6,37.6
			c-14.6-18.4-30.7-26.8-52.2-19.4s-28.2,25.1-28.1,43.4c0.1,18.3,16,27.7,28.2,26.1s20.2-7.7,19.7-16.1s-6.9-11.3-10.9-9.6
			c-3.9,1.8-4.3,8-10,9.9S53,430.4,52,419.8c4.1,5.3,10.9,8.1,15.2,5.8c6.1-3.2,8.1-7.4,4.5-12.1c-3.7,2-11.3,1.4-14.4-5.8
			c-2.5-5.8,1.1-17.3,9.3-23.3c8.2-5.9,17.3-5.7,17.3-5.7c-7.7,4.4-11.7,8.2-12.1,15.1c4.6-0.3,9.4,1.4,12.7-0.9
			c-6.3,7.6-2.4,17.3-3.2,19.8c11.1-0.5,18.1-7.3,21.4-11.4c-0.7,4.3,0.8,8.8,0.8,8.8s4.5-7.4,10.6-6.8c6.1,0.6,17.9,10.4,14.4,30.8
			c-2-15.6-7-21.8-16.4-21.9c-9.4-0.1-13,9.4-10,15.7c3,6.4,10.1,5.8,12.2,3.5c2.1-2.3,1.3-8.2,1.3-8.2c4.5,0.3,6.4,5.4,5.2,8.4
			c-1.2,2.9-4.4,5.8-9.1,6c-4.7,0.1-7,0.7-9.4,2.3c3.2,7.3,12,23.4,4.7,35.3c-7.4,11.9-12.2,12.1-12.2,12.1
			c7.3-6.9,11.7-15.7,10.5-24.7s-8.9-14.1-17.4-12.4c-8.6,1.8-11,10.5-7.1,16.4c4,5.9,10.1,3.4,12.1,0.6s0.3-6.5,0.3-6.5
			c5.4,0.1,9.4,8.1,5.9,15.8c-3.5,7.7-12.4,14.9-21.6,17.1s-29.9-2.9-41.1-0.4c5.5-3.8,24.7-1.1,30.3-1.4c5.6-0.4,16-6.5,15.7-14.2
			c-0.4-7.7-3.8-12.8-12.9-14.1c-9.2-1.3-10.5,9.1-9,11.5c1.6,2.4,6.8,4.2,10,3.2c-3,4.6-10.8,5.2-17.7,4.9
			c-6.9-0.2-23.5,1.5-36.3,9.2C3.5,500-1.8,508.1-4.1,516C-6.4,523.9-3.8,530-3.8,530z"/>
	</g>
</g>
</svg>
