<svg width="47" height="40" viewBox="0 0 47 40" xmlns="http://www.w3.org/2000/svg">
    <g fill="#E31337" fill-rule="nonzero">
        <path d="M33.11 22.582c.153 0 .248.166.172.298L23.44 39.9a.198.198 0 0 1-.172.1H17.25a.199.199 0 0 1-.171-.298l9.842-17.02a.198.198 0 0 1 .172-.1h6.016zm-5.852-4.879a.198.198 0 0 1-.171-.099L17.08.298A.199.199 0 0 1 17.25 0h6.017c.07 0 .136.038.172.1l10.007 17.305a.199.199 0 0 1-.172.298h-6.017z"/>
        <path d="M28.448.298A.199.199 0 0 1 28.62 0h6.025a.2.2 0 0 1 .173.1l11.471 19.8a.198.198 0 0 1 0 .2L34.818 39.9a.2.2 0 0 1-.173.1H28.62a.199.199 0 0 1-.172-.298L39.862 20 28.448.298zM23.552 19.9a.197.197 0 0 1 0 .2L12.026 39.9a.201.201 0 0 1-.346.001L.027 20.101a.197.197 0 0 1 0-.2L11.553.099a.201.201 0 0 1 .346 0l11.653 19.8z"/>
    </g>
</svg>
