<svg width="14" height="14" viewBox="0 0 14 14" xmlns="http://www.w3.org/2000/svg">
    <path d="M0 11.082v1.168C0 13.215 2.352 14 5.25 14s5.25-.785 5.25-1.75v-1.168c-1.13.796-3.194 1.168-5.25 1.168S1.13 11.878 0 11.082zM8.75 3.5c2.898 0 5.25-.785 5.25-1.75S11.648 0 8.75 0 3.5.785 3.5 1.75 5.852 3.5 8.75 3.5zM0 8.214v1.411c0 .965 2.352 1.75 5.25 1.75s5.25-.785 5.25-1.75v-1.41c-1.13.929-3.196 1.41-5.25 1.41S1.13 9.144 0 8.215zm11.375.3C12.942 8.212 14 7.649 14 7V5.832c-.634.449-1.567.755-2.625.944v1.739zM5.25 4.376C2.352 4.375 0 5.354 0 6.563 0 7.77 2.352 8.75 5.25 8.75s5.25-.979 5.25-2.188c0-1.208-2.352-2.187-5.25-2.187zm5.996 1.54C12.887 5.618 14 5.038 14 4.374V3.207c-.97.687-2.639 1.056-4.394 1.143.806.391 1.4.916 1.64 1.564z" fill="#D0D0D9" fill-rule="nonzero"/>
</svg>
