<svg width="14" height="13" viewBox="0 0 14 13" xmlns="http://www.w3.org/2000/svg">
    <path d="M12.61 2.625H2.189a.437.437 0 1 1 0-.875h10.5a.437.437 0 0 0 .437-.438C13.125.589 12.537 0 11.812 0H1.75A1.75 1.75 0 0 0 0 1.75v8.75c0 .967.783 1.75 1.75 1.75h10.86c.767 0 1.39-.589 1.39-1.313v-7c0-.723-.623-1.312-1.39-1.312zm-1.235 5.688a.875.875 0 1 1 0-1.75.875.875 0 0 1 0 1.75z" fill="#D0D0D9" fill-rule="nonzero"/>
</svg>
