{
    "employees" : [
        {
            "id" : 1,
            "name" : "John",
            "position" : "Web Developer"
        },
        {
            "id" : 2,
            "name" : "Peter",
            "position" : "UX / UI"
        },
        {
            "id" : 3,
            "name" : "Andrea",
            "position" : "MKT"
        },
        {
            "id" : 4,
            "name" : "Karen",
            "position" : "Servers"
        }
    ]
}