001111_0000000000_0000000000000000
001111_0000000001_0000000000000000
001111_0000000011_0000000000000000
001000_00011_00011_0000000000000001
000000_00001_00011_00001_00000_100001
001000_00001_00001_0011111111111111
000000_00000_00001_00001_00010_000000
000000_00000_00001_00001_00000_100011
001111_0000000010_0000000000000000
001000_00010_00010_0000000000001110
000000_00000_00001_00100_00010_000011
000000_00010_00001_00101_00000_000111
101011_00000_00001_0000000000000000
001000_00011_00011_0000000000000011
101001_00011_00100_0000000000000000
100001_00011_00111_0000000000000000
001000_00011_00011_0000000000000010
101000_00011_00101_0000000000000000
100011_00000_00110_0000000000000000
100000_00011_01000_0000000000000000
001000_00000_00000_0100000000000000
000000_00000_00000_00000_00001_000000
000000_00111_00000_00111_00000_100001
000000_00000_00000_00000_00010_000000
000000_00110_00000_00110_00000_100001
001000_01000_01000_0000000000001000
111111_00000_00000_00000_00000_000000