PC :         56
Cantidad de ciclos de clock :         19
Reg           0 =         36
Reg           1 =          0
Reg           2 =         68
Reg           3 =          x
Reg           4 =         44
DataMem[          0] =         68
DataMem[          1] =          x
DataMem[          2] =          x
DataMem[          3] =          x
DataMem[          4] =          x
