(footprint "HeatSink_20x20mm" (version 20221018) (generator pcbnew)
  (layer "F.Cu")
  (attr through_hole)
  (fp_text reference "REF**" (at 0 -0.5 unlocked) (layer "F.SilkS") hide
      (effects (font (size 1 1) (thickness 0.1)))
    (tstamp c15e4e84-a0fb-4cab-b0b0-a1aece295f6f)
  )
  (fp_text value "HeatSink_20x20mm" (at 0 1 unlocked) (layer "F.Fab") hide
      (effects (font (size 1 1) (thickness 0.15)))
    (tstamp fabdba07-832b-422e-9f47-160579d88387)
  )
  (fp_line (start 10.16 -10.16) (end -10.16 -10.16)
    (stroke (width 1.5) (type default)) (layer "Cmts.User") (tstamp a3a9f55c-bff0-44cc-85a0-9fc905f0294f))
  (fp_line (start 10.16 10.16) (end -10.16 10.16)
    (stroke (width 1.5) (type default)) (layer "Cmts.User") (tstamp 94e98f3b-63c2-474e-9380-9752620b92a1))
  (fp_line (start 10.16 -10.16) (end 10.16 10.16)
    (stroke (width 1.5) (type default)) (layer "User.2") (tstamp bcaf0b39-e155-4ea5-acd1-b9c503978540))
)
