(kicad_symbol_lib (version 20220914) (generator kicad_symbol_editor)
  (symbol "IRF840" (in_bom yes) (on_board yes)
    (property "Reference" "U" (at 2.54 2.54 0)
      (effects (font (size 1.27 1.27)))
    )
    (property "Value" "" (at 0 0 0)
      (effects (font (size 1.27 1.27)))
    )
    (property "Footprint" "" (at 0 0 0)
      (effects (font (size 1.27 1.27)) hide)
    )
    (property "Datasheet" "" (at 0 0 0)
      (effects (font (size 1.27 1.27)) hide)
    )
    (symbol "IRF840_0_1"
      (circle (center 0 0) (radius 2.8398)
        (stroke (width 0) (type default))
        (fill (type none))
      )
    )
    (symbol "IRF840_1_1"
      (pin input line (at -5.08 0 0) (length 2.54)
        (name "G" (effects (font (size 1.27 1.27))))
        (number "1" (effects (font (size 1.27 1.27))))
      )
      (pin input line (at 0 5.08 270) (length 2.54)
        (name "D" (effects (font (size 1.27 1.27))))
        (number "2" (effects (font (size 1.27 1.27))))
      )
      (pin output line (at 0 -5.08 90) (length 2.54)
        (name "S" (effects (font (size 1.27 1.27))))
        (number "3" (effects (font (size 1.27 1.27))))
      )
    )
  )
)
