<svg width="16" height="16" viewBox="0 0 16 16" fill="none" xmlns="http://www.w3.org/2000/svg">
<path fill-rule="evenodd" clip-rule="evenodd" d="M7.99429 15.338L10.9383 6.27734H5.05029L7.99429 15.338Z" fill="#E24329"/>
<path fill-rule="evenodd" clip-rule="evenodd" d="M7.9945 15.338L5.0505 6.27734H0.924561L7.9945 15.338Z" fill="#FC6D26"/>
<path fill-rule="evenodd" clip-rule="evenodd" d="M0.924503 6.27734L0.029877 9.03079C-0.051723 9.28191 0.0376484 9.55704 0.251287 9.71224L7.99444 15.338L0.924503 6.27734Z" fill="#FCA326"/>
<path fill-rule="evenodd" clip-rule="evenodd" d="M0.924561 6.27712H5.0505L3.27732 0.819974C3.18612 0.539137 2.78887 0.539214 2.69767 0.819974L0.924561 6.27712Z" fill="#E24329"/>
<path fill-rule="evenodd" clip-rule="evenodd" d="M7.99438 15.338L10.9384 6.27734H15.0643L7.99438 15.338Z" fill="#FC6D26"/>
<path fill-rule="evenodd" clip-rule="evenodd" d="M15.0643 6.27734L15.959 9.03079C16.0406 9.28191 15.9512 9.55704 15.7375 9.71224L7.99438 15.338L15.0643 6.27734Z" fill="#FCA326"/>
<path fill-rule="evenodd" clip-rule="evenodd" d="M15.0644 6.27712H10.9385L12.7117 0.819974C12.8029 0.539137 13.2001 0.539214 13.2913 0.819974L15.0644 6.27712Z" fill="#E24329"/>
</svg>
