:020000040800F2
:10000000600600206D0100087101000873010008FE
:100010007501000877010008790100080000000060
:100020000000000000000000000000007B0100084C
:100030007D010008000000007F0100088101000828
:100040008301000883010008830100088301000880
:100050008301000883010008830100088301000870
:100060008301000883010008830100088301000860
:100070008301000883010008830100088301000850
:100080008301000883010008830100088301000840
:100090008301000883010008830100088301000830
:1000A0008301000883010008830100088301000820
:1000B0008301000883010008830100088301000810
:1000C0008301000883010008830100088301000800
:1000D00083010008830100088301000883010008F0
:1000E00083010008830100088301000800F002F882
:1000F00000F02CF80AA090E8000C82448344AAF196
:100100000107DA4501D100F021F8AFF2090EBAE893
:100110000F0013F0010F18BFFB1A43F0010318473B
:10012000BC010000CC0100000023002400250026B3
:10013000103A28BF78C1FBD8520728BF30C148BF4A
:100140000B6070471FB51FBD10B510BD00F02DF836
:100150001146FFF7F7FF00F063F800F04BF803B427
:10016000FFF7F2FF03BC00F053F800000848804797
:10017000FEE7FEE7FEE7FEE7FEE7FEE7FEE7FEE757
:10018000FEE7FEE703480449044A054B70470000B8
:10019000ED000008600000206006002060020020E2
:1001A00060020020704770477047754600F02CF8D9
:1001B000AE4605006946534620F00700854618B054
:1001C00020B5FFF7DFFFBDE820404FF000064FF0FD
:1001D00000074FF000084FF0000B21F00701AC467C
:1001E000ACE8C009ACE8C009ACE8C009ACE8C0099B
:1001F0008D46704710B50446AFF300802046BDE839
:100200001040FFF7ACBF000000487047000000201E
:1002100001491820ABBEFEE726000200704700002F
:100220002B49896941F00401294A916140F2333137
:10023000284A116001204AE0012804D0022815D084
:10024000032839D125E023490C31096841F0010127
:10025000204A0C3211601146096821F00201116038
:100260001146096821F00401116025E019490C319B
:10027000096821F00101174A0C3211601146096822
:1002800041F0020111601146096821F0040111607A
:1002900012E010490C31096821F001010D4A0C32BD
:1002A00011601146096821F00201116011460968C8
:1002B00041F00401116000BF00BF002100E0491CB3
:1002C000054A9142FBDB401C032800DD0120B3E717
:1002D000001002400008014040420F00EC020008FC
:0C02E0000000002060060000280100085B
:04000005080000ED02
:00000001FF
