:020000040800F2
:10000000600600206D0100087101000873010008FE
:100010007501000877010008790100080000000060
:100020000000000000000000000000007B0100084C
:100030007D010008000000007F0100088101000828
:100040008301000883010008830100088301000880
:100050008301000883010008830100088301000870
:100060008301000883010008830100088301000860
:100070008301000883010008830100088301000850
:100080008301000883010008830100088301000840
:100090008301000883010008830100088301000830
:1000A0008301000883010008830100088301000820
:1000B0008301000883010008830100088301000810
:1000C0008301000883010008830100088301000800
:1000D00083010008830100088301000883010008F0
:1000E00083010008830100088301000800F002F882
:1000F00000F02CF80AA090E8000C82448344AAF196
:100100000107DA4501D100F021F8AFF2090EBAE893
:100110000F0013F0010F18BFFB1A43F0010318473B
:10012000D4010000E4010000002300240025002683
:10013000103A28BF78C1FBD8520728BF30C148BF4A
:100140000B6070471FB51FBD10B510BD00F02DF836
:100150001146FFF7F7FF00F063F800F04BF803B427
:10016000FFF7F2FF03BC00F053F800000848804797
:10017000FEE7FEE7FEE7FEE7FEE7FEE7FEE7FEE757
:10018000FEE7FEE703480449044A054B70470000B8
:10019000ED000008600000206006002060020020E2
:1001A00060020020704770477047754600F02CF8D9
:1001B000AE4605006946534620F00700854618B054
:1001C00020B5FFF7DFFFBDE820404FF000064FF0FD
:1001D00000074FF000084FF0000B21F00701AC467C
:1001E000ACE8C009ACE8C009ACE8C009ACE8C0099B
:1001F0008D46704710B50446AFF300802046BDE839
:100200001040FFF7ACBF000000487047000000201E
:1002100001491820ABBEFEE726000200704700002F
:100220003049896941F014012E4A916140F233311D
:100230002D4A11604FF080612C4A516000204FE040
:100240002A49896801F4804119B1401C032800DD66
:100250000120012804D0022815D0032839D125E037
:1002600021490C31096841F001011F4A0C3211602B
:100270001146096821F0020111601146096821F058
:100280000401116025E018490C31096821F00101D1
:10029000154A0C3211601146096841F002011160E3
:1002A0001146096821F00401116012E00E490C3179
:1002B000096821F001010C4A0C32116011460968ED
:1002C00021F0020111601146096841F0040111603A
:1002D00000BF00BF002100E0491C054A9142FBDB42
:1002E000AEE700000010024000080140001001408D
:1002F00020A10700040300080000002060060000A1
:0403000028010008C8
:04000005080000ED02
:00000001FF
