<?xml version="1.0" encoding="utf-8"?>
<!-- Generator: Adobe Illustrator 24.0.3, SVG Export Plug-In . SVG Version: 6.00 Build 0)  -->
<svg version="1.1" id="Laag_1" xmlns="http://www.w3.org/2000/svg" xmlns:xlink="http://www.w3.org/1999/xlink" x="0px" y="0px"
	 viewBox="0 0 194 78" style="enable-background:new 0 0 194 78;" xml:space="preserve">
<style type="text/css">
	.st0{opacity:0.4;}
	.st1{fill:url(#SVGID_1_);}
	.st2{filter:url(#Adobe_OpacityMaskFilter);}
	.st3{fill:url(#SVGID_3_);}
	.st4{mask:url(#SVGID_2_);fill:url(#SVGID_4_);}
	.st5{filter:url(#Adobe_OpacityMaskFilter_1_);}
	.st6{fill:url(#SVGID_6_);}
	.st7{mask:url(#SVGID_5_);fill:url(#SVGID_7_);}
	.st8{filter:url(#Adobe_OpacityMaskFilter_2_);}
	.st9{filter:url(#Adobe_OpacityMaskFilter_3_);}
	.st10{mask:url(#SVGID_8_);fill:url(#SVGID_9_);}
	.st11{fill:url(#SVGID_10_);}
	.st12{filter:url(#Adobe_OpacityMaskFilter_4_);}
	.st13{fill:url(#SVGID_12_);}
	.st14{mask:url(#SVGID_11_);fill:url(#SVGID_13_);}
	.st15{filter:url(#Adobe_OpacityMaskFilter_5_);}
	.st16{filter:url(#Adobe_OpacityMaskFilter_6_);}
	.st17{mask:url(#SVGID_14_);fill:url(#SVGID_15_);}
	.st18{fill:url(#SVGID_16_);}
	.st19{fill:url(#SVGID_17_);}
	.st20{fill:url(#SVGID_18_);}
	.st21{fill:url(#SVGID_19_);}
	.st22{fill:url(#SVGID_20_);}
	.st23{filter:url(#Adobe_OpacityMaskFilter_7_);}
	.st24{fill:url(#SVGID_22_);}
	.st25{mask:url(#SVGID_21_);fill:url(#SVGID_23_);}
	.st26{filter:url(#Adobe_OpacityMaskFilter_8_);}
	.st27{fill:url(#SVGID_25_);}
	.st28{mask:url(#SVGID_24_);fill:url(#SVGID_26_);}
	.st29{filter:url(#Adobe_OpacityMaskFilter_9_);}
	.st30{filter:url(#Adobe_OpacityMaskFilter_10_);}
	.st31{mask:url(#SVGID_27_);fill:url(#SVGID_28_);}
	.st32{fill:url(#SVGID_29_);}
	.st33{filter:url(#Adobe_OpacityMaskFilter_11_);}
	.st34{fill:url(#SVGID_31_);}
	.st35{mask:url(#SVGID_30_);fill:url(#SVGID_32_);}
	.st36{filter:url(#Adobe_OpacityMaskFilter_12_);}
	.st37{filter:url(#Adobe_OpacityMaskFilter_13_);}
	.st38{mask:url(#SVGID_33_);fill:url(#SVGID_34_);}
	.st39{fill:url(#SVGID_35_);}
	.st40{fill:url(#SVGID_36_);}
	.st41{fill:url(#SVGID_37_);}
	.st42{fill:url(#SVGID_38_);}
	.st43{fill:#FFFFFF;}
</style>
<g class="st0">
	<g>
		<linearGradient id="SVGID_1_" gradientUnits="userSpaceOnUse" x1="44.5702" y1="65.3752" x2="36.0151" y2="12.1441">
			<stop  offset="0" style="stop-color:#F49710"/>
			<stop  offset="1.736465e-02" style="stop-color:#F49511"/>
			<stop  offset="0.2981" style="stop-color:#ED6B19"/>
			<stop  offset="0.5119" style="stop-color:#E94E1B"/>
			<stop  offset="0.6321" style="stop-color:#E7421B"/>
		</linearGradient>
		<path class="st1" d="M46.8,43.9c-0.5-2.6-2.8-4.6-5.6-4.6c-3.2,0-5.7,2.6-5.7,5.7c0,0.3,0,0.6,0.1,0.9l3,17.3
			c0.6,2.6,2.8,4.5,5.6,4.5c1.5,0,2.8-0.6,3.8-1.5l2.3-2.3L46.8,43.9z"/>
	</g>
	<defs>
		<filter id="Adobe_OpacityMaskFilter" filterUnits="userSpaceOnUse" x="37.6" y="28.3" width="40.4" height="39.4">
			<feFlood  style="flood-color:white;flood-opacity:1" result="back"/>
			<feBlend  in="SourceGraphic" in2="back" mode="normal"/>
		</filter>
	</defs>
	<mask maskUnits="userSpaceOnUse" x="37.6" y="28.3" width="40.4" height="39.4" id="SVGID_2_">
		<g class="st2">
			<linearGradient id="SVGID_3_" gradientUnits="userSpaceOnUse" x1="37.7541" y1="47.9948" x2="55.2445" y2="47.9948">
				<stop  offset="0.2418" style="stop-color:#000000"/>
				<stop  offset="0.5099" style="stop-color:#FFFFFF"/>
			</linearGradient>
			<path class="st3" d="M37.6,57.7l1,5.6c0.6,2.6,2.8,4.5,5.6,4.5c1.5,0,2.8-0.6,3.8-1.5l30-29.3l-0.4-2.8c-0.6-3.3-3.5-5.9-7-5.9
				c-1.6,0-3.1,0.6-4.3,1.5c-0.3,0.2-0.5,0.4-0.7,0.7L37.6,57.7z"/>
		</g>
	</mask>
	<linearGradient id="SVGID_4_" gradientUnits="userSpaceOnUse" x1="39.3732" y1="63.974" x2="90.8616" y2="17.5552">
		<stop  offset="4.629750e-03" style="stop-color:#F49710"/>
		<stop  offset="0.7943" style="stop-color:#E7421B"/>
	</linearGradient>
	<path class="st4" d="M37.6,57.7l1,5.6c0.6,2.6,2.8,4.5,5.6,4.5c1.5,0,2.8-0.6,3.8-1.5l30-29.3l-0.4-2.8c-0.6-3.3-3.5-5.9-7-5.9
		c-1.6,0-3.1,0.6-4.3,1.5c-0.3,0.2-0.5,0.4-0.7,0.7L37.6,57.7z"/>
	<defs>
		<filter id="Adobe_OpacityMaskFilter_1_" filterUnits="userSpaceOnUse" x="63.7" y="28.3" width="18.6" height="38">
			<feFlood  style="flood-color:white;flood-opacity:1" result="back"/>
			<feBlend  in="SourceGraphic" in2="back" mode="normal"/>
		</filter>
	</defs>
	<mask maskUnits="userSpaceOnUse" x="63.7" y="28.3" width="18.6" height="38" id="SVGID_5_">
		<g class="st5">
			<linearGradient id="SVGID_6_" gradientUnits="userSpaceOnUse" x1="65.4642" y1="31.7722" x2="71.0883" y2="43.258">
				<stop  offset="0.3934" style="stop-color:#000000"/>
				<stop  offset="0.7217" style="stop-color:#FFFFFF"/>
			</linearGradient>
			<path class="st6" d="M67.4,55.4L68,59c0.7,4.1,4.3,7.2,8.6,7.2c2.2,0,4.7-0.7,5.7-2.1l0.1-0.1l-4.8-29.8c-0.6-3.3-3.5-5.9-7-5.9
				c-1.6,0-3.1,0.6-4.3,1.5c-0.3,0.2-0.5,0.4-0.7,0.7l-1.8,1.8L67.4,55.4z"/>
		</g>
	</mask>
	<linearGradient id="SVGID_7_" gradientUnits="userSpaceOnUse" x1="69.0955" y1="65.6871" x2="83.4047" y2="0.183">
		<stop  offset="4.629750e-03" style="stop-color:#F49710"/>
		<stop  offset="0.6641" style="stop-color:#E7421B"/>
	</linearGradient>
	<path class="st7" d="M68.1,59.7c0.5,2.5,2.1,4.5,4.3,5.7c1.2,0.6,2.5,0.9,3.9,0.9c0.7,0,1.4-0.1,2.1-0.2c1.5-0.4,2.8-1.2,3.8-2.3
		l-4.7-29.5c-0.6-3.3-3.5-5.9-7-5.9c-1.6,0-3.1,0.6-4.3,1.5c-0.3,0.2-0.5,0.4-0.7,0.7l-1.8,1.8l3.8,23.1L68.1,59.7z"/>
	<defs>
		<filter id="Adobe_OpacityMaskFilter_2_" filterUnits="userSpaceOnUse" x="67.4" y="22.4" width="40.1" height="43.9">
			<feFlood  style="flood-color:white;flood-opacity:1" result="back"/>
			<feBlend  in="SourceGraphic" in2="back" mode="normal"/>
		</filter>
	</defs>
	<mask maskUnits="userSpaceOnUse" x="67.4" y="22.4" width="40.1" height="43.9" id="SVGID_8_">
		<g class="st8">
			<defs>
				<filter id="Adobe_OpacityMaskFilter_3_" filterUnits="userSpaceOnUse" x="67.4" y="22.4" width="40.1" height="43.9">
					<feFlood  style="flood-color:white;flood-opacity:1" result="back"/>
					<feBlend  in="SourceGraphic" in2="back" mode="normal"/>
				</filter>
			</defs>
			<mask maskUnits="userSpaceOnUse" x="67.4" y="22.4" width="40.1" height="43.9" id="SVGID_8_">
				<g class="st9">
				</g>
			</mask>
			<linearGradient id="SVGID_9_" gradientUnits="userSpaceOnUse" x1="67.435" y1="44.3331" x2="107.5718" y2="44.3331">
				<stop  offset="0.1043" style="stop-color:#000000"/>
				<stop  offset="0.1833" style="stop-color:#FFFFFF"/>
			</linearGradient>
			<path class="st10" d="M97.1,22.4c-4,0-7.6,1.9-10,4.8l-8.7,12.4v0l-11,15.7l0,0l0.7,4.6c0.6,3.6,4,6.3,8.1,6.3
				c2.3,0,4.7-0.9,6-2.5l25.3-35.9C105.3,24.6,101.4,22.4,97.1,22.4z"/>
		</g>
	</mask>
	<linearGradient id="SVGID_10_" gradientUnits="userSpaceOnUse" x1="67.435" y1="44.3331" x2="107.5718" y2="44.3331">
		<stop  offset="4.629750e-03" style="stop-color:#F49710"/>
		<stop  offset="0.6183" style="stop-color:#E7421B"/>
	</linearGradient>
	<path class="st11" d="M68.1,59.7c0.5,2.5,2.1,4.5,4.3,5.7c1.2,0.6,2.5,0.9,3.9,0.9c0.7,0,1.4-0.1,2.1-0.2c1.7-0.5,3.2-1.5,4.3-2.8
		l24.9-35.3c-2.3-3.3-6.1-5.5-10.5-5.5c-4,0-7.6,1.9-10,4.8l-8.7,12.4v0l-11,15.7l0,0L68.1,59.7z"/>
	<defs>
		<filter id="Adobe_OpacityMaskFilter_4_" filterUnits="userSpaceOnUse" x="87" y="22.4" width="32" height="55.6">
			<feFlood  style="flood-color:white;flood-opacity:1" result="back"/>
			<feBlend  in="SourceGraphic" in2="back" mode="normal"/>
		</filter>
	</defs>
	<mask maskUnits="userSpaceOnUse" x="87" y="22.4" width="32" height="55.6" id="SVGID_11_">
		<g class="st12">
			<linearGradient id="SVGID_12_" gradientUnits="userSpaceOnUse" x1="84.6623" y1="50.2022" x2="107.5461" y2="50.2022">
				<stop  offset="0.1108" style="stop-color:#000000"/>
				<stop  offset="0.2354" style="stop-color:#FFFFFF"/>
			</linearGradient>
			<path class="st13" d="M109.5,32.1c-1.4-5.6-6.4-9.7-12.4-9.7c-4.1,0-7.7,1.9-10.1,4.9l9.5,40.6C97.8,73.7,102.9,78,109,78
				c4.1,0,7.7-1.9,10-4.9L109.5,32.1z"/>
		</g>
	</mask>
	<linearGradient id="SVGID_13_" gradientUnits="userSpaceOnUse" x1="103.0684" y1="69.1898" x2="103.0684" y2="-2.9381">
		<stop  offset="4.629750e-03" style="stop-color:#F49710"/>
		<stop  offset="0.6183" style="stop-color:#E7421B"/>
	</linearGradient>
	<path class="st14" d="M109.5,32.1c-1.4-5.6-6.4-9.7-12.4-9.7c-4.1,0-7.7,1.9-10.1,4.9l9.5,40.6C97.8,73.7,102.9,78,109,78
		c4.1,0,7.7-1.9,10-4.9L109.5,32.1z"/>
	<defs>
		<filter id="Adobe_OpacityMaskFilter_5_" filterUnits="userSpaceOnUse" x="95.3" y="0" width="63.3" height="78">
			<feFlood  style="flood-color:white;flood-opacity:1" result="back"/>
			<feBlend  in="SourceGraphic" in2="back" mode="normal"/>
		</filter>
	</defs>
	<mask maskUnits="userSpaceOnUse" x="95.3" y="0" width="63.3" height="78" id="SVGID_14_">
		<g class="st15">
			<defs>
				<filter id="Adobe_OpacityMaskFilter_6_" filterUnits="userSpaceOnUse" x="95.3" y="0" width="63.3" height="78">
					<feFlood  style="flood-color:white;flood-opacity:1" result="back"/>
					<feBlend  in="SourceGraphic" in2="back" mode="normal"/>
				</filter>
			</defs>
			<mask maskUnits="userSpaceOnUse" x="95.3" y="0" width="63.3" height="78" id="SVGID_14_">
				<g class="st16">
				</g>
			</mask>
			<linearGradient id="SVGID_15_" gradientUnits="userSpaceOnUse" x1="95.2792" y1="39" x2="158.5431" y2="39">
				<stop  offset="7.536060e-02" style="stop-color:#000000"/>
				<stop  offset="0.1887" style="stop-color:#FFFFFF"/>
			</linearGradient>
			<path class="st17" d="M135.4,5.2c2.2-3.3,6.1-5.2,10.3-5.2c7.1,0,12.8,5.7,12.8,12.8c0,2.6-0.6,4.8-2.1,7l-37.1,53
				C116.9,76,113.2,78,109,78c-6.2,0-11.3-4.4-12.5-10.2l-1.2-5.3L135.4,5.2z"/>
		</g>
	</mask>
	<linearGradient id="SVGID_16_" gradientUnits="userSpaceOnUse" x1="93.7311" y1="31.5369" x2="172.0083" y2="48.8906">
		<stop  offset="0" style="stop-color:#F49710"/>
		<stop  offset="0.7124" style="stop-color:#E7421B"/>
	</linearGradient>
	<path class="st18" d="M135.4,5.2c2.2-3.3,6.1-5.2,10.3-5.2c7.1,0,12.8,5.7,12.8,12.8c0,2.6-0.6,4.8-2.1,7l-37.1,53
		C116.9,76,113.2,78,109,78c-6.2,0-11.3-4.4-12.5-10.2l-1.2-5.3L135.4,5.2z"/>
	<g>
		<linearGradient id="SVGID_17_" gradientUnits="userSpaceOnUse" x1="121.7106" y1="82.6736" x2="84.9778" y2="23.9013">
			<stop  offset="0.16" style="stop-color:#F49710"/>
			<stop  offset="0.6183" style="stop-color:#E7421B"/>
		</linearGradient>
		<path class="st19" d="M87,27.3L87,27.3L87,27.3C87.1,27.2,87.1,27.3,87,27.3z"/>
	</g>
	
		<linearGradient id="SVGID_18_" gradientUnits="userSpaceOnUse" x1="2038.0431" y1="-377.0501" x2="2038.0431" y2="-377.0501" gradientTransform="matrix(0.5736 -0.8192 0.8192 0.5736 -796.4578 1918.0659)">
		<stop  offset="4.629750e-03" style="stop-color:#F49710"/>
		<stop  offset="0.6183" style="stop-color:#E7421B"/>
	</linearGradient>
	<path class="st20" d="M63.7,32.2"/>
	
		<linearGradient id="SVGID_19_" gradientUnits="userSpaceOnUse" x1="1674.7266" y1="-2291.8386" x2="1674.7266" y2="-2291.8386" gradientTransform="matrix(0.5736 -0.8192 0.8192 0.5736 995.2564 2726.1931)">
		<stop  offset="4.629750e-03" style="stop-color:#F49710"/>
		<stop  offset="0.6183" style="stop-color:#E7421B"/>
	</linearGradient>
	<path class="st21" d="M78.4,39.7"/>
</g>
<g>
	<g>
		<linearGradient id="SVGID_20_" gradientUnits="userSpaceOnUse" x1="44.5702" y1="65.3752" x2="36.0151" y2="12.1441">
			<stop  offset="0" style="stop-color:#F49710"/>
			<stop  offset="1.736465e-02" style="stop-color:#F49511"/>
			<stop  offset="0.2981" style="stop-color:#ED6B19"/>
			<stop  offset="0.5119" style="stop-color:#E94E1B"/>
			<stop  offset="0.6321" style="stop-color:#E7421B"/>
		</linearGradient>
		<path class="st22" d="M46.8,43.9c-0.5-2.6-2.8-4.6-5.6-4.6c-3.2,0-5.7,2.6-5.7,5.7c0,0.3,0,0.6,0.1,0.9l3,17.3
			c0.6,2.6,2.8,4.5,5.6,4.5c1.5,0,2.8-0.6,3.8-1.5l2.3-2.3L46.8,43.9z"/>
	</g>
	<defs>
		<filter id="Adobe_OpacityMaskFilter_7_" filterUnits="userSpaceOnUse" x="37.6" y="28.3" width="40.4" height="39.4">
			<feFlood  style="flood-color:white;flood-opacity:1" result="back"/>
			<feBlend  in="SourceGraphic" in2="back" mode="normal"/>
		</filter>
	</defs>
	<mask maskUnits="userSpaceOnUse" x="37.6" y="28.3" width="40.4" height="39.4" id="SVGID_21_">
		<g class="st23">
			<linearGradient id="SVGID_22_" gradientUnits="userSpaceOnUse" x1="37.7541" y1="47.9948" x2="55.2445" y2="47.9948">
				<stop  offset="0.2418" style="stop-color:#000000"/>
				<stop  offset="0.5099" style="stop-color:#FFFFFF"/>
			</linearGradient>
			<path class="st24" d="M37.6,57.7l1,5.6c0.6,2.6,2.8,4.5,5.6,4.5c1.5,0,2.8-0.6,3.8-1.5l30-29.3l-0.4-2.8c-0.6-3.3-3.5-5.9-7-5.9
				c-1.6,0-3.1,0.6-4.3,1.5c-0.3,0.2-0.5,0.4-0.7,0.7L37.6,57.7z"/>
		</g>
	</mask>
	<linearGradient id="SVGID_23_" gradientUnits="userSpaceOnUse" x1="39.3732" y1="63.974" x2="90.8616" y2="17.5552">
		<stop  offset="4.629750e-03" style="stop-color:#F49710"/>
		<stop  offset="0.7943" style="stop-color:#E7421B"/>
	</linearGradient>
	<path class="st25" d="M37.6,57.7l1,5.6c0.6,2.6,2.8,4.5,5.6,4.5c1.5,0,2.8-0.6,3.8-1.5l30-29.3l-0.4-2.8c-0.6-3.3-3.5-5.9-7-5.9
		c-1.6,0-3.1,0.6-4.3,1.5c-0.3,0.2-0.5,0.4-0.7,0.7L37.6,57.7z"/>
	<defs>
		<filter id="Adobe_OpacityMaskFilter_8_" filterUnits="userSpaceOnUse" x="63.7" y="28.3" width="18.6" height="38">
			<feFlood  style="flood-color:white;flood-opacity:1" result="back"/>
			<feBlend  in="SourceGraphic" in2="back" mode="normal"/>
		</filter>
	</defs>
	<mask maskUnits="userSpaceOnUse" x="63.7" y="28.3" width="18.6" height="38" id="SVGID_24_">
		<g class="st26">
			<linearGradient id="SVGID_25_" gradientUnits="userSpaceOnUse" x1="65.4642" y1="31.7722" x2="71.0883" y2="43.258">
				<stop  offset="0.3934" style="stop-color:#000000"/>
				<stop  offset="0.7217" style="stop-color:#FFFFFF"/>
			</linearGradient>
			<path class="st27" d="M67.4,55.4L68,59c0.7,4.1,4.3,7.2,8.6,7.2c2.2,0,4.7-0.7,5.7-2.1l0.1-0.1l-4.8-29.8c-0.6-3.3-3.5-5.9-7-5.9
				c-1.6,0-3.1,0.6-4.3,1.5c-0.3,0.2-0.5,0.4-0.7,0.7l-1.8,1.8L67.4,55.4z"/>
		</g>
	</mask>
	<linearGradient id="SVGID_26_" gradientUnits="userSpaceOnUse" x1="69.0955" y1="65.6871" x2="83.4047" y2="0.183">
		<stop  offset="4.629750e-03" style="stop-color:#F49710"/>
		<stop  offset="0.6641" style="stop-color:#E7421B"/>
	</linearGradient>
	<path class="st28" d="M68.1,59.7c0.5,2.5,2.1,4.5,4.3,5.7c1.2,0.6,2.5,0.9,3.9,0.9c0.7,0,1.4-0.1,2.1-0.2c1.5-0.4,2.8-1.2,3.8-2.3
		l-4.7-29.5c-0.6-3.3-3.5-5.9-7-5.9c-1.6,0-3.1,0.6-4.3,1.5c-0.3,0.2-0.5,0.4-0.7,0.7l-1.8,1.8l3.8,23.1L68.1,59.7z"/>
	<defs>
		<filter id="Adobe_OpacityMaskFilter_9_" filterUnits="userSpaceOnUse" x="67.4" y="22.4" width="40.1" height="43.9">
			<feFlood  style="flood-color:white;flood-opacity:1" result="back"/>
			<feBlend  in="SourceGraphic" in2="back" mode="normal"/>
		</filter>
	</defs>
	<mask maskUnits="userSpaceOnUse" x="67.4" y="22.4" width="40.1" height="43.9" id="SVGID_27_">
		<g class="st29">
			<defs>
				<filter id="Adobe_OpacityMaskFilter_10_" filterUnits="userSpaceOnUse" x="67.4" y="22.4" width="40.1" height="43.9">
					<feFlood  style="flood-color:white;flood-opacity:1" result="back"/>
					<feBlend  in="SourceGraphic" in2="back" mode="normal"/>
				</filter>
			</defs>
			<mask maskUnits="userSpaceOnUse" x="67.4" y="22.4" width="40.1" height="43.9" id="SVGID_27_">
				<g class="st30">
				</g>
			</mask>
			<linearGradient id="SVGID_28_" gradientUnits="userSpaceOnUse" x1="67.435" y1="44.3331" x2="107.5718" y2="44.3331">
				<stop  offset="0.1043" style="stop-color:#000000"/>
				<stop  offset="0.1833" style="stop-color:#FFFFFF"/>
			</linearGradient>
			<path class="st31" d="M97.1,22.4c-4,0-7.6,1.9-10,4.8l-8.7,12.4v0l-11,15.7l0,0l0.7,4.6c0.6,3.6,4,6.3,8.1,6.3
				c2.3,0,4.7-0.9,6-2.5l25.3-35.9C105.3,24.6,101.4,22.4,97.1,22.4z"/>
		</g>
	</mask>
	<linearGradient id="SVGID_29_" gradientUnits="userSpaceOnUse" x1="67.435" y1="44.3331" x2="107.5718" y2="44.3331">
		<stop  offset="4.629750e-03" style="stop-color:#F49710"/>
		<stop  offset="0.6183" style="stop-color:#E7421B"/>
	</linearGradient>
	<path class="st32" d="M68.1,59.7c0.5,2.5,2.1,4.5,4.3,5.7c1.2,0.6,2.5,0.9,3.9,0.9c0.7,0,1.4-0.1,2.1-0.2c1.7-0.5,3.2-1.5,4.3-2.8
		l24.9-35.3c-2.3-3.3-6.1-5.5-10.5-5.5c-4,0-7.6,1.9-10,4.8l-8.7,12.4v0l-11,15.7l0,0L68.1,59.7z"/>
	<defs>
		<filter id="Adobe_OpacityMaskFilter_11_" filterUnits="userSpaceOnUse" x="87" y="22.4" width="32" height="55.6">
			<feFlood  style="flood-color:white;flood-opacity:1" result="back"/>
			<feBlend  in="SourceGraphic" in2="back" mode="normal"/>
		</filter>
	</defs>
	<mask maskUnits="userSpaceOnUse" x="87" y="22.4" width="32" height="55.6" id="SVGID_30_">
		<g class="st33">
			<linearGradient id="SVGID_31_" gradientUnits="userSpaceOnUse" x1="84.6623" y1="50.2022" x2="107.5461" y2="50.2022">
				<stop  offset="0.1108" style="stop-color:#000000"/>
				<stop  offset="0.2354" style="stop-color:#FFFFFF"/>
			</linearGradient>
			<path class="st34" d="M109.5,32.1c-1.4-5.6-6.4-9.7-12.4-9.7c-4.1,0-7.7,1.9-10.1,4.9l9.5,40.6C97.8,73.7,102.9,78,109,78
				c4.1,0,7.7-1.9,10-4.9L109.5,32.1z"/>
		</g>
	</mask>
	<linearGradient id="SVGID_32_" gradientUnits="userSpaceOnUse" x1="103.0684" y1="69.1898" x2="103.0684" y2="-2.9381">
		<stop  offset="4.629750e-03" style="stop-color:#F49710"/>
		<stop  offset="0.6183" style="stop-color:#E7421B"/>
	</linearGradient>
	<path class="st35" d="M109.5,32.1c-1.4-5.6-6.4-9.7-12.4-9.7c-4.1,0-7.7,1.9-10.1,4.9l9.5,40.6C97.8,73.7,102.9,78,109,78
		c4.1,0,7.7-1.9,10-4.9L109.5,32.1z"/>
	<defs>
		<filter id="Adobe_OpacityMaskFilter_12_" filterUnits="userSpaceOnUse" x="95.3" y="0" width="63.3" height="78">
			<feFlood  style="flood-color:white;flood-opacity:1" result="back"/>
			<feBlend  in="SourceGraphic" in2="back" mode="normal"/>
		</filter>
	</defs>
	<mask maskUnits="userSpaceOnUse" x="95.3" y="0" width="63.3" height="78" id="SVGID_33_">
		<g class="st36">
			<defs>
				<filter id="Adobe_OpacityMaskFilter_13_" filterUnits="userSpaceOnUse" x="95.3" y="0" width="63.3" height="78">
					<feFlood  style="flood-color:white;flood-opacity:1" result="back"/>
					<feBlend  in="SourceGraphic" in2="back" mode="normal"/>
				</filter>
			</defs>
			<mask maskUnits="userSpaceOnUse" x="95.3" y="0" width="63.3" height="78" id="SVGID_33_">
				<g class="st37">
				</g>
			</mask>
			<linearGradient id="SVGID_34_" gradientUnits="userSpaceOnUse" x1="95.2792" y1="39" x2="158.5431" y2="39">
				<stop  offset="7.536060e-02" style="stop-color:#000000"/>
				<stop  offset="0.1887" style="stop-color:#FFFFFF"/>
			</linearGradient>
			<path class="st38" d="M135.4,5.2c2.2-3.3,6.1-5.2,10.3-5.2c7.1,0,12.8,5.7,12.8,12.8c0,2.6-0.6,4.8-2.1,7l-37.1,53
				C116.9,76,113.2,78,109,78c-6.2,0-11.3-4.4-12.5-10.2l-1.2-5.3L135.4,5.2z"/>
		</g>
	</mask>
	<linearGradient id="SVGID_35_" gradientUnits="userSpaceOnUse" x1="93.7311" y1="31.5369" x2="172.0083" y2="48.8906">
		<stop  offset="0" style="stop-color:#F49710"/>
		<stop  offset="0.7124" style="stop-color:#E7421B"/>
	</linearGradient>
	<path class="st39" d="M135.4,5.2c2.2-3.3,6.1-5.2,10.3-5.2c7.1,0,12.8,5.7,12.8,12.8c0,2.6-0.6,4.8-2.1,7l-37.1,53
		C116.9,76,113.2,78,109,78c-6.2,0-11.3-4.4-12.5-10.2l-1.2-5.3L135.4,5.2z"/>
	<g>
		<linearGradient id="SVGID_36_" gradientUnits="userSpaceOnUse" x1="121.7106" y1="82.6736" x2="84.9778" y2="23.9013">
			<stop  offset="0.16" style="stop-color:#F49710"/>
			<stop  offset="0.6183" style="stop-color:#E7421B"/>
		</linearGradient>
		<path class="st40" d="M87,27.3L87,27.3L87,27.3C87.1,27.2,87.1,27.3,87,27.3z"/>
	</g>
	
		<linearGradient id="SVGID_37_" gradientUnits="userSpaceOnUse" x1="2038.0431" y1="-377.0501" x2="2038.0431" y2="-377.0501" gradientTransform="matrix(0.5736 -0.8192 0.8192 0.5736 -796.4578 1918.0659)">
		<stop  offset="4.629750e-03" style="stop-color:#F49710"/>
		<stop  offset="0.6183" style="stop-color:#E7421B"/>
	</linearGradient>
	<path class="st41" d="M63.7,32.2"/>
	
		<linearGradient id="SVGID_38_" gradientUnits="userSpaceOnUse" x1="1674.7266" y1="-2291.8386" x2="1674.7266" y2="-2291.8386" gradientTransform="matrix(0.5736 -0.8192 0.8192 0.5736 995.2564 2726.1931)">
		<stop  offset="4.629750e-03" style="stop-color:#F49710"/>
		<stop  offset="0.6183" style="stop-color:#E7421B"/>
	</linearGradient>
	<path class="st42" d="M78.4,39.7"/>
</g>
<path class="st43" d="M103.1,36.2h2.6V49h-1.4l-8.1-8.2V41v8h-2.6V36.2h1.5l8,8V36.2z M125.3,40.3h-2.7l-1.8,2.5l-1.7-2.5h-2.7
	l3.1,4.4l-3.1,4.3h2.7l1.8-2.5l1.8,2.5h2.7l-3.1-4.4L125.3,40.3z M72.2,46c-0.8,0.5-1.6,0.8-2.6,0.8c-2.4,0-4.4-1.9-4.4-4.3
	s2-4.3,4.4-4.3c0.9,0,1.8,0.3,2.6,0.8l0.1,0.1l1.4-1.9L73.6,37c-1.2-0.8-2.5-1.2-3.9-1.2c-3.8,0-6.8,3-6.8,6.7
	c0,3.7,3.1,6.7,6.8,6.7c1.4,0,2.8-0.4,3.9-1.2l0.1-0.1l-1.4-1.9L72.2,46z M90.9,40.1c-0.9,0-2.3,0.4-3,1v-0.8h-2.1V49H88v-4.8
	c0-1.3,1.8-1.9,3.6-1.9v-2.2H90.9z M78,40.2l-3.7,5.3c0.4,2.2,2.3,3.7,4.5,3.7c0.9,0,1.8-0.3,2.5-0.8V49h2.1v-8.7h-2.1
	c0,0,0,0.4,0,0.7c-0.8-0.6-1.6-0.8-2.5-0.8C78.6,40.1,78.3,40.1,78,40.2 M81.4,44.6c0,1.4-1.1,2.5-2.5,2.5c-1.4,0-2.5-1.2-2.5-2.5
	c0-1.4,1.2-2.5,2.5-2.5C80.3,42.1,81.4,43.3,81.4,44.6 M116.1,45.3c0.1-0.7,0-1.6-0.3-2.3c-0.6-1.6-2.1-2.9-4.2-2.9
	c-0.6,0-0.8,0.1-0.8,0.1l-3.6,5.2c0,0,0.5,3.8,4.6,3.8c2.4,0,3.6-1.2,3.6-1.2l-1.1-1.6c0,0-1.1,0.9-2.3,0.9s-2.4-0.6-2.7-2
	L116.1,45.3z M111.7,42c1.8,0,2.3,1.6,2.3,1.6h-4.6C109.4,43.6,109.9,42,111.7,42z M127.2,46.4c0,1.9,1.5,2.8,2.7,2.8
	c1.2,0,1.6-0.2,1.6-0.2v-1.8c0,0-1,0.3-1.5-0.1c-0.5-0.4-0.5-0.9-0.5-1.1v-3.7h2.1v-2h-2.1v-1.9h-0.9l-2.7,3.9h1.4V46.4z M99.2,57.8
	c0-0.4,0.3-0.7,0.7-0.7c0.4,0,0.7,0.3,0.7,0.7c0,0.4-0.3,0.7-0.7,0.7C99.5,58.5,99.2,58.2,99.2,57.8z M100.9,55.1
	c0-2,1.3-3.4,3.3-3.4c0.8,0,1.5,0.2,2.1,0.7l-0.5,0.6c-0.5-0.4-1-0.6-1.6-0.6c-1.4,0-2.4,1-2.4,2.6c0,1.6,1,2.6,2.4,2.6
	c0.7,0,1.3-0.2,1.8-0.7l0.5,0.6c-0.6,0.6-1.4,0.9-2.3,0.9C102.2,58.5,100.9,57.1,100.9,55.1z M107.3,55.1c0-2,1.3-3.4,3.3-3.4
	c2,0,3.3,1.3,3.3,3.4c0,2-1.3,3.4-3.3,3.4C108.6,58.5,107.3,57.1,107.3,55.1z M113,55.1c0-1.6-0.9-2.6-2.4-2.6c-1.4,0-2.4,1-2.4,2.6
	c0,1.6,1,2.6,2.4,2.6C112.1,57.7,113,56.7,113,55.1z M125,54.3v4.1h-0.9v-3.9c0-1.2-0.7-1.9-1.8-1.9c-1.1,0-1.8,0.8-1.8,1.9v3.9
	h-0.9v-3.9c0-1.2-0.7-1.9-1.8-1.9c-1.1,0-1.8,0.8-1.8,1.9v3.9H115v-6.5h0.9l0,1c0.4-0.7,1.1-1.2,2.1-1.2c1,0,1.8,0.5,2.2,1.3
	c0.4-0.8,1.2-1.3,2.3-1.3C124,51.7,125,52.8,125,54.3z"/>
</svg>
