{
    "openapi": "3.0.0",
    "info": {
        "title": "My First API",
        "version": "0.1"
    },
    "paths": {
        "/api/getCatgeries": {
            "get": {
                "tags": [
                    "Category"
                ],
                "summary": "get All Catgeries",
                "description": "get All Catgeries",
                "operationId": "74913fd5fefec5c48aff9af3d088a92b",
                "responses": {
                    "422": {
                        "description": "Wrong credentials response",
                        "content": {
                            "application/json": {
                                "schema": {
                                    "properties": {
                                        "message": {
                                            "type": "string",
                                            "example": "Sorry, validation error. Please try again"
                                        }
                                    },
                                    "type": "object"
                                }
                            }
                        }
                    }
                },
                "security": [
                    {
                        "passport": []
                    }
                ]
            }
        },
        "/api/getTasks": {
            "post": {
                "tags": [
                    "Tasks"
                ],
                "summary": "get All Tasks",
                "description": "get All Tasks",
                "operationId": "94836291ce4e42800f126bb783c2c48f",
                "requestBody": {
                    "description": "Pass user credentials",
                    "required": true,
                    "content": {
                        "application/json": {
                            "schema": {
                                "properties": {
                                    "description": {
                                        "type": "string",
                                        "example": "task 1"
                                    },
                                    "category_id": {
                                        "type": "number",
                                        "example": "1"
                                    },
                                    "deadline": {
                                        "type": "string",
                                        "format": "date",
                                        "example": "12-3-2023"
                                    },
                                    "is_end": {
                                        "type": "boolean",
                                        "example": "1"
                                    },
                                    "page": {
                                        "type": "number",
                                        "example": "1"
                                    },
                                    "limit": {
                                        "type": "number",
                                        "example": "10"
                                    }
                                },
                                "type": "object"
                            }
                        }
                    }
                },
                "responses": {
                    "422": {
                        "description": "Wrong credentials response",
                        "content": {
                            "application/json": {
                                "schema": {
                                    "properties": {
                                        "message": {
                                            "type": "string",
                                            "example": "Sorry, wrong entries. Please try again"
                                        }
                                    },
                                    "type": "object"
                                }
                            }
                        }
                    }
                },
                "security": [
                    {
                        "passport": []
                    }
                ]
            }
        },
        "/api/createTask": {
            "post": {
                "tags": [
                    "Tasks"
                ],
                "summary": "create Task",
                "description": "create Task",
                "operationId": "09f3d64e4da440a29d27492751e81d38",
                "requestBody": {
                    "description": "Pass user credentials",
                    "required": true,
                    "content": {
                        "application/json": {
                            "schema": {
                                "required": [
                                    "description",
                                    "categories",
                                    "deadline",
                                    "sub_tasks"
                                ],
                                "properties": {
                                    "description": {
                                        "type": "text",
                                        "example": "task 1 Descriptions"
                                    },
                                    "categories": {
                                        "type": "number",
                                        "example": "[1,2,3]"
                                    },
                                    "deadline": {
                                        "type": "string",
                                        "format": "date",
                                        "example": "12-3-2023"
                                    },
                                    "sub_tasks": {
                                        "type": "text",
                                        "example": "[sub task1 ,sub task2]"
                                    }
                                },
                                "type": "object"
                            }
                        }
                    }
                },
                "responses": {
                    "422": {
                        "description": "Wrong credentials response",
                        "content": {
                            "application/json": {
                                "schema": {
                                    "properties": {
                                        "message": {
                                            "type": "string",
                                            "example": "Sorry, wrong entries. Please try again"
                                        }
                                    },
                                    "type": "object"
                                }
                            }
                        }
                    }
                },
                "security": [
                    {
                        "passport": []
                    }
                ]
            }
        },
        "/api/getTaskById/{id}": {
            "get": {
                "tags": [
                    "Tasks"
                ],
                "summary": "get task details by id ",
                "description": "get task details by id",
                "operationId": "eccbf9bacdf926031372a5bc3f20bf71",
                "parameters": [
                    {
                        "name": "id",
                        "in": "path",
                        "description": "ID of task",
                        "required": true,
                        "schema": {
                            "type": "integer",
                            "format": "int64"
                        },
                        "example": "1"
                    }
                ],
                "responses": {
                    "422": {
                        "description": "Wrong credentials response",
                        "content": {
                            "application/json": {
                                "schema": {
                                    "properties": {
                                        "message": {
                                            "type": "string",
                                            "example": "Sorry, validation error. Please try again"
                                        }
                                    },
                                    "type": "object"
                                }
                            }
                        }
                    }
                },
                "security": [
                    {
                        "passport": []
                    }
                ]
            }
        },
        "/api/register": {
            "post": {
                "tags": [
                    "Auth"
                ],
                "summary": "Sign up parent account",
                "description": "Sign up parent account",
                "operationId": "74ab8421a9f3fc9917ec8e9a0c202d30",
                "requestBody": {
                    "description": "Pass info",
                    "required": true,
                    "content": {
                        "application/json": {
                            "schema": {
                                "required": [
                                    "email",
                                    "name",
                                    "password"
                                ],
                                "properties": {
                                    "email": {
                                        "type": "string",
                                        "format": "email",
                                        "example": "admin@gmail.com"
                                    },
                                    "name": {
                                        "type": "string",
                                        "example": " name"
                                    },
                                    "password": {
                                        "type": "string",
                                        "format": "password",
                                        "example": "123456"
                                    }
                                },
                                "type": "object"
                            }
                        }
                    }
                },
                "responses": {
                    "422": {
                        "description": "Wrong credentials response",
                        "content": {
                            "application/json": {
                                "schema": {
                                    "properties": {
                                        "message": {
                                            "type": "string",
                                            "example": "Sorry, validation error. Please try again"
                                        }
                                    },
                                    "type": "object"
                                }
                            }
                        }
                    }
                }
            }
        },
        "/api/login": {
            "post": {
                "tags": [
                    "Auth"
                ],
                "summary": "Sign in",
                "description": "Login by email, password",
                "operationId": "c5663f334847f875d3ff64585ba55824",
                "requestBody": {
                    "description": "Pass user credentials",
                    "required": true,
                    "content": {
                        "application/json": {
                            "schema": {
                                "required": [
                                    "email",
                                    "password"
                                ],
                                "properties": {
                                    "email": {
                                        "type": "string",
                                        "example": "admin@gmail.com"
                                    },
                                    "password": {
                                        "type": "string",
                                        "format": "password",
                                        "example": "123456"
                                    }
                                },
                                "type": "object"
                            }
                        }
                    }
                },
                "responses": {
                    "422": {
                        "description": "Wrong credentials response",
                        "content": {
                            "application/json": {
                                "schema": {
                                    "properties": {
                                        "message": {
                                            "type": "string",
                                            "example": "Sorry, wrong email address or password. Please try again"
                                        }
                                    },
                                    "type": "object"
                                }
                            }
                        }
                    }
                }
            }
        }
    },
    "components": {
        "securitySchemes": {
            "passport": {
                "type": "apiKey",
                "description": "Enter token in format (Bearer <token>)",
                "name": "Authorization",
                "in": "header"
            }
        }
    }
}