{
  "images" : [
    {
      "filename" : "200_video(2).pdf",
      "idiom" : "iphone",
      "scale" : "1x"
    },
    {
      "filename" : "200_video(2)-1.pdf",
      "idiom" : "iphone",
      "scale" : "2x"
    },
    {
      "filename" : "200_video(2)-2.pdf",
      "idiom" : "iphone",
      "scale" : "3x"
    },
    {
      "filename" : "300_youtube.pdf",
      "idiom" : "ipad",
      "scale" : "1x"
    },
    {
      "filename" : "300_youtube-1.pdf",
      "idiom" : "ipad",
      "scale" : "2x"
    }
  ],
  "info" : {
    "author" : "xcode",
    "version" : 1
  }
}
