{
  "images" : [
    {
      "filename" : "inner_bg_g(1).pdf",
      "idiom" : "iphone",
      "scale" : "1x"
    },
    {
      "appearances" : [
        {
          "appearance" : "luminosity",
          "value" : "dark"
        }
      ],
      "filename" : "inner_bg_g(1)-3.pdf",
      "idiom" : "iphone",
      "scale" : "1x"
    },
    {
      "filename" : "inner_bg_g(1)-1.pdf",
      "idiom" : "iphone",
      "scale" : "2x"
    },
    {
      "appearances" : [
        {
          "appearance" : "luminosity",
          "value" : "dark"
        }
      ],
      "filename" : "inner_bg_g(1)-4.pdf",
      "idiom" : "iphone",
      "scale" : "2x"
    },
    {
      "filename" : "inner_bg_g(1)-2.pdf",
      "idiom" : "iphone",
      "scale" : "3x"
    },
    {
      "appearances" : [
        {
          "appearance" : "luminosity",
          "value" : "dark"
        }
      ],
      "filename" : "inner_bg_g(1)-5.pdf",
      "idiom" : "iphone",
      "scale" : "3x"
    },
    {
      "filename" : "innerpage_bg_g(1).pdf",
      "idiom" : "ipad",
      "scale" : "1x"
    },
    {
      "appearances" : [
        {
          "appearance" : "luminosity",
          "value" : "dark"
        }
      ],
      "filename" : "innerpage_bg_g(1)-2.pdf",
      "idiom" : "ipad",
      "scale" : "1x"
    },
    {
      "filename" : "innerpage_bg_g(1)-1.pdf",
      "idiom" : "ipad",
      "scale" : "2x"
    },
    {
      "appearances" : [
        {
          "appearance" : "luminosity",
          "value" : "dark"
        }
      ],
      "filename" : "innerpage_bg_g(1)-3.pdf",
      "idiom" : "ipad",
      "scale" : "2x"
    }
  ],
  "info" : {
    "author" : "xcode",
    "version" : 1
  }
}
