{
  "images" : [
    {
      "filename" : "video_icon.pdf",
      "idiom" : "iphone",
      "scale" : "1x"
    },
    {
      "filename" : "video_icon-1.pdf",
      "idiom" : "iphone",
      "scale" : "2x"
    },
    {
      "filename" : "video_icon-2.pdf",
      "idiom" : "iphone",
      "scale" : "3x"
    },
    {
      "filename" : "video_icon-3.pdf",
      "idiom" : "ipad",
      "scale" : "1x"
    },
    {
      "filename" : "video_icon-4.pdf",
      "idiom" : "ipad",
      "scale" : "2x"
    }
  ],
  "info" : {
    "author" : "xcode",
    "version" : 1
  }
}
