{
  "images" : [
    {
      "filename" : "boat_start8.pdf",
      "idiom" : "iphone",
      "scale" : "1x"
    },
    {
      "filename" : "boat_start8-1.pdf",
      "idiom" : "iphone",
      "scale" : "2x"
    },
    {
      "filename" : "boat_start8-2.pdf",
      "idiom" : "iphone",
      "scale" : "3x"
    },
    {
      "filename" : "boat_start08.pdf",
      "idiom" : "ipad",
      "scale" : "1x"
    },
    {
      "filename" : "boat_start08-1.pdf",
      "idiom" : "ipad",
      "scale" : "2x"
    }
  ],
  "info" : {
    "author" : "xcode",
    "version" : 1
  }
}
