{
  "images" : [
    {
      "filename" : "boat_start7.pdf",
      "idiom" : "iphone",
      "scale" : "1x"
    },
    {
      "filename" : "boat_start7-1.pdf",
      "idiom" : "iphone",
      "scale" : "2x"
    },
    {
      "filename" : "boat_start7-2.pdf",
      "idiom" : "iphone",
      "scale" : "3x"
    },
    {
      "filename" : "boat_start07.pdf",
      "idiom" : "ipad",
      "scale" : "1x"
    },
    {
      "filename" : "boat_start07-1.pdf",
      "idiom" : "ipad",
      "scale" : "2x"
    }
  ],
  "info" : {
    "author" : "xcode",
    "version" : 1
  }
}
