// Jest Snapshot v1, https://goo.gl/fbAQLP

exports[`Testing TaskItem Component Render correctly 1`] = `
<View
  accessible={true}
  focusable={true}
  onClick={[Function]}
  onResponderGrant={[Function]}
  onResponderMove={[Function]}
  onResponderRelease={[Function]}
  onResponderTerminate={[Function]}
  onResponderTerminationRequest={[Function]}
  onStartShouldSetResponder={[Function]}
  style={
    Array [
      Object {
        "alignItems": "flex-start",
        "backgroundColor": "#fff",
        "borderColor": "#dadad991",
        "borderRadius": 22.5,
        "borderWidth": 0.5,
        "marginBottom": 30,
        "paddingHorizontal": 30,
        "paddingVertical": 30,
      },
      Object {
        "backgroundColor": undefined,
      },
    ]
  }
  testID="navigationTouchableID"
>
  <Text
    style={
      Array [
        Object {
          "color": "#141b2e",
          "fontFamily": "Cairo-Bold",
          "fontSize": 30,
          "textAlign": "left",
        },
      ]
    }
    testID="MTextTestID"
  />
  <Text
    style={
      Array [
        Object {
          "color": "#141b2e",
          "fontFamily": "Cairo-Light",
          "fontSize": 22.5,
          "textAlign": "left",
        },
      ]
    }
    testID="MTextTestID"
  />
  <Text
    style={
      Array [
        Object {
          "color": "#141b2e",
          "fontFamily": "Cairo-Regular",
          "fontSize": 26.5,
          "textAlign": "left",
        },
      ]
    }
    testID="MTextTestID"
  />
</View>
`;
