// Jest Snapshot v1, https://goo.gl/fbAQLP

exports[`Testing Custom Text Component Render and put text value correctly 1`] = `
<Text
  style={
    Array [
      Object {
        "color": "#141b2e",
        "fontFamily": "Cairo-Regular",
        "fontSize": 19,
        "textAlign": "center",
      },
    ]
  }
  testID="MTextTestID"
>
  My Custom Component For Text
</Text>
`;
