<svg xmlns="http://www.w3.org/2000/svg" width="38.115" height="64.879" viewBox="0 0 38.115 64.879">
  <g id="Group_7" data-name="Group 7" transform="translate(-101.48)">
    <path id="Path_25" data-name="Path 25" d="M114.288,32.453,138.559,8.181a3.557,3.557,0,0,0,0-5.018l-2.127-2.126a3.555,3.555,0,0,0-5.019,0l-28.9,28.9a3.582,3.582,0,0,0,0,5.037l28.872,28.87a3.555,3.555,0,0,0,5.019,0l2.126-2.126a3.553,3.553,0,0,0,0-5.019Z" transform="translate(0 0)" fill="#fff"/>
  </g>
</svg>
