^C:\USERS\ДМИТРИЙ\SOURCE\REPOS\MYFIRST\MYFIRST\MYFIRST.CPP
C:\USERS\Дмитрий\SOURCE\REPOS\MYFIRST\MYFIRST\DEBUG\VC142.PDB
C:\USERS\Дмитрий\SOURCE\REPOS\MYFIRST\MYFIRST\DEBUG\VC142.IDB
C:\USERS\Дмитрий\SOURCE\REPOS\MYFIRST\MYFIRST\DEBUG\MYFIRST.OBJ
