<svg width="198" height="44" viewBox="0 0 198 44" fill="none" xmlns="http://www.w3.org/2000/svg">
<rect width="198" height="44" rx="22" fill="#C4C4C4"/>
<path d="M41.4 29L41.38 20.6L37.26 27.52H35.8L31.7 20.78V29H28.66V15H31.34L36.58 23.7L41.74 15H44.4L44.44 29H41.4ZM58.2216 18.24L53.3616 29.66C52.8682 30.9 52.2549 31.7733 51.5216 32.28C50.8016 32.7867 49.9282 33.04 48.9016 33.04C48.3416 33.04 47.7882 32.9533 47.2416 32.78C46.6949 32.6067 46.2482 32.3667 45.9016 32.06L47.0416 29.84C47.2816 30.0533 47.5549 30.22 47.8616 30.34C48.1816 30.46 48.4949 30.52 48.8016 30.52C49.2282 30.52 49.5749 30.4133 49.8416 30.2C50.1082 30 50.3482 29.66 50.5616 29.18L50.6016 29.08L45.9416 18.24H49.1616L52.1816 25.54L55.2216 18.24H58.2216ZM76.2188 26.4V29H65.3788V15H75.9588V17.6H68.5988V20.64H75.0988V23.16H68.5988V26.4H76.2188ZM89.4586 14.16V29H86.4786V27.76C85.7053 28.6933 84.5853 29.16 83.1186 29.16C82.1053 29.16 81.1853 28.9333 80.3586 28.48C79.5453 28.0267 78.9053 27.38 78.4386 26.54C77.9719 25.7 77.7386 24.7267 77.7386 23.62C77.7386 22.5133 77.9719 21.54 78.4386 20.7C78.9053 19.86 79.5453 19.2133 80.3586 18.76C81.1853 18.3067 82.1053 18.08 83.1186 18.08C84.4919 18.08 85.5653 18.5133 86.3386 19.38V14.16H89.4586ZM83.6586 26.6C84.4453 26.6 85.0986 26.3333 85.6186 25.8C86.1386 25.2533 86.3986 24.5267 86.3986 23.62C86.3986 22.7133 86.1386 21.9933 85.6186 21.46C85.0986 20.9133 84.4453 20.64 83.6586 20.64C82.8586 20.64 82.1986 20.9133 81.6786 21.46C81.1586 21.9933 80.8986 22.7133 80.8986 23.62C80.8986 24.5267 81.1586 25.2533 81.6786 25.8C82.1986 26.3333 82.8586 26.6 83.6586 26.6ZM103.186 18.24V29H100.226V27.72C99.8129 28.1867 99.3196 28.5467 98.7463 28.8C98.1729 29.04 97.5529 29.16 96.8863 29.16C95.4729 29.16 94.3529 28.7533 93.5263 27.94C92.6996 27.1267 92.2863 25.92 92.2863 24.32V18.24H95.4063V23.86C95.4063 25.5933 96.1329 26.46 97.5863 26.46C98.3329 26.46 98.9329 26.22 99.3863 25.74C99.8396 25.2467 100.066 24.52 100.066 23.56V18.24H103.186ZM111.277 29.16C110.13 29.16 109.097 28.9267 108.177 28.46C107.27 27.98 106.557 27.32 106.037 26.48C105.53 25.64 105.277 24.6867 105.277 23.62C105.277 22.5533 105.53 21.6 106.037 20.76C106.557 19.92 107.27 19.2667 108.177 18.8C109.097 18.32 110.13 18.08 111.277 18.08C112.41 18.08 113.397 18.32 114.237 18.8C115.09 19.2667 115.71 19.94 116.097 20.82L113.677 22.12C113.117 21.1333 112.31 20.64 111.257 20.64C110.443 20.64 109.77 20.9067 109.237 21.44C108.703 21.9733 108.437 22.7 108.437 23.62C108.437 24.54 108.703 25.2667 109.237 25.8C109.77 26.3333 110.443 26.6 111.257 26.6C112.323 26.6 113.13 26.1067 113.677 25.12L116.097 26.44C115.71 27.2933 115.09 27.96 114.237 28.44C113.397 28.92 112.41 29.16 111.277 29.16ZM122.233 18.08C123.9 18.08 125.18 18.48 126.073 19.28C126.966 20.0667 127.413 21.26 127.413 22.86V29H124.493V27.66C123.906 28.66 122.813 29.16 121.213 29.16C120.386 29.16 119.666 29.02 119.053 28.74C118.453 28.46 117.993 28.0733 117.673 27.58C117.353 27.0867 117.193 26.5267 117.193 25.9C117.193 24.9 117.566 24.1133 118.313 23.54C119.073 22.9667 120.24 22.68 121.813 22.68H124.293C124.293 22 124.086 21.48 123.673 21.12C123.26 20.7467 122.64 20.56 121.813 20.56C121.24 20.56 120.673 20.6533 120.113 20.84C119.566 21.0133 119.1 21.2533 118.713 21.56L117.593 19.38C118.18 18.9667 118.88 18.6467 119.693 18.42C120.52 18.1933 121.366 18.08 122.233 18.08ZM121.993 27.06C122.526 27.06 123 26.94 123.413 26.7C123.826 26.4467 124.12 26.08 124.293 25.6V24.5H122.153C120.873 24.5 120.233 24.92 120.233 25.76C120.233 26.16 120.386 26.48 120.693 26.72C121.013 26.9467 121.446 27.06 121.993 27.06ZM137.177 28.48C136.87 28.7067 136.49 28.88 136.037 29C135.597 29.1067 135.13 29.16 134.637 29.16C133.357 29.16 132.364 28.8333 131.657 28.18C130.964 27.5267 130.617 26.5667 130.617 25.3V20.88H128.957V18.48H130.617V15.86H133.737V18.48H136.417V20.88H133.737V25.26C133.737 25.7133 133.85 26.0667 134.077 26.32C134.317 26.56 134.65 26.68 135.077 26.68C135.57 26.68 135.99 26.5467 136.337 26.28L137.177 28.48ZM138.928 18.24H142.048V29H138.928V18.24ZM140.488 16.74C139.915 16.74 139.448 16.5733 139.088 16.24C138.728 15.9067 138.548 15.4933 138.548 15C138.548 14.5067 138.728 14.0933 139.088 13.76C139.448 13.4267 139.915 13.26 140.488 13.26C141.062 13.26 141.528 13.42 141.888 13.74C142.248 14.06 142.428 14.46 142.428 14.94C142.428 15.46 142.248 15.8933 141.888 16.24C141.528 16.5733 141.062 16.74 140.488 16.74ZM150.064 29.16C148.931 29.16 147.911 28.9267 147.004 28.46C146.111 27.98 145.411 27.32 144.904 26.48C144.397 25.64 144.144 24.6867 144.144 23.62C144.144 22.5533 144.397 21.6 144.904 20.76C145.411 19.92 146.111 19.2667 147.004 18.8C147.911 18.32 148.931 18.08 150.064 18.08C151.197 18.08 152.211 18.32 153.104 18.8C153.997 19.2667 154.697 19.92 155.204 20.76C155.711 21.6 155.964 22.5533 155.964 23.62C155.964 24.6867 155.711 25.64 155.204 26.48C154.697 27.32 153.997 27.98 153.104 28.46C152.211 28.9267 151.197 29.16 150.064 29.16ZM150.064 26.6C150.864 26.6 151.517 26.3333 152.024 25.8C152.544 25.2533 152.804 24.5267 152.804 23.62C152.804 22.7133 152.544 21.9933 152.024 21.46C151.517 20.9133 150.864 20.64 150.064 20.64C149.264 20.64 148.604 20.9133 148.084 21.46C147.564 21.9933 147.304 22.7133 147.304 23.62C147.304 24.5267 147.564 25.2533 148.084 25.8C148.604 26.3333 149.264 26.6 150.064 26.6ZM164.589 18.08C165.923 18.08 166.996 18.48 167.809 19.28C168.636 20.08 169.049 21.2667 169.049 22.84V29H165.929V23.32C165.929 22.4667 165.743 21.8333 165.369 21.42C164.996 20.9933 164.456 20.78 163.749 20.78C162.963 20.78 162.336 21.0267 161.869 21.52C161.403 22 161.169 22.72 161.169 23.68V29H158.049V18.24H161.029V19.5C161.443 19.0467 161.956 18.7 162.569 18.46C163.183 18.2067 163.856 18.08 164.589 18.08Z" fill="black"/>
</svg>
