<svg width="68" height="68" viewBox="0 0 68 68" fill="none" xmlns="http://www.w3.org/2000/svg">
<circle cx="33.9968" cy="33.9968" r="33.9968" fill="white"/>
<path d="M25.3524 13.1929H42.9627C49.6714 13.1929 55.1223 18.6437 55.1223 25.3524V42.9627C55.1223 46.1876 53.8412 49.2805 51.5608 51.5608C49.2805 53.8412 46.1876 55.1223 42.9627 55.1223H25.3524C18.6437 55.1223 13.1929 49.6714 13.1929 42.9627V25.3524C13.1929 22.1275 14.474 19.0347 16.7543 16.7543C19.0347 14.474 22.1275 13.1929 25.3524 13.1929ZM24.9331 17.3858C22.9314 17.3858 21.0118 18.181 19.5964 19.5964C18.181 21.0118 17.3858 22.9314 17.3858 24.9331V43.382C17.3858 47.554 20.7611 50.9293 24.9331 50.9293H43.382C45.3837 50.9293 47.3034 50.1342 48.7188 48.7188C50.1342 47.3034 50.9293 45.3837 50.9293 43.382V24.9331C50.9293 20.7611 47.554 17.3858 43.382 17.3858H24.9331ZM45.164 20.5305C45.8591 20.5305 46.5256 20.8066 47.0171 21.2981C47.5085 21.7895 47.7846 22.4561 47.7846 23.1511C47.7846 23.8461 47.5085 24.5127 47.0171 25.0041C46.5256 25.4956 45.8591 25.7717 45.164 25.7717C44.469 25.7717 43.8024 25.4956 43.311 25.0041C42.8195 24.5127 42.5434 23.8461 42.5434 23.1511C42.5434 22.4561 42.8195 21.7895 43.311 21.2981C43.8024 20.8066 44.469 20.5305 45.164 20.5305ZM34.1576 23.6752C36.9377 23.6752 39.6039 24.7796 41.5697 26.7454C43.5355 28.7112 44.6399 31.3775 44.6399 34.1576C44.6399 36.9377 43.5355 39.6039 41.5697 41.5697C39.6039 43.5355 36.9377 44.6399 34.1576 44.6399C31.3775 44.6399 28.7112 43.5355 26.7454 41.5697C24.7796 39.6039 23.6752 36.9377 23.6752 34.1576C23.6752 31.3775 24.7796 28.7112 26.7454 26.7454C28.7112 24.7796 31.3775 23.6752 34.1576 23.6752ZM34.1576 27.8682C32.4895 27.8682 30.8898 28.5308 29.7103 29.7103C28.5308 30.8898 27.8682 32.4895 27.8682 34.1576C27.8682 35.8256 28.5308 37.4254 29.7103 38.6048C30.8898 39.7843 32.4895 40.447 34.1576 40.447C35.8256 40.447 37.4254 39.7843 38.6048 38.6048C39.7843 37.4254 40.447 35.8256 40.447 34.1576C40.447 32.4895 39.7843 30.8898 38.6048 29.7103C37.4254 28.5308 35.8256 27.8682 34.1576 27.8682Z" fill="#444C54"/>
</svg>
