<svg width="97" height="97" viewBox="0 0 97 97" fill="none" xmlns="http://www.w3.org/2000/svg">
<path d="M48.487 23.6148C34.716 23.6148 23.6022 34.7288 23.6022 48.5C23.6022 62.2712 34.716 73.3852 48.487 73.3852C62.2579 73.3852 73.3717 62.2712 73.3717 48.5C73.3717 34.7288 62.2579 23.6148 48.487 23.6148ZM48.487 64.6736C39.5814 64.6736 32.3137 57.4058 32.3137 48.5C32.3137 39.5942 39.5814 32.3264 48.487 32.3264C57.3926 32.3264 64.6602 39.5942 64.6602 48.5C64.6602 57.4058 57.3926 64.6736 48.487 64.6736ZM74.3909 16.796C71.1756 16.796 68.5792 19.3925 68.5792 22.6078C68.5792 25.8231 71.1756 28.4196 74.3909 28.4196C77.6061 28.4196 80.2026 25.8352 80.2026 22.6078C80.2035 21.8443 80.0538 21.0881 79.7621 20.3825C79.4704 19.677 79.0423 19.0359 78.5025 18.4961C77.9626 17.9562 77.3216 17.5281 76.616 17.2364C75.9105 16.9447 75.1543 16.795 74.3909 16.796V16.796ZM96.9946 48.5C96.9946 41.8025 97.0553 35.1656 96.6791 28.4802C96.303 20.715 94.5316 13.8233 88.8534 8.14498C83.163 2.45451 76.2836 0.695201 68.5185 0.319072C61.8211 -0.0570572 55.1844 0.00360895 48.4991 0.00360895C41.8017 0.00360895 35.165 -0.0570572 28.4797 0.319072C20.7146 0.695201 13.8231 2.46665 8.14483 8.14498C2.45447 13.8355 0.695188 20.715 0.319066 28.4802C-0.0570562 35.1777 0.00360888 41.8146 0.00360888 48.5C0.00360888 55.1854 -0.0570562 61.8344 0.319066 68.5198C0.695188 76.285 2.4666 83.1767 8.14483 88.855C13.8352 94.5455 20.7146 96.3048 28.4797 96.6809C35.1771 97.0571 41.8138 96.9964 48.4991 96.9964C55.1965 96.9964 61.8332 97.0571 68.5185 96.6809C76.2836 96.3048 83.1751 94.5334 88.8534 88.855C94.5437 83.1645 96.303 76.285 96.6791 68.5198C97.0674 61.8344 96.9946 55.1975 96.9946 48.5V48.5ZM86.3176 77.1101C85.4319 79.3183 84.3642 80.9684 82.6534 82.6671C80.9427 84.3779 79.3047 85.4456 77.0965 86.3313C70.7146 88.8672 55.5605 88.2969 48.487 88.2969C41.4134 88.2969 26.2472 88.8672 19.8653 86.3434C17.6571 85.4577 16.007 84.39 14.3084 82.6792C12.5976 80.9684 11.5299 79.3305 10.6442 77.1222C8.12057 70.728 8.69082 55.5737 8.69082 48.5C8.69082 41.4263 8.12057 26.2598 10.6442 19.8778C11.5299 17.6695 12.5976 16.0194 14.3084 14.3208C16.0191 12.6221 17.6571 11.5423 19.8653 10.6566C26.2472 8.13285 41.4134 8.70311 48.487 8.70311C55.5605 8.70311 70.7267 8.13285 77.1086 10.6566C79.3169 11.5423 80.9669 12.61 82.6655 14.3208C84.3763 16.0316 85.444 17.6695 86.3297 19.8778C88.8534 26.2598 88.2831 41.4263 88.2831 48.5C88.2831 55.5737 88.8534 70.728 86.3176 77.1101Z" fill="#444C54"/>
</svg>
